You are viewing a plain text version of this content. The canonical link for it is here.
Posted to builds@cassandra.apache.org by Apache Jenkins Server <je...@builds.apache.org> on 2023/06/27 09:40:13 UTC

Build complete: Cassandra-3.11 #467 [UNSTABLE] 55dc5b43f1d5f270cd9136f68bcf17cf9e083c05

-------------------------------------------------------------------------------
Build Cassandra-3.11 #467 Still Unstable
URL: https://ci-cassandra.apache.org/job/Cassandra-3.11/467/
-------------------------------------------------------------------------------
Changes:
[Stefan Miklosovic] Pass taskId from CompactionTask to system.compaction_history


-------------------------------------------------------------------------------
Failed Tests:
18 tests failed.
FAILED:  dtest-large-novnode.replace_address_test.TestReplaceAddress.test_replace_stopped_node
FAILED:  dtest-large.materialized_views_test.TestMaterializedViews.test_throttled_partition_update
FAILED:  dtest-large.replace_address_test.TestReplaceAddress.test_replace_stopped_node
FAILED:  dtest-large.replace_address_test.TestReplaceAddress.test_replace_stopped_node_same_address
FAILED:  dtest-novnode.disk_balance_test.TestDiskBalance.test_disk_balance_after_boundary_change_stcs
FAILED:  dtest-upgrade.upgrade_tests.thrift_upgrade_test.TestUpgradeSuperColumnsThrough.test_sparse_supercolumn
FAILED:  dtest.repair_tests.incremental_repair_test.TestIncRepair.test_sstable_marking
FAILED:  dtest-large.replace_address_test.TestReplaceAddress.test_replace_shutdown_node
FAILED:  org.apache.cassandra.db.compaction.LongLeveledCompactionStrategyCQLTest.stressTestCompactionStrategyManager
FAILED:  dtest-large-novnode.replace_address_test.TestReplaceAddress.test_replace_shutdown_node
FAILED:  org.apache.cassandra.distributed.upgrade.DropCompactStorageWithClusteringAndValueColumnTest.testDropCompactWithClusteringAndValueColumn
FAILED:  org.apache.cassandra.distributed.upgrade.DropCompactStorageWithDeletesAndWritesTest.testDropCompactWithClusteringAndValueColumnWithDeletesAndWrites
FAILED:  org.apache.cassandra.distributed.upgrade.MixedModeReadTest.mixedModeReadColumnSubsetDigestCheck
FAILED:  dtest.repair_tests.repair_test.TestRepair.test_dead_sync_initiator
FAILED:  org.apache.cassandra.distributed.test.ReprepareOldBehaviourTest.testReprepareMixedVersionWithoutReset
FAILED:  dtest-offheap.repair_tests.repair_test.TestRepair.test_dead_sync_initiator
FAILED:  dtest-novnode.repair_tests.repair_test.TestRepair.test_dead_sync_initiator
FAILED:  dtest-upgrade.upgrade_internal_auth_test.TestAuthUpgrade.test_upgrade_legacy_table

-------------------------------------------------------------------------------
For complete test report and logs see https://nightlies.apache.org/cassandra/Cassandra-3.11/467/