You are viewing a plain text version of this content. The canonical link for it is here.
Posted to notifications@maven.apache.org by Apache Jenkins Server <je...@builds.apache.org> on 2019/06/06 10:52:17 UTC

Build unstable in Jenkins: Maven TLP » maven-doxia-sitetools » htmlunit-2.24 #2

See https://builds.apache.org/job/maven-box/job/maven-doxia-sitetools/job/htmlunit-2.24/2/

No changes.

8 tests failed.
FAILED:  org.apache.maven.doxia.siterenderer.DefaultSiteRendererTest.windows-jdk11 / Build windows-jdk11 / testRender

Error Message:
null

Stack Trace:
junit.framework.AssertionFailedError
	at junit.framework.Assert.fail(Assert.java:47)
	at junit.framework.Assert.assertTrue(Assert.java:20)
	at junit.framework.Assert.assertTrue(Assert.java:27)
	at org.apache.maven.doxia.siterenderer.EntitiesVerifier.verify(EntitiesVerifier.java:52)
	at org.apache.maven.doxia.siterenderer.DefaultSiteRendererTest.verifyEntitiesPage(DefaultSiteRendererTest.java:392)
	at org.apache.maven.doxia.siterenderer.DefaultSiteRendererTest.testRender(DefaultSiteRendererTest.java:180)


FAILED:  org.apache.maven.doxia.siterenderer.DefaultSiteRendererTest.linux-jdk11 / Build linux-jdk11 / testRender

Error Message:
null

Stack Trace:
junit.framework.AssertionFailedError
	at junit.framework.Assert.fail(Assert.java:47)
	at junit.framework.Assert.assertTrue(Assert.java:20)
	at junit.framework.Assert.assertTrue(Assert.java:27)
	at org.apache.maven.doxia.siterenderer.EntitiesVerifier.verify(EntitiesVerifier.java:52)
	at org.apache.maven.doxia.siterenderer.DefaultSiteRendererTest.verifyEntitiesPage(DefaultSiteRendererTest.java:392)
	at org.apache.maven.doxia.siterenderer.DefaultSiteRendererTest.testRender(DefaultSiteRendererTest.java:180)


FAILED:  org.apache.maven.doxia.siterenderer.DefaultSiteRendererTest.linux-jdk8 / Build linux-jdk8 / testRender

Error Message:
null

Stack Trace:
junit.framework.AssertionFailedError
	at junit.framework.Assert.fail(Assert.java:47)
	at junit.framework.Assert.assertTrue(Assert.java:20)
	at junit.framework.Assert.assertTrue(Assert.java:27)
	at org.apache.maven.doxia.siterenderer.EntitiesVerifier.verify(EntitiesVerifier.java:52)
	at org.apache.maven.doxia.siterenderer.DefaultSiteRendererTest.verifyEntitiesPage(DefaultSiteRendererTest.java:392)
	at org.apache.maven.doxia.siterenderer.DefaultSiteRendererTest.testRender(DefaultSiteRendererTest.java:180)


FAILED:  org.apache.maven.doxia.siterenderer.DefaultSiteRendererTest.windows-jdk8 / Build windows-jdk8 / testRender

Error Message:
null

Stack Trace:
junit.framework.AssertionFailedError
	at junit.framework.Assert.fail(Assert.java:47)
	at junit.framework.Assert.assertTrue(Assert.java:20)
	at junit.framework.Assert.assertTrue(Assert.java:27)
	at org.apache.maven.doxia.siterenderer.EntitiesVerifier.verify(EntitiesVerifier.java:52)
	at org.apache.maven.doxia.siterenderer.DefaultSiteRendererTest.verifyEntitiesPage(DefaultSiteRendererTest.java:392)
	at org.apache.maven.doxia.siterenderer.DefaultSiteRendererTest.testRender(DefaultSiteRendererTest.java:180)


FAILED:  org.apache.maven.doxia.siterenderer.DefaultSiteRendererTest.linux-jdk7 / Build linux-jdk7 / testRender

Error Message:
null

Stack Trace:
junit.framework.AssertionFailedError
	at junit.framework.Assert.fail(Assert.java:47)
	at junit.framework.Assert.assertTrue(Assert.java:20)
	at junit.framework.Assert.assertTrue(Assert.java:27)
	at org.apache.maven.doxia.siterenderer.EntitiesVerifier.verify(EntitiesVerifier.java:52)
	at org.apache.maven.doxia.siterenderer.DefaultSiteRendererTest.verifyEntitiesPage(DefaultSiteRendererTest.java:392)
	at org.apache.maven.doxia.siterenderer.DefaultSiteRendererTest.testRender(DefaultSiteRendererTest.java:180)


FAILED:  org.apache.maven.doxia.siterenderer.DefaultSiteRendererTest.windows-jdk7 / Build windows-jdk7 / testRender

Error Message:
null

Stack Trace:
junit.framework.AssertionFailedError
	at junit.framework.Assert.fail(Assert.java:47)
	at junit.framework.Assert.assertTrue(Assert.java:20)
	at junit.framework.Assert.assertTrue(Assert.java:27)
	at org.apache.maven.doxia.siterenderer.EntitiesVerifier.verify(EntitiesVerifier.java:52)
	at org.apache.maven.doxia.siterenderer.DefaultSiteRendererTest.verifyEntitiesPage(DefaultSiteRendererTest.java:392)
	at org.apache.maven.doxia.siterenderer.DefaultSiteRendererTest.testRender(DefaultSiteRendererTest.java:180)


FAILED:  org.apache.maven.doxia.siterenderer.DefaultSiteRendererTest.windows-jdk12 / Build windows-jdk12 / testRender

Error Message:
null

Stack Trace:
junit.framework.AssertionFailedError
	at junit.framework.Assert.fail(Assert.java:47)
	at junit.framework.Assert.assertTrue(Assert.java:20)
	at junit.framework.Assert.assertTrue(Assert.java:27)
	at org.apache.maven.doxia.siterenderer.EntitiesVerifier.verify(EntitiesVerifier.java:52)
	at org.apache.maven.doxia.siterenderer.DefaultSiteRendererTest.verifyEntitiesPage(DefaultSiteRendererTest.java:392)
	at org.apache.maven.doxia.siterenderer.DefaultSiteRendererTest.testRender(DefaultSiteRendererTest.java:180)


FAILED:  org.apache.maven.doxia.siterenderer.DefaultSiteRendererTest.linux-jdk12 / Build linux-jdk12 / testRender

Error Message:
null

Stack Trace:
junit.framework.AssertionFailedError
	at junit.framework.Assert.fail(Assert.java:47)
	at junit.framework.Assert.assertTrue(Assert.java:20)
	at junit.framework.Assert.assertTrue(Assert.java:27)
	at org.apache.maven.doxia.siterenderer.EntitiesVerifier.verify(EntitiesVerifier.java:52)
	at org.apache.maven.doxia.siterenderer.DefaultSiteRendererTest.verifyEntitiesPage(DefaultSiteRendererTest.java:392)
	at org.apache.maven.doxia.siterenderer.DefaultSiteRendererTest.testRender(DefaultSiteRendererTest.java:180)




Build log:
[...truncated 28593 lines...]
[INFO] Downloading from central: https://repo.maven.apache.org/maven2/com/vladsch/flexmark/flexmark-ext-autolink/0.42.8/flexmark-ext-autolink-0.42.8.jar
[INFO] Downloaded from central: https://repo.maven.apache.org/maven2/com/vladsch/flexmark/flexmark-ext-admonition/0.42.8/flexmark-ext-admonition-0.42.8.jar (34 kB at 57 kB/s)
[INFO] Downloading from central: https://repo.maven.apache.org/maven2/com/vladsch/flexmark/flexmark-ext-definition/0.42.8/flexmark-ext-definition-0.42.8.jar
[INFO] Downloaded from central: https://repo.maven.apache.org/maven2/com/vladsch/flexmark/flexmark-ext-attributes/0.42.8/flexmark-ext-attributes-0.42.8.jar (36 kB at 58 kB/s)
[INFO] Downloading from central: https://repo.maven.apache.org/maven2/com/vladsch/flexmark/flexmark-ext-emoji/0.42.8/flexmark-ext-emoji-0.42.8.jar
[INFO] Downloaded from central: https://repo.maven.apache.org/maven2/com/vladsch/flexmark/flexmark-ext-anchorlink/0.42.8/flexmark-ext-anchorlink-0.42.8.jar (17 kB at 26 kB/s)
[INFO] Downloading from central: https://repo.maven.apache.org/maven2/com/vladsch/flexmark/flexmark-ext-enumerated-reference/0.42.8/flexmark-ext-enumerated-reference-0.42.8.jar
[INFO] Downloaded from central: https://repo.maven.apache.org/maven2/com/vladsch/flexmark/flexmark-ext-autolink/0.42.8/flexmark-ext-autolink-0.42.8.jar (9.4 kB at 15 kB/s)
[INFO] Downloading from central: https://repo.maven.apache.org/maven2/com/vladsch/flexmark/flexmark-ext-escaped-character/0.42.8/flexmark-ext-escaped-character-0.42.8.jar
[INFO] Downloaded from central: https://repo.maven.apache.org/maven2/com/vladsch/flexmark/flexmark-ext-aside/0.42.8/flexmark-ext-aside-0.42.8.jar (16 kB at 25 kB/s)
[INFO] Downloading from central: https://repo.maven.apache.org/maven2/com/vladsch/flexmark/flexmark-ext-footnotes/0.42.8/flexmark-ext-footnotes-0.42.8.jar
[INFO] Downloaded from central: https://repo.maven.apache.org/maven2/com/vladsch/flexmark/flexmark-ext-escaped-character/0.42.8/flexmark-ext-escaped-character-0.42.8.jar (13 kB at 18 kB/s)
[INFO] Downloading from central: https://repo.maven.apache.org/maven2/com/vladsch/flexmark/flexmark-ext-gfm-issues/0.42.8/flexmark-ext-gfm-issues-0.42.8.jar
[INFO] Downloaded from central: https://repo.maven.apache.org/maven2/com/vladsch/flexmark/flexmark-ext-gfm-issues/0.42.8/flexmark-ext-gfm-issues-0.42.8.jar (16 kB at 21 kB/s)
[INFO] Downloading from central: https://repo.maven.apache.org/maven2/com/vladsch/flexmark/flexmark-ext-gfm-strikethrough/0.42.8/flexmark-ext-gfm-strikethrough-0.42.8.jar
[INFO] Downloaded from central: https://repo.maven.apache.org/maven2/com/vladsch/flexmark/flexmark-ext-emoji/0.42.8/flexmark-ext-emoji-0.42.8.jar (73 kB at 98 kB/s)
[INFO] Downloading from central: https://repo.maven.apache.org/maven2/com/vladsch/flexmark/flexmark-ext-gfm-tables/0.42.8/flexmark-ext-gfm-tables-0.42.8.jar
[INFO] Downloaded from central: https://repo.maven.apache.org/maven2/com/vladsch/flexmark/flexmark-ext-enumerated-reference/0.42.8/flexmark-ext-enumerated-reference-0.42.8.jar (66 kB at 87 kB/s)
[INFO] Downloading from central: https://repo.maven.apache.org/maven2/com/vladsch/flexmark/flexmark-ext-gfm-tasklist/0.42.8/flexmark-ext-gfm-tasklist-0.42.8.jar
[INFO] Downloaded from central: https://repo.maven.apache.org/maven2/com/vladsch/flexmark/flexmark-ext-definition/0.42.8/flexmark-ext-definition-0.42.8.jar (40 kB at 50 kB/s)
[INFO] Downloading from central: https://repo.maven.apache.org/maven2/com/vladsch/flexmark/flexmark-ext-gfm-users/0.42.8/flexmark-ext-gfm-users-0.42.8.jar
[INFO] Downloaded from central: https://repo.maven.apache.org/maven2/com/vladsch/flexmark/flexmark-ext-gfm-strikethrough/0.42.8/flexmark-ext-gfm-strikethrough-0.42.8.jar (29 kB at 36 kB/s)
[INFO] Downloading from central: https://repo.maven.apache.org/maven2/com/vladsch/flexmark/flexmark-ext-gitlab/0.42.8/flexmark-ext-gitlab-0.42.8.jar
[INFO] Downloaded from central: https://repo.maven.apache.org/maven2/com/vladsch/flexmark/flexmark-ext-gfm-users/0.42.8/flexmark-ext-gfm-users-0.42.8.jar (16 kB at 19 kB/s)
[INFO] Downloading from central: https://repo.maven.apache.org/maven2/com/vladsch/flexmark/flexmark-ext-jekyll-front-matter/0.42.8/flexmark-ext-jekyll-front-matter-0.42.8.jar
[INFO] Downloaded from central: https://repo.maven.apache.org/maven2/com/vladsch/flexmark/flexmark-ext-footnotes/0.42.8/flexmark-ext-footnotes-0.42.8.jar (41 kB at 48 kB/s)
[INFO] Downloading from central: https://repo.maven.apache.org/maven2/com/vladsch/flexmark/flexmark-ext-jekyll-tag/0.42.8/flexmark-ext-jekyll-tag-0.42.8.jar
[INFO] Downloaded from central: https://repo.maven.apache.org/maven2/com/vladsch/flexmark/flexmark-ext-jekyll-front-matter/0.42.8/flexmark-ext-jekyll-front-matter-0.42.8.jar (18 kB at 20 kB/s)
[INFO] Downloading from central: https://repo.maven.apache.org/maven2/com/vladsch/flexmark/flexmark-ext-media-tags/0.42.8/flexmark-ext-media-tags-0.42.8.jar
[INFO] Downloaded from central: https://repo.maven.apache.org/maven2/com/vladsch/flexmark/flexmark-ext-gitlab/0.42.8/flexmark-ext-gitlab-0.42.8.jar (42 kB at 46 kB/s)
[INFO] Downloading from central: https://repo.maven.apache.org/maven2/com/vladsch/flexmark/flexmark-ext-macros/0.42.8/flexmark-ext-macros-0.42.8.jar
[INFO] Downloaded from central: https://repo.maven.apache.org/maven2/com/vladsch/flexmark/flexmark-ext-gfm-tables/0.42.8/flexmark-ext-gfm-tables-0.42.8.jar (33 kB at 35 kB/s)
[INFO] Downloading from central: https://repo.maven.apache.org/maven2/com/vladsch/flexmark/flexmark-ext-ins/0.42.8/flexmark-ext-ins-0.42.8.jar
[INFO] Downloaded from central: https://repo.maven.apache.org/maven2/com/vladsch/flexmark/flexmark-ext-jekyll-tag/0.42.8/flexmark-ext-jekyll-tag-0.42.8.jar (21 kB at 21 kB/s)
[INFO] Downloading from central: https://repo.maven.apache.org/maven2/com/vladsch/flexmark/flexmark-ext-xwiki-macros/0.42.8/flexmark-ext-xwiki-macros-0.42.8.jar
[INFO] Downloaded from central: https://repo.maven.apache.org/maven2/com/vladsch/flexmark/flexmark-ext-ins/0.42.8/flexmark-ext-ins-0.42.8.jar (13 kB at 13 kB/s)
[INFO] Downloading from central: https://repo.maven.apache.org/maven2/com/vladsch/flexmark/flexmark-ext-superscript/0.42.8/flexmark-ext-superscript-0.42.8.jar
[INFO] Downloaded from central: https://repo.maven.apache.org/maven2/com/vladsch/flexmark/flexmark-ext-media-tags/0.42.8/flexmark-ext-media-tags-0.42.8.jar (25 kB at 25 kB/s)
[INFO] Downloading from central: https://repo.maven.apache.org/maven2/com/vladsch/flexmark/flexmark-ext-tables/0.42.8/flexmark-ext-tables-0.42.8.jar
[INFO] Downloaded from central: https://repo.maven.apache.org/maven2/com/vladsch/flexmark/flexmark-ext-gfm-tasklist/0.42.8/flexmark-ext-gfm-tasklist-0.42.8.jar (28 kB at 27 kB/s)
[INFO] Downloading from central: https://repo.maven.apache.org/maven2/com/vladsch/flexmark/flexmark-ext-toc/0.42.8/flexmark-ext-toc-0.42.8.jar
[INFO] Downloaded from central: https://repo.maven.apache.org/maven2/com/vladsch/flexmark/flexmark-ext-macros/0.42.8/flexmark-ext-macros-0.42.8.jar (35 kB at 33 kB/s)
[INFO] Downloading from central: https://repo.maven.apache.org/maven2/com/vladsch/flexmark/flexmark-ext-typographic/0.42.8/flexmark-ext-typographic-0.42.8.jar
[INFO] Downloaded from central: https://repo.maven.apache.org/maven2/com/vladsch/flexmark/flexmark-ext-xwiki-macros/0.42.8/flexmark-ext-xwiki-macros-0.42.8.jar (31 kB at 28 kB/s)
[INFO] Downloaded from central: https://repo.maven.apache.org/maven2/com/vladsch/flexmark/flexmark-ext-typographic/0.42.8/flexmark-ext-typographic-0.42.8.jar (22 kB at 20 kB/s)
[INFO] Downloading from central: https://repo.maven.apache.org/maven2/com/vladsch/flexmark/flexmark-ext-yaml-front-matter/0.42.8/flexmark-ext-yaml-front-matter-0.42.8.jar
[INFO] Downloading from central: https://repo.maven.apache.org/maven2/com/vladsch/flexmark/flexmark-ext-wikilink/0.42.8/flexmark-ext-wikilink-0.42.8.jar
[INFO] Downloaded from central: https://repo.maven.apache.org/maven2/com/vladsch/flexmark/flexmark-ext-superscript/0.42.8/flexmark-ext-superscript-0.42.8.jar (13 kB at 12 kB/s)
[INFO] Downloading from central: https://repo.maven.apache.org/maven2/com/vladsch/flexmark/flexmark-ext-youtube-embedded/0.42.8/flexmark-ext-youtube-embedded-0.42.8.jar
[INFO] Downloaded from central: https://repo.maven.apache.org/maven2/com/vladsch/flexmark/flexmark-ext-tables/0.42.8/flexmark-ext-tables-0.42.8.jar (76 kB at 66 kB/s)
[INFO] Downloading from central: https://repo.maven.apache.org/maven2/com/vladsch/flexmark/flexmark-formatter/0.42.8/flexmark-formatter-0.42.8.jar
[INFO] Downloaded from central: https://repo.maven.apache.org/maven2/com/vladsch/flexmark/flexmark-ext-wikilink/0.42.8/flexmark-ext-wikilink-0.42.8.jar (26 kB at 22 kB/s)
[INFO] Downloading from central: https://repo.maven.apache.org/maven2/com/vladsch/flexmark/flexmark-html-parser/0.42.8/flexmark-html-parser-0.42.8.jar
[INFO] Downloaded from central: https://repo.maven.apache.org/maven2/com/vladsch/flexmark/flexmark-ext-toc/0.42.8/flexmark-ext-toc-0.42.8.jar (91 kB at 77 kB/s)
[INFO] Downloading from central: https://repo.maven.apache.org/maven2/com/vladsch/flexmark/flexmark-jira-converter/0.42.8/flexmark-jira-converter-0.42.8.jar
[INFO] Downloaded from central: https://repo.maven.apache.org/maven2/com/vladsch/flexmark/flexmark-formatter/0.42.8/flexmark-formatter-0.42.8.jar (97 kB at 80 kB/s)
[INFO] Downloading from central: https://repo.maven.apache.org/maven2/com/vladsch/flexmark/flexmark-profile-pegdown/0.42.8/flexmark-profile-pegdown-0.42.8.jar
[INFO] Downloaded from central: https://repo.maven.apache.org/maven2/com/vladsch/flexmark/flexmark-ext-yaml-front-matter/0.42.8/flexmark-ext-yaml-front-matter-0.42.8.jar (18 kB at 15 kB/s)
[INFO] Downloading from central: https://repo.maven.apache.org/maven2/com/vladsch/flexmark/flexmark-util/0.42.8/flexmark-util-0.42.8.jar
[INFO] Downloaded from central: https://repo.maven.apache.org/maven2/com/vladsch/flexmark/flexmark-jira-converter/0.42.8/flexmark-jira-converter-0.42.8.jar (40 kB at 32 kB/s)
[INFO] Downloading from central: https://repo.maven.apache.org/maven2/com/vladsch/flexmark/flexmark-youtrack-converter/0.42.8/flexmark-youtrack-converter-0.42.8.jar
[INFO] Downloaded from central: https://repo.maven.apache.org/maven2/com/vladsch/flexmark/flexmark-ext-youtube-embedded/0.42.8/flexmark-ext-youtube-embedded-0.42.8.jar (13 kB at 10 kB/s)
[INFO] Downloading from central: https://repo.maven.apache.org/maven2/xalan/xalan/2.7.0/xalan-2.7.0.jar
[INFO] Downloaded from central: https://repo.maven.apache.org/maven2/com/vladsch/flexmark/flexmark-profile-pegdown/0.42.8/flexmark-profile-pegdown-0.42.8.jar (6.3 kB at 4.7 kB/s)
[INFO] Downloaded from central: https://repo.maven.apache.org/maven2/com/vladsch/flexmark/flexmark-html-parser/0.42.8/flexmark-html-parser-0.42.8.jar (44 kB at 33 kB/s)
[INFO] Downloaded from central: https://repo.maven.apache.org/maven2/xalan/xalan/2.7.0/xalan-2.7.0.jar (2.7 MB at 2.0 MB/s)
[INFO] Downloaded from central: https://repo.maven.apache.org/maven2/com/vladsch/flexmark/flexmark-util/0.42.8/flexmark-util-0.42.8.jar (385 kB at 271 kB/s)
[INFO] Downloaded from central: https://repo.maven.apache.org/maven2/com/vladsch/flexmark/flexmark-youtrack-converter/0.42.8/flexmark-youtrack-converter-0.42.8.jar (41 kB at 29 kB/s)
[INFO] 
[INFO] --- maven-clean-plugin:3.1.0:clean (default-clean) @ doxia-doc-renderer ---
[INFO] 
[INFO] --- maven-enforcer-plugin:1.4.1:enforce (enforce-maven-version) @ doxia-doc-renderer ---
[INFO] 
[INFO] --- maven-enforcer-plugin:1.4.1:enforce (enforce-bytecode-version) @ doxia-doc-renderer ---
[INFO] 
[INFO] --- maven-enforcer-plugin:1.4.1:enforce (ban-known-bad-maven-versions) @ doxia-doc-renderer ---
[INFO] 
[INFO] --- apache-rat-plugin:0.12:check (rat-check) @ doxia-doc-renderer ---
[INFO] Enabled default license matchers.
[INFO] Will parse SCM ignores for exclusions...
[INFO] Finished adding exclusions from SCM ignore files.
[INFO] 61 implicit excludes (use -debug for more details).
[INFO] Exclude: src/test/resources/site/confluence/confluence/*.confluence
[INFO] Exclude: src/test/resources/org/apache/maven/doxia/siterenderer/velocity-toolmanager.vm
[INFO] Exclude: src/test/resources/org/apache/maven/doxia/siterenderer/velocity-toolmanager.expected.txt
[INFO] Exclude: src/test/resources/dtd/xhtml-*.ent
[INFO] Exclude: src/test/resources/dtd/xhtml1-transitional.dtd
[INFO] Exclude: src/test/resources/xhtml-lat1.ent
[INFO] Exclude: .repository/**
[INFO] Exclude: .maven/spy.log
[INFO] Exclude: dependency-reduced-pom.xml
[INFO] Exclude: .java-version
[INFO] 32 resources included (use -debug for more details)
[INFO] Rat check: Summary over all files. Unapproved: 0, unknown: 0, generated: 0, approved: 28 licenses.
[INFO] 
[INFO] --- maven-remote-resources-plugin:1.5:process (process-resource-bundles) @ doxia-doc-renderer ---
[INFO] 
[INFO] --- maven-resources-plugin:3.1.0:resources (default-resources) @ doxia-doc-renderer ---
[INFO] Using 'UTF-8' encoding to copy filtered resources.
[INFO] Copying 1 resource
[INFO] skip non existing resourceDirectory /home/jenkins/jenkins-slave/workspace/en-doxia-sitetools_htmlunit-2.24/m/doxia-doc-renderer/target/generated-site/xsd
[INFO] Copying 3 resources
[INFO] 
[INFO] --- maven-compiler-plugin:3.7.0:compile (default-compile) @ doxia-doc-renderer ---
[INFO] Changes detected - recompiling the module!
[INFO] Compiling 14 source files to /home/jenkins/jenkins-slave/workspace/en-doxia-sitetools_htmlunit-2.24/m/doxia-doc-renderer/target/classes
[INFO] /home/jenkins/jenkins-slave/workspace/en-doxia-sitetools_htmlunit-2.24/m/doxia-doc-renderer/src/main/java/org/apache/maven/doxia/docrenderer/itext/AbstractITextRender.java: Some input files use or override a deprecated API.
[INFO] /home/jenkins/jenkins-slave/workspace/en-doxia-sitetools_htmlunit-2.24/m/doxia-doc-renderer/src/main/java/org/apache/maven/doxia/docrenderer/itext/AbstractITextRender.java: Recompile with -Xlint:deprecation for details.
[INFO] 
[INFO] --- plexus-component-metadata:1.7.1:generate-metadata (default) @ doxia-doc-renderer ---
[INFO] Discovered 4 component descriptors(s)
[INFO] 
[INFO] --- maven-resources-plugin:3.1.0:testResources (default-testResources) @ doxia-doc-renderer ---
[INFO] Using 'UTF-8' encoding to copy filtered resources.
[INFO] Copying 13 resources
[INFO] Copying 3 resources
[INFO] 
[INFO] --- maven-compiler-plugin:3.7.0:testCompile (default-testCompile) @ doxia-doc-renderer ---
[INFO] Changes detected - recompiling the module!
[INFO] Compiling 1 source file to /home/jenkins/jenkins-slave/workspace/en-doxia-sitetools_htmlunit-2.24/m/doxia-doc-renderer/target/test-classes
[INFO] 
[INFO] --- maven-surefire-plugin:2.22.0:test (default-test) @ doxia-doc-renderer ---
[INFO] 
[INFO] -------------------------------------------------------
[INFO]  T E S T S
[INFO] -------------------------------------------------------
[INFO] Running org.apache.maven.doxia.docrenderer.DocumentRendererTest
[withMaven] Publishers: Pipeline Graph Publisher: 8 ms, Invoker Publisher: 1 ms, Junit Publisher: 3908 ms, Concordion Publisher: 1 ms, Dependencies Fingerprint Publisher: 1254 ms, JGiven Publisher: 1 ms
[Pipeline] // withMaven
[Pipeline] cleanWs
[WS-CLEANUP] Deleting project workspace...
[WS-CLEANUP] Deferred wipeout is used...
[WS-CLEANUP] done
[Pipeline] }
[Pipeline] // stage
[Pipeline] }
[warn] No document root specified, local links will not be resolved correctly!
[Pipeline] // node
[Pipeline] }
[WARNING] [iText Sink] Modified invalid link: 'Frequently Asked Questions_How_to_export_in_PDF' to 'Frequently_Asked_Questions_How_to_export_in_PDF'
[WARNING] [iText Sink] Modified invalid link: 'Frequently Asked Questions_How_to_handle_style_in_the_APT_markup_language' to 'Frequently_Asked_Questions_How_to_handle_style_in_the_APT_markup_language'
[WARNING] [iText Sink] Modified invalid link: 'Frequently Asked Questions_Is_it_possible_to_create_a_book' to 'Frequently_Asked_Questions_Is_it_possible_to_create_a_book'
[WARNING] [iText Sink] Modified invalid link: 'Frequently Asked Questions_top' to 'Frequently_Asked_Questions_top'
[WARNING] [iText Sink] Modified invalid link: 'Frequently Asked Questions_How_to_export_in_PDF' to 'Frequently_Asked_Questions_How_to_export_in_PDF'
[WARNING] [iText Sink] Modified invalid link: 'Frequently Asked Questions_How_to_handle_style_in_the_APT_markup_language' to 'Frequently_Asked_Questions_How_to_handle_style_in_the_APT_markup_language'
[WARNING] [iText Sink] Modified invalid link: 'Frequently Asked Questions_Is_it_possible_to_create_a_book' to 'Frequently_Asked_Questions_Is_it_possible_to_create_a_book'
[WARNING] [iText Sink] Modified invalid link: 'Frequently Asked Questions_top' to 'Frequently_Asked_Questions_top'
[INFO] Tests run: 4, Failures: 0, Errors: 0, Skipped: 0, Time elapsed: 4.148 s - in org.apache.maven.doxia.docrenderer.DocumentRendererTest
[INFO] 
[INFO] Results:
[INFO] 
[INFO] Tests run: 4, Failures: 0, Errors: 0, Skipped: 0
[INFO] 
[INFO] 
[INFO] --- maven-jar-plugin:3.1.0:jar (default-jar) @ doxia-doc-renderer ---
[INFO] Building jar: /home/jenkins/jenkins-slave/workspace/en-doxia-sitetools_htmlunit-2.24/m/doxia-doc-renderer/target/doxia-doc-renderer-1.9-SNAPSHOT.jar
[INFO] 
[INFO] --- maven-site-plugin:3.7.1:attach-descriptor (attach-descriptor) @ doxia-doc-renderer ---
[INFO] Skipping because packaging 'jar' is not pom.
[INFO] 
[INFO] --- maven-checkstyle-plugin:3.0.0:check (checkstyle-check) @ doxia-doc-renderer ---
[INFO] 
[INFO] >>> clirr-maven-plugin:2.8:check (default) > compile @ doxia-doc-renderer >>>
[INFO] 
[INFO] --- maven-enforcer-plugin:1.4.1:enforce (enforce-maven-version) @ doxia-doc-renderer ---
[INFO] 
[INFO] --- maven-enforcer-plugin:1.4.1:enforce (enforce-bytecode-version) @ doxia-doc-renderer ---
[INFO] 
[INFO] --- maven-enforcer-plugin:1.4.1:enforce (ban-known-bad-maven-versions) @ doxia-doc-renderer ---
[INFO] 
[INFO] --- apache-rat-plugin:0.12:check (rat-check) @ doxia-doc-renderer ---
[INFO] Enabled default license matchers.
[INFO] Will parse SCM ignores for exclusions...
[INFO] Finished adding exclusions from SCM ignore files.
[INFO] 61 implicit excludes (use -debug for more details).
[INFO] Exclude: src/test/resources/site/confluence/confluence/*.confluence
[INFO] Exclude: src/test/resources/org/apache/maven/doxia/siterenderer/velocity-toolmanager.vm
[INFO] Exclude: src/test/resources/org/apache/maven/doxia/siterenderer/velocity-toolmanager.expected.txt
[INFO] Exclude: src/test/resources/dtd/xhtml-*.ent
[INFO] Exclude: src/test/resources/dtd/xhtml1-transitional.dtd
[INFO] Exclude: src/test/resources/xhtml-lat1.ent
[INFO] Exclude: .repository/**
[INFO] Exclude: .maven/spy.log
[INFO] Exclude: dependency-reduced-pom.xml
[INFO] Exclude: .java-version
[INFO] 32 resources included (use -debug for more details)
[INFO] Rat check: Summary over all files. Unapproved: 0, unknown: 0, generated: 0, approved: 28 licenses.
[INFO] 
[INFO] --- maven-remote-resources-plugin:1.5:process (process-resource-bundles) @ doxia-doc-renderer ---
[INFO] 
[INFO] --- maven-resources-plugin:3.1.0:resources (default-resources) @ doxia-doc-renderer ---
[INFO] Using 'UTF-8' encoding to copy filtered resources.
[INFO] Copying 1 resource
[INFO] skip non existing resourceDirectory /home/jenkins/jenkins-slave/workspace/en-doxia-sitetools_htmlunit-2.24/m/doxia-doc-renderer/target/generated-site/xsd
[INFO] Copying 3 resources
[INFO] Copying 3 resources
[INFO] 
[INFO] --- maven-compiler-plugin:3.7.0:compile (default-compile) @ doxia-doc-renderer ---
[INFO] Nothing to compile - all classes are up to date
[INFO] 
[INFO] <<< clirr-maven-plugin:2.8:check (default) < compile @ doxia-doc-renderer <<<
[INFO] 
[INFO] 
[INFO] --- clirr-maven-plugin:2.8:check (default) @ doxia-doc-renderer ---
[INFO] Skipping execution
[INFO] ------------------------------------------------------------------------
[INFO] Reactor Summary for Doxia Sitetools 1.9-SNAPSHOT:
[INFO] 
[INFO] Doxia Sitetools .................................... SUCCESS [ 36.437 s]
[INFO] Doxia Sitetools :: Decoration Model ................ SUCCESS [ 11.054 s]
[INFO] Doxia Sitetools :: Skin Model ...................... SUCCESS [  0.680 s]
[INFO] Doxia Sitetools :: Integration Tools ............... SUCCESS [  5.599 s]
[INFO] Doxia Sitetools :: Site Renderer ................... SUCCESS [ 26.688 s]
[INFO] Doxia Sitetools :: Document Renderer ............... SUCCESS [ 13.620 s]
[INFO] ------------------------------------------------------------------------
[INFO] BUILD SUCCESS
[INFO] ------------------------------------------------------------------------
[INFO] Total time:  01:35 min
[INFO] Finished at: 2019-06-06T10:52:05Z
[INFO] ------------------------------------------------------------------------
[WARNING] The requested profile "run-its" could not be activated because it does not exist.
[INFO] [jenkins-event-spy] Generated /home/jenkins/jenkins-slave/workspace/en-doxia-sitetools_htmlunit-2.24@tmp/withMaven6cca3e70/maven-spy-20190606-105029-24111414198849933087476.log
[Pipeline] }
[Pipeline] // dir
[Pipeline] }
[withMaven] junitPublisher - Archive test results for Maven artifact org.apache.maven.doxia:doxia-decoration-model:jar:1.9-SNAPSHOT generated by maven-surefire-plugin:test (default-test): m/doxia-decoration-model/target/surefire-reports/*.xml
[withMaven] junitPublisher - Archive test results for Maven artifact org.apache.maven.doxia:doxia-skin-model:jar:1.9-SNAPSHOT generated by maven-surefire-plugin:test (default-test): m/doxia-skin-model/target/surefire-reports/*.xml
[withMaven] junitPublisher - Archive test results for Maven artifact org.apache.maven.doxia:doxia-integration-tools:jar:1.9-SNAPSHOT generated by maven-surefire-plugin:test (default-test): m/doxia-integration-tools/target/surefire-reports/*.xml
[withMaven] junitPublisher - Archive test results for Maven artifact org.apache.maven.doxia:doxia-site-renderer:jar:1.9-SNAPSHOT generated by maven-surefire-plugin:test (default-test): m/doxia-site-renderer/target/surefire-reports/*.xml
[withMaven] junitPublisher - Archive test results for Maven artifact org.apache.maven.doxia:doxia-doc-renderer:jar:1.9-SNAPSHOT generated by maven-surefire-plugin:test (default-test): m/doxia-doc-renderer/target/surefire-reports/*.xml
Recording test results
[withMaven] Publishers: Pipeline Graph Publisher: 8 ms, Invoker Publisher: 1 ms, Junit Publisher: 5758 ms, Concordion Publisher: 1 ms, Dependencies Fingerprint Publisher: 1856 ms, JGiven Publisher: 1 ms
[Pipeline] // withMaven
[Pipeline] cleanWs
[WS-CLEANUP] Deleting project workspace...
[WS-CLEANUP] Deferred wipeout is used...
[WS-CLEANUP] done
[Pipeline] }
[Pipeline] // stage
[Pipeline] }
[Pipeline] // node
[Pipeline] }
[Pipeline] // parallel
[Pipeline] stage
[Pipeline] { (Notifications)
[Pipeline] echo
Build result: UNSTABLE
[Pipeline] jiraIssueSelector
[Pipeline] emailext

Build succeeded in Jenkins: Maven TLP » maven-doxia-sitetools » htmlunit-2.24 #7

Posted by Apache Jenkins Server <je...@builds.apache.org>.
See https://builds.apache.org/job/maven-box/job/maven-doxia-sitetools/job/htmlunit-2.24/7/

Changes:

* more fixes
* more fixes
* more fixes
* more fixes
* more fixes

All tests passed

Build unstable in Jenkins: Maven TLP » maven-doxia-sitetools » htmlunit-2.24 #6

Posted by Apache Jenkins Server <je...@builds.apache.org>.
See https://builds.apache.org/job/maven-box/job/maven-doxia-sitetools/job/htmlunit-2.24/6/

Changes:

* Entities
* Entities
* Entities

8 tests failed.
FAILED:  org.apache.maven.doxia.siterenderer.DefaultSiteRendererTest.windows-jdk11 / Build windows-jdk11 / testRender

Error Message:
expected:<[One stupid question & a silly answer?]> but was:<[]>

Stack Trace:
junit.framework.ComparisonFailure: expected:<[One stupid question & a silly answer?]> but was:<[]>
	at junit.framework.Assert.assertEquals(Assert.java:81)
	at junit.framework.Assert.assertEquals(Assert.java:87)
	at org.apache.maven.doxia.siterenderer.FaqVerifier.verify(FaqVerifier.java:80)
	at org.apache.maven.doxia.siterenderer.DefaultSiteRendererTest.verifyFaqPage(DefaultSiteRendererTest.java:412)
	at org.apache.maven.doxia.siterenderer.DefaultSiteRendererTest.testRender(DefaultSiteRendererTest.java:182)


FAILED:  org.apache.maven.doxia.siterenderer.DefaultSiteRendererTest.windows-jdk8 / Build windows-jdk8 / testRender

Error Message:
expected:<[One stupid question & a silly answer?]> but was:<[]>

Stack Trace:
junit.framework.ComparisonFailure: expected:<[One stupid question & a silly answer?]> but was:<[]>
	at junit.framework.Assert.assertEquals(Assert.java:81)
	at junit.framework.Assert.assertEquals(Assert.java:87)
	at org.apache.maven.doxia.siterenderer.FaqVerifier.verify(FaqVerifier.java:80)
	at org.apache.maven.doxia.siterenderer.DefaultSiteRendererTest.verifyFaqPage(DefaultSiteRendererTest.java:412)
	at org.apache.maven.doxia.siterenderer.DefaultSiteRendererTest.testRender(DefaultSiteRendererTest.java:182)


FAILED:  org.apache.maven.doxia.siterenderer.DefaultSiteRendererTest.windows-jdk7 / Build windows-jdk7 / testRender

Error Message:
expected:<[One stupid question & a silly answer?]> but was:<[]>

Stack Trace:
junit.framework.ComparisonFailure: expected:<[One stupid question & a silly answer?]> but was:<[]>
	at junit.framework.Assert.assertEquals(Assert.java:81)
	at junit.framework.Assert.assertEquals(Assert.java:87)
	at org.apache.maven.doxia.siterenderer.FaqVerifier.verify(FaqVerifier.java:80)
	at org.apache.maven.doxia.siterenderer.DefaultSiteRendererTest.verifyFaqPage(DefaultSiteRendererTest.java:412)
	at org.apache.maven.doxia.siterenderer.DefaultSiteRendererTest.testRender(DefaultSiteRendererTest.java:182)


FAILED:  org.apache.maven.doxia.siterenderer.DefaultSiteRendererTest.windows-jdk12 / Build windows-jdk12 / testRender

Error Message:
expected:<[One stupid question & a silly answer?]> but was:<[]>

Stack Trace:
junit.framework.ComparisonFailure: expected:<[One stupid question & a silly answer?]> but was:<[]>
	at junit.framework.Assert.assertEquals(Assert.java:81)
	at junit.framework.Assert.assertEquals(Assert.java:87)
	at org.apache.maven.doxia.siterenderer.FaqVerifier.verify(FaqVerifier.java:80)
	at org.apache.maven.doxia.siterenderer.DefaultSiteRendererTest.verifyFaqPage(DefaultSiteRendererTest.java:412)
	at org.apache.maven.doxia.siterenderer.DefaultSiteRendererTest.testRender(DefaultSiteRendererTest.java:182)


FAILED:  org.apache.maven.doxia.siterenderer.DefaultSiteRendererTest.linux-jdk7 / Build linux-jdk7 / testRender

Error Message:
expected:<[One stupid question & a silly answer?]> but was:<[]>

Stack Trace:
junit.framework.ComparisonFailure: expected:<[One stupid question & a silly answer?]> but was:<[]>
	at junit.framework.Assert.assertEquals(Assert.java:81)
	at junit.framework.Assert.assertEquals(Assert.java:87)
	at org.apache.maven.doxia.siterenderer.FaqVerifier.verify(FaqVerifier.java:80)
	at org.apache.maven.doxia.siterenderer.DefaultSiteRendererTest.verifyFaqPage(DefaultSiteRendererTest.java:412)
	at org.apache.maven.doxia.siterenderer.DefaultSiteRendererTest.testRender(DefaultSiteRendererTest.java:182)


FAILED:  org.apache.maven.doxia.siterenderer.DefaultSiteRendererTest.linux-jdk8 / Build linux-jdk8 / testRender

Error Message:
expected:<[One stupid question & a silly answer?]> but was:<[]>

Stack Trace:
junit.framework.ComparisonFailure: expected:<[One stupid question & a silly answer?]> but was:<[]>
	at junit.framework.Assert.assertEquals(Assert.java:81)
	at junit.framework.Assert.assertEquals(Assert.java:87)
	at org.apache.maven.doxia.siterenderer.FaqVerifier.verify(FaqVerifier.java:80)
	at org.apache.maven.doxia.siterenderer.DefaultSiteRendererTest.verifyFaqPage(DefaultSiteRendererTest.java:412)
	at org.apache.maven.doxia.siterenderer.DefaultSiteRendererTest.testRender(DefaultSiteRendererTest.java:182)


FAILED:  org.apache.maven.doxia.siterenderer.DefaultSiteRendererTest.linux-jdk11 / Build linux-jdk11 / testRender

Error Message:
expected:<[One stupid question & a silly answer?]> but was:<[]>

Stack Trace:
junit.framework.ComparisonFailure: expected:<[One stupid question & a silly answer?]> but was:<[]>
	at junit.framework.Assert.assertEquals(Assert.java:81)
	at junit.framework.Assert.assertEquals(Assert.java:87)
	at org.apache.maven.doxia.siterenderer.FaqVerifier.verify(FaqVerifier.java:80)
	at org.apache.maven.doxia.siterenderer.DefaultSiteRendererTest.verifyFaqPage(DefaultSiteRendererTest.java:412)
	at org.apache.maven.doxia.siterenderer.DefaultSiteRendererTest.testRender(DefaultSiteRendererTest.java:182)


FAILED:  org.apache.maven.doxia.siterenderer.DefaultSiteRendererTest.linux-jdk12 / Build linux-jdk12 / testRender

Error Message:
expected:<[One stupid question & a silly answer?]> but was:<[]>

Stack Trace:
junit.framework.ComparisonFailure: expected:<[One stupid question & a silly answer?]> but was:<[]>
	at junit.framework.Assert.assertEquals(Assert.java:81)
	at junit.framework.Assert.assertEquals(Assert.java:87)
	at org.apache.maven.doxia.siterenderer.FaqVerifier.verify(FaqVerifier.java:80)
	at org.apache.maven.doxia.siterenderer.DefaultSiteRendererTest.verifyFaqPage(DefaultSiteRendererTest.java:412)
	at org.apache.maven.doxia.siterenderer.DefaultSiteRendererTest.testRender(DefaultSiteRendererTest.java:182)




Build log:
[...truncated 27585 lines...]
[INFO] Exclude: src/test/resources/org/apache/maven/doxia/siterenderer/velocity-toolmanager.expected.txt
[INFO] Exclude: src/test/resources/dtd/xhtml-*.ent
[INFO] Exclude: src/test/resources/dtd/xhtml1-transitional.dtd
[INFO] Exclude: src/test/resources/xhtml-lat1.ent
[INFO] Exclude: .repository/**
[INFO] Exclude: .maven/spy.log
[INFO] Exclude: dependency-reduced-pom.xml
[INFO] Exclude: .java-version
[INFO] 32 resources included (use -debug for more details)
[INFO] Rat check: Summary over all files. Unapproved: 0, unknown: 0, generated: 0, approved: 28 licenses.
[INFO] 
[INFO] --- maven-remote-resources-plugin:1.5:process (process-resource-bundles) @ doxia-doc-renderer ---
[INFO] Tests run: 4, Failures: 0, Errors: 0, Skipped: 0, Time elapsed: 11.296 s - in org.apache.maven.doxia.docrenderer.DocumentRendererTest
[INFO] 
[INFO] Results:
[INFO] 
[INFO] Tests run: 4, Failures: 0, Errors: 0, Skipped: 0
[INFO] 
[INFO] 
[INFO] --- maven-jar-plugin:3.1.0:jar (default-jar) @ doxia-doc-renderer ---
[INFO] Building jar: /home/jenkins/jenkins-slave/workspace/en-doxia-sitetools_htmlunit-2.24/m/doxia-doc-renderer/target/doxia-doc-renderer-1.9-SNAPSHOT.jar
[INFO] 
[INFO] --- maven-site-plugin:3.7.1:attach-descriptor (attach-descriptor) @ doxia-doc-renderer ---
[INFO] Skipping because packaging 'jar' is not pom.
[INFO] 
[INFO] --- maven-checkstyle-plugin:3.0.0:check (checkstyle-check) @ doxia-doc-renderer ---
[INFO] 
[INFO] --- maven-resources-plugin:3.1.0:resources (default-resources) @ doxia-doc-renderer ---
[INFO] Using 'UTF-8' encoding to copy filtered resources.
[INFO] Copying 1 resource
[INFO] skip non existing resourceDirectory /home/jenkins/jenkins-slave/workspace/en-doxia-sitetools_htmlunit-2.24/m/doxia-doc-renderer/target/generated-site/xsd
[INFO] Copying 3 resources
[INFO] 
[INFO] --- maven-compiler-plugin:3.7.0:compile (default-compile) @ doxia-doc-renderer ---
[INFO] Changes detected - recompiling the module!
[INFO] Compiling 14 source files to /home/jenkins/jenkins-slave/workspace/en-doxia-sitetools_htmlunit-2.24/m/doxia-doc-renderer/target/classes
[INFO] /home/jenkins/jenkins-slave/workspace/en-doxia-sitetools_htmlunit-2.24/m/doxia-doc-renderer/src/main/java/org/apache/maven/doxia/docrenderer/itext/AbstractITextRender.java: Some input files use or override a deprecated API.
[INFO] /home/jenkins/jenkins-slave/workspace/en-doxia-sitetools_htmlunit-2.24/m/doxia-doc-renderer/src/main/java/org/apache/maven/doxia/docrenderer/itext/AbstractITextRender.java: Recompile with -Xlint:deprecation for details.
[INFO] 
[INFO] --- plexus-component-metadata:1.7.1:generate-metadata (default) @ doxia-doc-renderer ---
[INFO] Discovered 4 component descriptors(s)
[INFO] 
[INFO] --- maven-resources-plugin:3.1.0:testResources (default-testResources) @ doxia-doc-renderer ---
[INFO] Using 'UTF-8' encoding to copy filtered resources.
[INFO] Copying 13 resources
[INFO] Copying 3 resources
[INFO] 
[INFO] --- maven-compiler-plugin:3.7.0:testCompile (default-testCompile) @ doxia-doc-renderer ---
[INFO] Changes detected - recompiling the module!
[INFO] Compiling 1 source file to /home/jenkins/jenkins-slave/workspace/en-doxia-sitetools_htmlunit-2.24/m/doxia-doc-renderer/target/test-classes
[INFO] 
[INFO] --- maven-surefire-plugin:2.22.0:test (default-test) @ doxia-doc-renderer ---
[INFO] 
[INFO] -------------------------------------------------------
[INFO]  T E S T S
[INFO] -------------------------------------------------------
[INFO] Running org.apache.maven.doxia.docrenderer.DocumentRendererTest
[INFO] 
[INFO] >>> clirr-maven-plugin:2.8:check (default) > compile @ doxia-doc-renderer >>>
[INFO] 
[INFO] --- maven-enforcer-plugin:1.4.1:enforce (enforce-maven-version) @ doxia-doc-renderer ---
[INFO] 
[INFO] --- maven-enforcer-plugin:1.4.1:enforce (enforce-bytecode-version) @ doxia-doc-renderer ---
[INFO] 
[INFO] --- maven-enforcer-plugin:1.4.1:enforce (ban-known-bad-maven-versions) @ doxia-doc-renderer ---
[INFO] 
[INFO] --- apache-rat-plugin:0.12:check (rat-check) @ doxia-doc-renderer ---
[INFO] Enabled default license matchers.
[INFO] Will parse SCM ignores for exclusions...
[INFO] Finished adding exclusions from SCM ignore files.
[INFO] 61 implicit excludes (use -debug for more details).
[INFO] Exclude: src/test/resources/site/confluence/confluence/*.confluence
[INFO] Exclude: src/test/resources/org/apache/maven/doxia/siterenderer/velocity-toolmanager.vm
[INFO] Exclude: src/test/resources/org/apache/maven/doxia/siterenderer/velocity-toolmanager.expected.txt
[INFO] Exclude: src/test/resources/dtd/xhtml-*.ent
[INFO] Exclude: src/test/resources/dtd/xhtml1-transitional.dtd
[INFO] Exclude: src/test/resources/xhtml-lat1.ent
[INFO] Exclude: .repository/**
[INFO] Exclude: .maven/spy.log
[INFO] Exclude: dependency-reduced-pom.xml
[INFO] Exclude: .java-version
[INFO] 32 resources included (use -debug for more details)
[INFO] Rat check: Summary over all files. Unapproved: 0, unknown: 0, generated: 0, approved: 28 licenses.
[INFO] 
[INFO] --- maven-remote-resources-plugin:1.5:process (process-resource-bundles) @ doxia-doc-renderer ---
[INFO] 
[INFO] --- maven-resources-plugin:3.1.0:resources (default-resources) @ doxia-doc-renderer ---
[INFO] Using 'UTF-8' encoding to copy filtered resources.
[INFO] Copying 1 resource
[INFO] skip non existing resourceDirectory /home/jenkins/jenkins-slave/workspace/en-doxia-sitetools_htmlunit-2.24/m/doxia-doc-renderer/target/generated-site/xsd
[INFO] Copying 3 resources
[INFO] Copying 3 resources
[INFO] 
[INFO] --- maven-compiler-plugin:3.7.0:compile (default-compile) @ doxia-doc-renderer ---
[INFO] Nothing to compile - all classes are up to date
[INFO] 
[INFO] <<< clirr-maven-plugin:2.8:check (default) < compile @ doxia-doc-renderer <<<
[INFO] 
[INFO] 
[INFO] --- clirr-maven-plugin:2.8:check (default) @ doxia-doc-renderer ---
[INFO] Skipping execution
[INFO] ------------------------------------------------------------------------
[INFO] Reactor Summary for Doxia Sitetools 1.9-SNAPSHOT:
[INFO] 
[INFO] Doxia Sitetools .................................... SUCCESS [ 29.430 s]
[INFO] Doxia Sitetools :: Decoration Model ................ SUCCESS [ 17.079 s]
[INFO] Doxia Sitetools :: Skin Model ...................... SUCCESS [  2.432 s]
[INFO] Doxia Sitetools :: Integration Tools ............... SUCCESS [ 14.046 s]
[INFO] Doxia Sitetools :: Site Renderer ................... SUCCESS [ 26.702 s]
[INFO] Doxia Sitetools :: Document Renderer ............... SUCCESS [ 22.339 s]
[INFO] ------------------------------------------------------------------------
[INFO] BUILD SUCCESS
[INFO] ------------------------------------------------------------------------
[INFO] Total time:  01:54 min
[INFO] Finished at: 2019-06-06T11:45:09Z
[INFO] ------------------------------------------------------------------------
[WARNING] The requested profile "run-its" could not be activated because it does not exist.
[INFO] [jenkins-event-spy] Generated /home/jenkins/jenkins-slave/workspace/en-doxia-sitetools_htmlunit-2.24@tmp/withMaven996ac086/maven-spy-20190606-114314-8056548008446256642163.log
[Pipeline] }
[Pipeline] // dir
[Pipeline] }
[warn] No document root specified, local links will not be resolved correctly!
[withMaven] junitPublisher - Archive test results for Maven artifact org.apache.maven.doxia:doxia-decoration-model:jar:1.9-SNAPSHOT generated by maven-surefire-plugin:test (default-test): m/doxia-decoration-model/target/surefire-reports/*.xml
[withMaven] junitPublisher - Archive test results for Maven artifact org.apache.maven.doxia:doxia-skin-model:jar:1.9-SNAPSHOT generated by maven-surefire-plugin:test (default-test): m/doxia-skin-model/target/surefire-reports/*.xml
[withMaven] junitPublisher - Archive test results for Maven artifact org.apache.maven.doxia:doxia-integration-tools:jar:1.9-SNAPSHOT generated by maven-surefire-plugin:test (default-test): m/doxia-integration-tools/target/surefire-reports/*.xml
[withMaven] junitPublisher - Archive test results for Maven artifact org.apache.maven.doxia:doxia-site-renderer:jar:1.9-SNAPSHOT generated by maven-surefire-plugin:test (default-test): m/doxia-site-renderer/target/surefire-reports/*.xml
[withMaven] junitPublisher - Archive test results for Maven artifact org.apache.maven.doxia:doxia-doc-renderer:jar:1.9-SNAPSHOT generated by maven-surefire-plugin:test (default-test): m/doxia-doc-renderer/target/surefire-reports/*.xml
Recording test results
[WARNING] [iText Sink] Modified invalid link: 'Frequently Asked Questions_How_to_export_in_PDF' to 'Frequently_Asked_Questions_How_to_export_in_PDF'
[WARNING] [iText Sink] Modified invalid link: 'Frequently Asked Questions_How_to_handle_style_in_the_APT_markup_language' to 'Frequently_Asked_Questions_How_to_handle_style_in_the_APT_markup_language'
[WARNING] [iText Sink] Modified invalid link: 'Frequently Asked Questions_Is_it_possible_to_create_a_book' to 'Frequently_Asked_Questions_Is_it_possible_to_create_a_book'
[WARNING] [iText Sink] Modified invalid link: 'Frequently Asked Questions_top' to 'Frequently_Asked_Questions_top'
[WARNING] [iText Sink] Modified invalid link: 'Frequently Asked Questions_How_to_export_in_PDF' to 'Frequently_Asked_Questions_How_to_export_in_PDF'
[WARNING] [iText Sink] Modified invalid link: 'Frequently Asked Questions_How_to_handle_style_in_the_APT_markup_language' to 'Frequently_Asked_Questions_How_to_handle_style_in_the_APT_markup_language'
[WARNING] [iText Sink] Modified invalid link: 'Frequently Asked Questions_Is_it_possible_to_create_a_book' to 'Frequently_Asked_Questions_Is_it_possible_to_create_a_book'
[WARNING] [iText Sink] Modified invalid link: 'Frequently Asked Questions_top' to 'Frequently_Asked_Questions_top'
[INFO] Tests run: 4, Failures: 0, Errors: 0, Skipped: 0, Time elapsed: 5.16 s - in org.apache.maven.doxia.docrenderer.DocumentRendererTest
[INFO] 
[INFO] Results:
[INFO] 
[INFO] Tests run: 4, Failures: 0, Errors: 0, Skipped: 0
[INFO] 
[INFO] 
[INFO] --- maven-jar-plugin:3.1.0:jar (default-jar) @ doxia-doc-renderer ---
[INFO] Building jar: /home/jenkins/jenkins-slave/workspace/en-doxia-sitetools_htmlunit-2.24/m/doxia-doc-renderer/target/doxia-doc-renderer-1.9-SNAPSHOT.jar
[INFO] 
[INFO] --- maven-site-plugin:3.7.1:attach-descriptor (attach-descriptor) @ doxia-doc-renderer ---
[INFO] Skipping because packaging 'jar' is not pom.
[INFO] 
[INFO] --- maven-checkstyle-plugin:3.0.0:check (checkstyle-check) @ doxia-doc-renderer ---
[INFO] 
[INFO] >>> clirr-maven-plugin:2.8:check (default) > compile @ doxia-doc-renderer >>>
[INFO] 
[INFO] --- maven-enforcer-plugin:1.4.1:enforce (enforce-maven-version) @ doxia-doc-renderer ---
[INFO] 
[INFO] --- maven-enforcer-plugin:1.4.1:enforce (enforce-bytecode-version) @ doxia-doc-renderer ---
[INFO] 
[INFO] --- maven-enforcer-plugin:1.4.1:enforce (ban-known-bad-maven-versions) @ doxia-doc-renderer ---
[INFO] 
[INFO] --- apache-rat-plugin:0.12:check (rat-check) @ doxia-doc-renderer ---
[INFO] Enabled default license matchers.
[INFO] Will parse SCM ignores for exclusions...
[INFO] Finished adding exclusions from SCM ignore files.
[INFO] 61 implicit excludes (use -debug for more details).
[INFO] Exclude: src/test/resources/site/confluence/confluence/*.confluence
[INFO] Exclude: src/test/resources/org/apache/maven/doxia/siterenderer/velocity-toolmanager.vm
[INFO] Exclude: src/test/resources/org/apache/maven/doxia/siterenderer/velocity-toolmanager.expected.txt
[INFO] Exclude: src/test/resources/dtd/xhtml-*.ent
[INFO] Exclude: src/test/resources/dtd/xhtml1-transitional.dtd
[INFO] Exclude: src/test/resources/xhtml-lat1.ent
[INFO] Exclude: .repository/**
[INFO] Exclude: .maven/spy.log
[INFO] Exclude: dependency-reduced-pom.xml
[INFO] Exclude: .java-version
[INFO] 32 resources included (use -debug for more details)
[INFO] Rat check: Summary over all files. Unapproved: 0, unknown: 0, generated: 0, approved: 28 licenses.
[INFO] 
[INFO] --- maven-remote-resources-plugin:1.5:process (process-resource-bundles) @ doxia-doc-renderer ---
[INFO] 
[INFO] --- maven-resources-plugin:3.1.0:resources (default-resources) @ doxia-doc-renderer ---
[INFO] Using 'UTF-8' encoding to copy filtered resources.
[INFO] Copying 1 resource
[INFO] skip non existing resourceDirectory /home/jenkins/jenkins-slave/workspace/en-doxia-sitetools_htmlunit-2.24/m/doxia-doc-renderer/target/generated-site/xsd
[INFO] Copying 3 resources
[INFO] Copying 3 resources
[INFO] 
[INFO] --- maven-compiler-plugin:3.7.0:compile (default-compile) @ doxia-doc-renderer ---
[INFO] Nothing to compile - all classes are up to date
[INFO] 
[INFO] <<< clirr-maven-plugin:2.8:check (default) < compile @ doxia-doc-renderer <<<
[INFO] 
[INFO] 
[INFO] --- clirr-maven-plugin:2.8:check (default) @ doxia-doc-renderer ---
[INFO] Skipping execution
[INFO] ------------------------------------------------------------------------
[INFO] Reactor Summary for Doxia Sitetools 1.9-SNAPSHOT:
[INFO] 
[INFO] Doxia Sitetools .................................... SUCCESS [ 37.660 s]
[INFO] Doxia Sitetools :: Decoration Model ................ SUCCESS [ 12.358 s]
[INFO] Doxia Sitetools :: Skin Model ...................... SUCCESS [  0.886 s]
[INFO] Doxia Sitetools :: Integration Tools ............... SUCCESS [  6.464 s]
[INFO] Doxia Sitetools :: Site Renderer ................... SUCCESS [ 13.761 s]
[INFO] Doxia Sitetools :: Document Renderer ............... SUCCESS [ 14.783 s]
[INFO] ------------------------------------------------------------------------
[INFO] BUILD SUCCESS
[INFO] ------------------------------------------------------------------------
[INFO] Total time:  01:29 min
[INFO] Finished at: 2019-06-06T11:45:15Z
[INFO] ------------------------------------------------------------------------
[WARNING] The requested profile "run-its" could not be activated because it does not exist.
[INFO] [jenkins-event-spy] Generated /home/jenkins/jenkins-slave/workspace/en-doxia-sitetools_htmlunit-2.24@tmp/withMaven60caed44/maven-spy-20190606-114345-666967741489076607287.log
[Pipeline] }
[Pipeline] // dir
[Pipeline] }
[withMaven] junitPublisher - Archive test results for Maven artifact org.apache.maven.doxia:doxia-decoration-model:jar:1.9-SNAPSHOT generated by maven-surefire-plugin:test (default-test): m/doxia-decoration-model/target/surefire-reports/*.xml
[withMaven] junitPublisher - Archive test results for Maven artifact org.apache.maven.doxia:doxia-skin-model:jar:1.9-SNAPSHOT generated by maven-surefire-plugin:test (default-test): m/doxia-skin-model/target/surefire-reports/*.xml
[withMaven] junitPublisher - Archive test results for Maven artifact org.apache.maven.doxia:doxia-integration-tools:jar:1.9-SNAPSHOT generated by maven-surefire-plugin:test (default-test): m/doxia-integration-tools/target/surefire-reports/*.xml
[withMaven] junitPublisher - Archive test results for Maven artifact org.apache.maven.doxia:doxia-site-renderer:jar:1.9-SNAPSHOT generated by maven-surefire-plugin:test (default-test): m/doxia-site-renderer/target/surefire-reports/*.xml
[withMaven] junitPublisher - Archive test results for Maven artifact org.apache.maven.doxia:doxia-doc-renderer:jar:1.9-SNAPSHOT generated by maven-surefire-plugin:test (default-test): m/doxia-doc-renderer/target/surefire-reports/*.xml
Recording test results
[withMaven] Publishers: Pipeline Graph Publisher: 19 ms, Invoker Publisher: 1 ms, Junit Publisher: 5827 ms, Concordion Publisher: 1 ms, Dependencies Fingerprint Publisher: 1865 ms, JGiven Publisher: 1 ms
[Pipeline] // withMaven
[Pipeline] cleanWs
[WS-CLEANUP] Deleting project workspace...
[WS-CLEANUP] Deferred wipeout is used...
[WS-CLEANUP] done
[Pipeline] }
[Pipeline] // stage
[Pipeline] }
[Pipeline] // node
[Pipeline] }
[withMaven] Publishers: Pipeline Graph Publisher: 7 ms, Invoker Publisher: 1 ms, Junit Publisher: 5755 ms, Concordion Publisher: 1 ms, Dependencies Fingerprint Publisher: 1851 ms, JGiven Publisher: 1 ms
[Pipeline] // withMaven
[Pipeline] cleanWs
[WS-CLEANUP] Deleting project workspace...
[WS-CLEANUP] Deferred wipeout is used...
[WS-CLEANUP] done
[Pipeline] }
[Pipeline] // stage
[Pipeline] }
[Pipeline] // node
[Pipeline] }
[Pipeline] // parallel
[Pipeline] stage
[Pipeline] { (Notifications)
[Pipeline] echo
Build result: UNSTABLE
[Pipeline] jiraIssueSelector
[Pipeline] emailext

Build unstable in Jenkins: Maven TLP » maven-doxia-sitetools » htmlunit-2.24 #5

Posted by Apache Jenkins Server <je...@builds.apache.org>.
See https://builds.apache.org/job/maven-box/job/maven-doxia-sitetools/job/htmlunit-2.24/5/

Changes:

* Entities
* Entities
* Entities
* Entities
* Entities
* Entities
* Entities

8 tests failed.
FAILED:  org.apache.maven.doxia.siterenderer.DefaultSiteRendererTest.windows-jdk11 / Build windows-jdk11 / testRender

Error Message:
null

Stack Trace:
junit.framework.AssertionFailedError
	at junit.framework.Assert.fail(Assert.java:47)
	at junit.framework.Assert.assertTrue(Assert.java:20)
	at junit.framework.Assert.assertTrue(Assert.java:27)
	at org.apache.maven.doxia.siterenderer.EntitiesVerifier.verify(EntitiesVerifier.java:67)
	at org.apache.maven.doxia.siterenderer.DefaultSiteRendererTest.verifyEntitiesPage(DefaultSiteRendererTest.java:392)
	at org.apache.maven.doxia.siterenderer.DefaultSiteRendererTest.testRender(DefaultSiteRendererTest.java:180)


FAILED:  org.apache.maven.doxia.siterenderer.DefaultSiteRendererTest.linux-jdk12 / Build linux-jdk12 / testRender

Error Message:
null

Stack Trace:
junit.framework.AssertionFailedError
	at junit.framework.Assert.fail(Assert.java:47)
	at junit.framework.Assert.assertTrue(Assert.java:20)
	at junit.framework.Assert.assertTrue(Assert.java:27)
	at org.apache.maven.doxia.siterenderer.EntitiesVerifier.verify(EntitiesVerifier.java:67)
	at org.apache.maven.doxia.siterenderer.DefaultSiteRendererTest.verifyEntitiesPage(DefaultSiteRendererTest.java:392)
	at org.apache.maven.doxia.siterenderer.DefaultSiteRendererTest.testRender(DefaultSiteRendererTest.java:180)


FAILED:  org.apache.maven.doxia.siterenderer.DefaultSiteRendererTest.linux-jdk8 / Build linux-jdk8 / testRender

Error Message:
null

Stack Trace:
junit.framework.AssertionFailedError
	at junit.framework.Assert.fail(Assert.java:47)
	at junit.framework.Assert.assertTrue(Assert.java:20)
	at junit.framework.Assert.assertTrue(Assert.java:27)
	at org.apache.maven.doxia.siterenderer.EntitiesVerifier.verify(EntitiesVerifier.java:67)
	at org.apache.maven.doxia.siterenderer.DefaultSiteRendererTest.verifyEntitiesPage(DefaultSiteRendererTest.java:392)
	at org.apache.maven.doxia.siterenderer.DefaultSiteRendererTest.testRender(DefaultSiteRendererTest.java:180)


FAILED:  org.apache.maven.doxia.siterenderer.DefaultSiteRendererTest.linux-jdk11 / Build linux-jdk11 / testRender

Error Message:
null

Stack Trace:
junit.framework.AssertionFailedError
	at junit.framework.Assert.fail(Assert.java:47)
	at junit.framework.Assert.assertTrue(Assert.java:20)
	at junit.framework.Assert.assertTrue(Assert.java:27)
	at org.apache.maven.doxia.siterenderer.EntitiesVerifier.verify(EntitiesVerifier.java:67)
	at org.apache.maven.doxia.siterenderer.DefaultSiteRendererTest.verifyEntitiesPage(DefaultSiteRendererTest.java:392)
	at org.apache.maven.doxia.siterenderer.DefaultSiteRendererTest.testRender(DefaultSiteRendererTest.java:180)


FAILED:  org.apache.maven.doxia.siterenderer.DefaultSiteRendererTest.linux-jdk7 / Build linux-jdk7 / testRender

Error Message:
null

Stack Trace:
junit.framework.AssertionFailedError
	at junit.framework.Assert.fail(Assert.java:47)
	at junit.framework.Assert.assertTrue(Assert.java:20)
	at junit.framework.Assert.assertTrue(Assert.java:27)
	at org.apache.maven.doxia.siterenderer.EntitiesVerifier.verify(EntitiesVerifier.java:67)
	at org.apache.maven.doxia.siterenderer.DefaultSiteRendererTest.verifyEntitiesPage(DefaultSiteRendererTest.java:392)
	at org.apache.maven.doxia.siterenderer.DefaultSiteRendererTest.testRender(DefaultSiteRendererTest.java:180)


FAILED:  org.apache.maven.doxia.siterenderer.DefaultSiteRendererTest.windows-jdk8 / Build windows-jdk8 / testRender

Error Message:
null

Stack Trace:
junit.framework.AssertionFailedError
	at junit.framework.Assert.fail(Assert.java:47)
	at junit.framework.Assert.assertTrue(Assert.java:20)
	at junit.framework.Assert.assertTrue(Assert.java:27)
	at org.apache.maven.doxia.siterenderer.EntitiesVerifier.verify(EntitiesVerifier.java:67)
	at org.apache.maven.doxia.siterenderer.DefaultSiteRendererTest.verifyEntitiesPage(DefaultSiteRendererTest.java:392)
	at org.apache.maven.doxia.siterenderer.DefaultSiteRendererTest.testRender(DefaultSiteRendererTest.java:180)


FAILED:  org.apache.maven.doxia.siterenderer.DefaultSiteRendererTest.windows-jdk7 / Build windows-jdk7 / testRender

Error Message:
null

Stack Trace:
junit.framework.AssertionFailedError
	at junit.framework.Assert.fail(Assert.java:47)
	at junit.framework.Assert.assertTrue(Assert.java:20)
	at junit.framework.Assert.assertTrue(Assert.java:27)
	at org.apache.maven.doxia.siterenderer.EntitiesVerifier.verify(EntitiesVerifier.java:67)
	at org.apache.maven.doxia.siterenderer.DefaultSiteRendererTest.verifyEntitiesPage(DefaultSiteRendererTest.java:392)
	at org.apache.maven.doxia.siterenderer.DefaultSiteRendererTest.testRender(DefaultSiteRendererTest.java:180)


FAILED:  org.apache.maven.doxia.siterenderer.DefaultSiteRendererTest.windows-jdk12 / Build windows-jdk12 / testRender

Error Message:
null

Stack Trace:
junit.framework.AssertionFailedError
	at junit.framework.Assert.fail(Assert.java:47)
	at junit.framework.Assert.assertTrue(Assert.java:20)
	at junit.framework.Assert.assertTrue(Assert.java:27)
	at org.apache.maven.doxia.siterenderer.EntitiesVerifier.verify(EntitiesVerifier.java:67)
	at org.apache.maven.doxia.siterenderer.DefaultSiteRendererTest.verifyEntitiesPage(DefaultSiteRendererTest.java:392)
	at org.apache.maven.doxia.siterenderer.DefaultSiteRendererTest.testRender(DefaultSiteRendererTest.java:180)




Build log:
[...truncated 26574 lines...]
[INFO] Downloaded from central: https://repo.maven.apache.org/maven2/org/apache/xmlgraphics/batik-awt-util/1.10/batik-awt-util-1.10.jar (422 kB at 2.0 MB/s)
[INFO] Downloading from central: https://repo.maven.apache.org/maven2/com/vladsch/flexmark/flexmark-ext-abbreviation/0.42.8/flexmark-ext-abbreviation-0.42.8.jar
[INFO] Downloaded from central: https://repo.maven.apache.org/maven2/org/apache/maven/doxia/doxia-module-markdown/1.9/doxia-module-markdown-1.9.jar (23 kB at 106 kB/s)
[INFO] Downloading from central: https://repo.maven.apache.org/maven2/com/vladsch/flexmark/flexmark-ext-admonition/0.42.8/flexmark-ext-admonition-0.42.8.jar
[INFO] Downloaded from central: https://repo.maven.apache.org/maven2/log4j/log4j/1.2.17/log4j-1.2.17.jar (490 kB at 2.2 MB/s)
[INFO] Downloading from central: https://repo.maven.apache.org/maven2/com/vladsch/flexmark/flexmark-ext-anchorlink/0.42.8/flexmark-ext-anchorlink-0.42.8.jar
[INFO] Downloaded from central: https://repo.maven.apache.org/maven2/com/vladsch/flexmark/flexmark-ext-abbreviation/0.42.8/flexmark-ext-abbreviation-0.42.8.jar (35 kB at 156 kB/s)
[INFO] Downloading from central: https://repo.maven.apache.org/maven2/com/vladsch/flexmark/flexmark-ext-aside/0.42.8/flexmark-ext-aside-0.42.8.jar
[INFO] Downloaded from central: https://repo.maven.apache.org/maven2/com/vladsch/flexmark/flexmark-ext-anchorlink/0.42.8/flexmark-ext-anchorlink-0.42.8.jar (17 kB at 73 kB/s)
[INFO] Downloading from central: https://repo.maven.apache.org/maven2/com/vladsch/flexmark/flexmark-ext-attributes/0.42.8/flexmark-ext-attributes-0.42.8.jar
[INFO] Downloaded from central: https://repo.maven.apache.org/maven2/com/vladsch/flexmark/flexmark-ext-admonition/0.42.8/flexmark-ext-admonition-0.42.8.jar (34 kB at 150 kB/s)
[INFO] Downloading from central: https://repo.maven.apache.org/maven2/com/vladsch/flexmark/flexmark-ext-autolink/0.42.8/flexmark-ext-autolink-0.42.8.jar
[INFO] Downloaded from central: https://repo.maven.apache.org/maven2/com/vladsch/flexmark/flexmark/0.42.8/flexmark-0.42.8.jar (388 kB at 1.7 MB/s)
[INFO] Downloading from central: https://repo.maven.apache.org/maven2/com/vladsch/flexmark/flexmark-ext-definition/0.42.8/flexmark-ext-definition-0.42.8.jar
[INFO] Downloaded from central: https://repo.maven.apache.org/maven2/com/vladsch/flexmark/flexmark-ext-aside/0.42.8/flexmark-ext-aside-0.42.8.jar (16 kB at 69 kB/s)
[INFO] Downloading from central: https://repo.maven.apache.org/maven2/com/vladsch/flexmark/flexmark-ext-emoji/0.42.8/flexmark-ext-emoji-0.42.8.jar
[INFO] Downloaded from central: https://repo.maven.apache.org/maven2/com/vladsch/flexmark/flexmark-ext-attributes/0.42.8/flexmark-ext-attributes-0.42.8.jar (36 kB at 151 kB/s)
[INFO] Downloading from central: https://repo.maven.apache.org/maven2/com/vladsch/flexmark/flexmark-ext-enumerated-reference/0.42.8/flexmark-ext-enumerated-reference-0.42.8.jar
[INFO] Downloaded from central: https://repo.maven.apache.org/maven2/com/vladsch/flexmark/flexmark-ext-autolink/0.42.8/flexmark-ext-autolink-0.42.8.jar (9.4 kB at 39 kB/s)
[INFO] Downloading from central: https://repo.maven.apache.org/maven2/com/vladsch/flexmark/flexmark-ext-escaped-character/0.42.8/flexmark-ext-escaped-character-0.42.8.jar
[INFO] Downloaded from central: https://repo.maven.apache.org/maven2/com/vladsch/flexmark/flexmark-ext-definition/0.42.8/flexmark-ext-definition-0.42.8.jar (40 kB at 166 kB/s)
[INFO] Downloading from central: https://repo.maven.apache.org/maven2/com/vladsch/flexmark/flexmark-ext-footnotes/0.42.8/flexmark-ext-footnotes-0.42.8.jar
[INFO] Downloaded from central: https://repo.maven.apache.org/maven2/com/vladsch/flexmark/flexmark-ext-enumerated-reference/0.42.8/flexmark-ext-enumerated-reference-0.42.8.jar (66 kB at 272 kB/s)
[INFO] Downloading from central: https://repo.maven.apache.org/maven2/com/vladsch/flexmark/flexmark-ext-gfm-issues/0.42.8/flexmark-ext-gfm-issues-0.42.8.jar
[INFO] Downloaded from central: https://repo.maven.apache.org/maven2/com/vladsch/flexmark/flexmark-ext-escaped-character/0.42.8/flexmark-ext-escaped-character-0.42.8.jar (13 kB at 52 kB/s)
[INFO] Downloading from central: https://repo.maven.apache.org/maven2/com/vladsch/flexmark/flexmark-ext-gfm-strikethrough/0.42.8/flexmark-ext-gfm-strikethrough-0.42.8.jar
[INFO] Downloaded from central: https://repo.maven.apache.org/maven2/com/vladsch/flexmark/flexmark-ext-emoji/0.42.8/flexmark-ext-emoji-0.42.8.jar (73 kB at 298 kB/s)
[INFO] Downloading from central: https://repo.maven.apache.org/maven2/com/vladsch/flexmark/flexmark-ext-gfm-tables/0.42.8/flexmark-ext-gfm-tables-0.42.8.jar
[INFO] Downloaded from central: https://repo.maven.apache.org/maven2/org/apache/pdfbox/fontbox/2.0.7/fontbox-2.0.7.jar (1.5 MB at 6.0 MB/s)
[INFO] Downloading from central: https://repo.maven.apache.org/maven2/com/vladsch/flexmark/flexmark-ext-gfm-tasklist/0.42.8/flexmark-ext-gfm-tasklist-0.42.8.jar
[INFO] Downloaded from central: https://repo.maven.apache.org/maven2/com/vladsch/flexmark/flexmark-ext-footnotes/0.42.8/flexmark-ext-footnotes-0.42.8.jar (41 kB at 166 kB/s)
[INFO] Downloading from central: https://repo.maven.apache.org/maven2/com/vladsch/flexmark/flexmark-ext-gfm-users/0.42.8/flexmark-ext-gfm-users-0.42.8.jar
[INFO] Downloaded from central: https://repo.maven.apache.org/maven2/com/vladsch/flexmark/flexmark-ext-gfm-issues/0.42.8/flexmark-ext-gfm-issues-0.42.8.jar (16 kB at 62 kB/s)
[INFO] Downloading from central: https://repo.maven.apache.org/maven2/com/vladsch/flexmark/flexmark-ext-gitlab/0.42.8/flexmark-ext-gitlab-0.42.8.jar
[INFO] Downloaded from central: https://repo.maven.apache.org/maven2/com/vladsch/flexmark/flexmark-ext-gfm-strikethrough/0.42.8/flexmark-ext-gfm-strikethrough-0.42.8.jar (29 kB at 112 kB/s)
[INFO] Downloading from central: https://repo.maven.apache.org/maven2/com/vladsch/flexmark/flexmark-ext-jekyll-front-matter/0.42.8/flexmark-ext-jekyll-front-matter-0.42.8.jar
[INFO] Downloaded from central: https://repo.maven.apache.org/maven2/com/vladsch/flexmark/flexmark-ext-gfm-tables/0.42.8/flexmark-ext-gfm-tables-0.42.8.jar (33 kB at 129 kB/s)
[INFO] Downloading from central: https://repo.maven.apache.org/maven2/com/vladsch/flexmark/flexmark-ext-jekyll-tag/0.42.8/flexmark-ext-jekyll-tag-0.42.8.jar
[INFO] Downloaded from central: https://repo.maven.apache.org/maven2/com/vladsch/flexmark/flexmark-ext-gfm-tasklist/0.42.8/flexmark-ext-gfm-tasklist-0.42.8.jar (28 kB at 107 kB/s)
[INFO] Downloading from central: https://repo.maven.apache.org/maven2/com/vladsch/flexmark/flexmark-ext-media-tags/0.42.8/flexmark-ext-media-tags-0.42.8.jar
[INFO] Downloaded from central: https://repo.maven.apache.org/maven2/com/vladsch/flexmark/flexmark-ext-jekyll-front-matter/0.42.8/flexmark-ext-jekyll-front-matter-0.42.8.jar (18 kB at 70 kB/s)
[INFO] Downloading from central: https://repo.maven.apache.org/maven2/com/vladsch/flexmark/flexmark-ext-macros/0.42.8/flexmark-ext-macros-0.42.8.jar
[INFO] Downloaded from central: https://repo.maven.apache.org/maven2/com/vladsch/flexmark/flexmark-ext-gfm-users/0.42.8/flexmark-ext-gfm-users-0.42.8.jar (16 kB at 60 kB/s)
[INFO] Downloading from central: https://repo.maven.apache.org/maven2/com/vladsch/flexmark/flexmark-ext-ins/0.42.8/flexmark-ext-ins-0.42.8.jar
[INFO] Downloaded from central: https://repo.maven.apache.org/maven2/com/vladsch/flexmark/flexmark-ext-jekyll-tag/0.42.8/flexmark-ext-jekyll-tag-0.42.8.jar (21 kB at 80 kB/s)
[INFO] Downloading from central: https://repo.maven.apache.org/maven2/com/vladsch/flexmark/flexmark-ext-xwiki-macros/0.42.8/flexmark-ext-xwiki-macros-0.42.8.jar
[INFO] Downloaded from central: https://repo.maven.apache.org/maven2/com/vladsch/flexmark/flexmark-ext-gitlab/0.42.8/flexmark-ext-gitlab-0.42.8.jar (42 kB at 159 kB/s)
[INFO] Downloading from central: https://repo.maven.apache.org/maven2/com/vladsch/flexmark/flexmark-ext-superscript/0.42.8/flexmark-ext-superscript-0.42.8.jar
[INFO] Downloaded from central: https://repo.maven.apache.org/maven2/com/vladsch/flexmark/flexmark-ext-macros/0.42.8/flexmark-ext-macros-0.42.8.jar (35 kB at 130 kB/s)
[INFO] Downloading from central: https://repo.maven.apache.org/maven2/com/vladsch/flexmark/flexmark-ext-tables/0.42.8/flexmark-ext-tables-0.42.8.jar
[INFO] Downloaded from central: https://repo.maven.apache.org/maven2/com/vladsch/flexmark/flexmark-ext-media-tags/0.42.8/flexmark-ext-media-tags-0.42.8.jar (25 kB at 92 kB/s)
[INFO] Downloading from central: https://repo.maven.apache.org/maven2/com/vladsch/flexmark/flexmark-ext-toc/0.42.8/flexmark-ext-toc-0.42.8.jar
[INFO] Downloaded from central: https://repo.maven.apache.org/maven2/com/vladsch/flexmark/flexmark-ext-ins/0.42.8/flexmark-ext-ins-0.42.8.jar (13 kB at 47 kB/s)
[INFO] Downloading from central: https://repo.maven.apache.org/maven2/com/vladsch/flexmark/flexmark-ext-typographic/0.42.8/flexmark-ext-typographic-0.42.8.jar
[INFO] Downloaded from central: https://repo.maven.apache.org/maven2/com/vladsch/flexmark/flexmark-ext-xwiki-macros/0.42.8/flexmark-ext-xwiki-macros-0.42.8.jar (31 kB at 112 kB/s)
[INFO] Downloading from central: https://repo.maven.apache.org/maven2/com/vladsch/flexmark/flexmark-ext-wikilink/0.42.8/flexmark-ext-wikilink-0.42.8.jar
[INFO] Downloaded from central: https://repo.maven.apache.org/maven2/com/vladsch/flexmark/flexmark-ext-tables/0.42.8/flexmark-ext-tables-0.42.8.jar (76 kB at 274 kB/s)
[INFO] Downloading from central: https://repo.maven.apache.org/maven2/com/vladsch/flexmark/flexmark-ext-yaml-front-matter/0.42.8/flexmark-ext-yaml-front-matter-0.42.8.jar
[INFO] Downloaded from central: https://repo.maven.apache.org/maven2/com/vladsch/flexmark/flexmark-ext-superscript/0.42.8/flexmark-ext-superscript-0.42.8.jar (13 kB at 48 kB/s)
[INFO] Downloading from central: https://repo.maven.apache.org/maven2/com/vladsch/flexmark/flexmark-ext-youtube-embedded/0.42.8/flexmark-ext-youtube-embedded-0.42.8.jar
[INFO] Downloaded from central: https://repo.maven.apache.org/maven2/com/vladsch/flexmark/flexmark-ext-typographic/0.42.8/flexmark-ext-typographic-0.42.8.jar (22 kB at 78 kB/s)
[INFO] Downloading from central: https://repo.maven.apache.org/maven2/com/vladsch/flexmark/flexmark-formatter/0.42.8/flexmark-formatter-0.42.8.jar
[INFO] Downloaded from central: https://repo.maven.apache.org/maven2/com/vladsch/flexmark/flexmark-ext-wikilink/0.42.8/flexmark-ext-wikilink-0.42.8.jar (26 kB at 90 kB/s)
[INFO] Downloading from central: https://repo.maven.apache.org/maven2/com/vladsch/flexmark/flexmark-html-parser/0.42.8/flexmark-html-parser-0.42.8.jar
[INFO] Downloaded from central: https://repo.maven.apache.org/maven2/com/vladsch/flexmark/flexmark-ext-toc/0.42.8/flexmark-ext-toc-0.42.8.jar (91 kB at 307 kB/s)
[INFO] Downloading from central: https://repo.maven.apache.org/maven2/com/vladsch/flexmark/flexmark-jira-converter/0.42.8/flexmark-jira-converter-0.42.8.jar
[INFO] Downloaded from central: https://repo.maven.apache.org/maven2/com/vladsch/flexmark/flexmark-formatter/0.42.8/flexmark-formatter-0.42.8.jar (97 kB at 328 kB/s)
[INFO] Downloading from central: https://repo.maven.apache.org/maven2/com/vladsch/flexmark/flexmark-profile-pegdown/0.42.8/flexmark-profile-pegdown-0.42.8.jar
[INFO] Downloaded from central: https://repo.maven.apache.org/maven2/com/vladsch/flexmark/flexmark-ext-yaml-front-matter/0.42.8/flexmark-ext-yaml-front-matter-0.42.8.jar (18 kB at 61 kB/s)
[INFO] Downloading from central: https://repo.maven.apache.org/maven2/com/vladsch/flexmark/flexmark-util/0.42.8/flexmark-util-0.42.8.jar
[INFO] Downloaded from central: https://repo.maven.apache.org/maven2/com/vladsch/flexmark/flexmark-html-parser/0.42.8/flexmark-html-parser-0.42.8.jar (44 kB at 148 kB/s)
[INFO] Downloading from central: https://repo.maven.apache.org/maven2/com/vladsch/flexmark/flexmark-youtrack-converter/0.42.8/flexmark-youtrack-converter-0.42.8.jar
[INFO] Downloaded from central: https://repo.maven.apache.org/maven2/com/vladsch/flexmark/flexmark-jira-converter/0.42.8/flexmark-jira-converter-0.42.8.jar (40 kB at 131 kB/s)
[INFO] Downloading from central: https://repo.maven.apache.org/maven2/xalan/xalan/2.7.0/xalan-2.7.0.jar
[INFO] Downloaded from central: https://repo.maven.apache.org/maven2/com/vladsch/flexmark/flexmark-ext-youtube-embedded/0.42.8/flexmark-ext-youtube-embedded-0.42.8.jar (13 kB at 41 kB/s)
[INFO] Downloaded from central: https://repo.maven.apache.org/maven2/com/vladsch/flexmark/flexmark-profile-pegdown/0.42.8/flexmark-profile-pegdown-0.42.8.jar (6.3 kB at 21 kB/s)
[INFO] Downloaded from central: https://repo.maven.apache.org/maven2/com/vladsch/flexmark/flexmark-util/0.42.8/flexmark-util-0.42.8.jar (385 kB at 1.2 MB/s)
[INFO] Downloaded from central: https://repo.maven.apache.org/maven2/com/vladsch/flexmark/flexmark-youtrack-converter/0.42.8/flexmark-youtrack-converter-0.42.8.jar (41 kB at 121 kB/s)
[INFO] Downloaded from central: https://repo.maven.apache.org/maven2/xalan/xalan/2.7.0/xalan-2.7.0.jar (2.7 MB at 7.5 MB/s)
[INFO] 
[INFO] --- maven-clean-plugin:3.1.0:clean (default-clean) @ doxia-doc-renderer ---
[INFO] 
[INFO] --- maven-enforcer-plugin:1.4.1:enforce (enforce-maven-version) @ doxia-doc-renderer ---
[INFO] 
[INFO] --- maven-enforcer-plugin:1.4.1:enforce (enforce-bytecode-version) @ doxia-doc-renderer ---
[INFO] 
[INFO] --- maven-enforcer-plugin:1.4.1:enforce (ban-known-bad-maven-versions) @ doxia-doc-renderer ---
[INFO] 
[INFO] --- apache-rat-plugin:0.12:check (rat-check) @ doxia-doc-renderer ---
[INFO] Enabled default license matchers.
[INFO] Will parse SCM ignores for exclusions...
[INFO] Finished adding exclusions from SCM ignore files.
[INFO] 61 implicit excludes (use -debug for more details).
[INFO] Exclude: src/test/resources/site/confluence/confluence/*.confluence
[INFO] Exclude: src/test/resources/org/apache/maven/doxia/siterenderer/velocity-toolmanager.vm
[INFO] Exclude: src/test/resources/org/apache/maven/doxia/siterenderer/velocity-toolmanager.expected.txt
[INFO] Exclude: src/test/resources/dtd/xhtml-*.ent
[INFO] Exclude: src/test/resources/dtd/xhtml1-transitional.dtd
[INFO] Exclude: src/test/resources/xhtml-lat1.ent
[INFO] Exclude: .repository/**
[INFO] Exclude: .maven/spy.log
[INFO] Exclude: dependency-reduced-pom.xml
[INFO] Exclude: .java-version
[INFO] 32 resources included (use -debug for more details)
[INFO] Rat check: Summary over all files. Unapproved: 0, unknown: 0, generated: 0, approved: 28 licenses.
[INFO] 
[INFO] --- maven-remote-resources-plugin:1.5:process (process-resource-bundles) @ doxia-doc-renderer ---
[INFO] 
[INFO] --- maven-resources-plugin:3.1.0:resources (default-resources) @ doxia-doc-renderer ---
[INFO] Using 'UTF-8' encoding to copy filtered resources.
[INFO] Copying 1 resource
[INFO] skip non existing resourceDirectory F:\jenkins\jenkins-slave\workspace\en-doxia-sitetools_htmlunit-2.24\m\doxia-doc-renderer\target\generated-site\xsd
[INFO] Copying 3 resources
[INFO] 
[INFO] --- maven-compiler-plugin:3.7.0:compile (default-compile) @ doxia-doc-renderer ---
[INFO] Changes detected - recompiling the module!
[INFO] Compiling 14 source files to F:\jenkins\jenkins-slave\workspace\en-doxia-sitetools_htmlunit-2.24\m\doxia-doc-renderer\target\classes
[INFO] /F:/jenkins/jenkins-slave/workspace/en-doxia-sitetools_htmlunit-2.24/m/doxia-doc-renderer/src/main/java/org/apache/maven/doxia/docrenderer/itext/AbstractITextRender.java: Some input files use or override a deprecated API.
[INFO] /F:/jenkins/jenkins-slave/workspace/en-doxia-sitetools_htmlunit-2.24/m/doxia-doc-renderer/src/main/java/org/apache/maven/doxia/docrenderer/itext/AbstractITextRender.java: Recompile with -Xlint:deprecation for details.
[INFO] 
[INFO] --- plexus-component-metadata:1.7.1:generate-metadata (default) @ doxia-doc-renderer ---
[INFO] Discovered 4 component descriptors(s)
[INFO] 
[INFO] --- maven-resources-plugin:3.1.0:testResources (default-testResources) @ doxia-doc-renderer ---
[INFO] Using 'UTF-8' encoding to copy filtered resources.
[INFO] Copying 13 resources
[INFO] Copying 3 resources
[INFO] 
[INFO] --- maven-compiler-plugin:3.7.0:testCompile (default-testCompile) @ doxia-doc-renderer ---
[INFO] Changes detected - recompiling the module!
[INFO] Compiling 1 source file to F:\jenkins\jenkins-slave\workspace\en-doxia-sitetools_htmlunit-2.24\m\doxia-doc-renderer\target\test-classes
[INFO] 
[INFO] --- maven-surefire-plugin:2.22.0:test (default-test) @ doxia-doc-renderer ---
[INFO] 
[INFO] -------------------------------------------------------
[INFO]  T E S T S
[INFO] -------------------------------------------------------
[INFO] Running org.apache.maven.doxia.docrenderer.DocumentRendererTest
[WARNING] [iText Sink] Modified invalid link: 'Frequently Asked Questions_How_to_export_in_PDF' to 'Frequently_Asked_Questions_How_to_export_in_PDF'
[WARNING] [iText Sink] Modified invalid link: 'Frequently Asked Questions_How_to_handle_style_in_the_APT_markup_language' to 'Frequently_Asked_Questions_How_to_handle_style_in_the_APT_markup_language'
[WARNING] [iText Sink] Modified invalid link: 'Frequently Asked Questions_Is_it_possible_to_create_a_book' to 'Frequently_Asked_Questions_Is_it_possible_to_create_a_book'
[WARNING] [iText Sink] Modified invalid link: 'Frequently Asked Questions_top' to 'Frequently_Asked_Questions_top'
[WARNING] [iText Sink] Modified invalid link: 'Frequently Asked Questions_How_to_export_in_PDF' to 'Frequently_Asked_Questions_How_to_export_in_PDF'
[WARNING] [iText Sink] Modified invalid link: 'Frequently Asked Questions_How_to_handle_style_in_the_APT_markup_language' to 'Frequently_Asked_Questions_How_to_handle_style_in_the_APT_markup_language'
[WARNING] [iText Sink] Modified invalid link: 'Frequently Asked Questions_Is_it_possible_to_create_a_book' to 'Frequently_Asked_Questions_Is_it_possible_to_create_a_book'
[WARNING] [iText Sink] Modified invalid link: 'Frequently Asked Questions_top' to 'Frequently_Asked_Questions_top'
[warn] No document root specified, local links will not be resolved correctly!
[INFO] Tests run: 4, Failures: 0, Errors: 0, Skipped: 0, Time elapsed: 3.301 s - in org.apache.maven.doxia.docrenderer.DocumentRendererTest
[INFO] 
[INFO] Results:
[INFO] 
[INFO] Tests run: 4, Failures: 0, Errors: 0, Skipped: 0
[INFO] 
[INFO] 
[INFO] --- maven-jar-plugin:3.1.0:jar (default-jar) @ doxia-doc-renderer ---
[INFO] Building jar: F:\jenkins\jenkins-slave\workspace\en-doxia-sitetools_htmlunit-2.24\m\doxia-doc-renderer\target\doxia-doc-renderer-1.9-SNAPSHOT.jar
[INFO] 
[INFO] --- maven-site-plugin:3.7.1:attach-descriptor (attach-descriptor) @ doxia-doc-renderer ---
[INFO] Skipping because packaging 'jar' is not pom.
[INFO] 
[INFO] --- maven-checkstyle-plugin:3.0.0:check (checkstyle-check) @ doxia-doc-renderer ---
[INFO] 
[INFO] >>> clirr-maven-plugin:2.8:check (default) > compile @ doxia-doc-renderer >>>
[INFO] 
[INFO] --- maven-enforcer-plugin:1.4.1:enforce (enforce-maven-version) @ doxia-doc-renderer ---
[INFO] 
[INFO] --- maven-enforcer-plugin:1.4.1:enforce (enforce-bytecode-version) @ doxia-doc-renderer ---
[INFO] 
[INFO] --- maven-enforcer-plugin:1.4.1:enforce (ban-known-bad-maven-versions) @ doxia-doc-renderer ---
[INFO] 
[INFO] --- apache-rat-plugin:0.12:check (rat-check) @ doxia-doc-renderer ---
[INFO] Enabled default license matchers.
[INFO] Will parse SCM ignores for exclusions...
[INFO] Finished adding exclusions from SCM ignore files.
[INFO] 61 implicit excludes (use -debug for more details).
[INFO] Exclude: src/test/resources/site/confluence/confluence/*.confluence
[INFO] Exclude: src/test/resources/org/apache/maven/doxia/siterenderer/velocity-toolmanager.vm
[INFO] Exclude: src/test/resources/org/apache/maven/doxia/siterenderer/velocity-toolmanager.expected.txt
[INFO] Exclude: src/test/resources/dtd/xhtml-*.ent
[INFO] Exclude: src/test/resources/dtd/xhtml1-transitional.dtd
[INFO] Exclude: src/test/resources/xhtml-lat1.ent
[INFO] Exclude: .repository/**
[INFO] Exclude: .maven/spy.log
[INFO] Exclude: dependency-reduced-pom.xml
[INFO] Exclude: .java-version
[INFO] 32 resources included (use -debug for more details)
[INFO] Rat check: Summary over all files. Unapproved: 0, unknown: 0, generated: 0, approved: 28 licenses.
[INFO] 
[INFO] --- maven-remote-resources-plugin:1.5:process (process-resource-bundles) @ doxia-doc-renderer ---
[INFO] 
[INFO] --- maven-resources-plugin:3.1.0:resources (default-resources) @ doxia-doc-renderer ---
[INFO] Using 'UTF-8' encoding to copy filtered resources.
[INFO] Copying 1 resource
[INFO] skip non existing resourceDirectory F:\jenkins\jenkins-slave\workspace\en-doxia-sitetools_htmlunit-2.24\m\doxia-doc-renderer\target\generated-site\xsd
[INFO] Copying 3 resources
[INFO] Copying 3 resources
[INFO] 
[INFO] --- maven-compiler-plugin:3.7.0:compile (default-compile) @ doxia-doc-renderer ---
[INFO] Nothing to compile - all classes are up to date
[INFO] 
[INFO] <<< clirr-maven-plugin:2.8:check (default) < compile @ doxia-doc-renderer <<<
[INFO] 
[INFO] 
[INFO] --- clirr-maven-plugin:2.8:check (default) @ doxia-doc-renderer ---
[INFO] Skipping execution
[INFO] ------------------------------------------------------------------------
[INFO] Reactor Summary for Doxia Sitetools 1.9-SNAPSHOT:
[INFO] 
[INFO] Doxia Sitetools .................................... SUCCESS [ 10.171 s]
[INFO] Doxia Sitetools :: Decoration Model ................ SUCCESS [  6.150 s]
[INFO] Doxia Sitetools :: Skin Model ...................... SUCCESS [  0.652 s]
[INFO] Doxia Sitetools :: Integration Tools ............... SUCCESS [  3.860 s]
[INFO] Doxia Sitetools :: Site Renderer ................... SUCCESS [  7.810 s]
[INFO] Doxia Sitetools :: Document Renderer ............... SUCCESS [  8.989 s]
[INFO] ------------------------------------------------------------------------
[INFO] BUILD SUCCESS
[INFO] ------------------------------------------------------------------------
[INFO] Total time:  38.421 s
[INFO] Finished at: 2019-06-06T11:25:03Z
[INFO] ------------------------------------------------------------------------
[WARNING] The requested profile "run-its" could not be activated because it does not exist.
[INFO] [jenkins-event-spy] Generated F:\jenkins\jenkins-slave\workspace\en-doxia-sitetools_htmlunit-2.24@tmp\withMaven5819e332\maven-spy-20190606-112425-26010098290497039469420.log
[Pipeline] }
[Pipeline] // dir
[Pipeline] }
[withMaven] junitPublisher - Archive test results for Maven artifact org.apache.maven.doxia:doxia-decoration-model:jar:1.9-SNAPSHOT generated by maven-surefire-plugin:test (default-test): m\doxia-decoration-model\target\surefire-reports\*.xml
[withMaven] junitPublisher - Archive test results for Maven artifact org.apache.maven.doxia:doxia-skin-model:jar:1.9-SNAPSHOT generated by maven-surefire-plugin:test (default-test): m\doxia-skin-model\target\surefire-reports\*.xml
[withMaven] junitPublisher - Archive test results for Maven artifact org.apache.maven.doxia:doxia-integration-tools:jar:1.9-SNAPSHOT generated by maven-surefire-plugin:test (default-test): m\doxia-integration-tools\target\surefire-reports\*.xml
[withMaven] junitPublisher - Archive test results for Maven artifact org.apache.maven.doxia:doxia-site-renderer:jar:1.9-SNAPSHOT generated by maven-surefire-plugin:test (default-test): m\doxia-site-renderer\target\surefire-reports\*.xml
[withMaven] junitPublisher - Archive test results for Maven artifact org.apache.maven.doxia:doxia-doc-renderer:jar:1.9-SNAPSHOT generated by maven-surefire-plugin:test (default-test): m\doxia-doc-renderer\target\surefire-reports\*.xml
Recording test results
[withMaven] Publishers: Pipeline Graph Publisher: 8 ms, Invoker Publisher: 1 ms, Junit Publisher: 3883 ms, Concordion Publisher: 1 ms, Dependencies Fingerprint Publisher: 1218 ms, JGiven Publisher: 1 ms
[Pipeline] // withMaven
[Pipeline] cleanWs
[WS-CLEANUP] Deleting project workspace...
[WS-CLEANUP] Deferred wipeout is used...
[WS-CLEANUP] done
[Pipeline] }
[Pipeline] // stage
[Pipeline] }
[Pipeline] // node
[Pipeline] }
[Pipeline] // parallel
[Pipeline] stage
[Pipeline] { (Notifications)
[Pipeline] echo
Build result: UNSTABLE
[Pipeline] jiraIssueSelector
[Pipeline] emailext

Build unstable in Jenkins: Maven TLP » maven-doxia-sitetools » htmlunit-2.24 #4

Posted by Apache Jenkins Server <je...@builds.apache.org>.
See https://builds.apache.org/job/maven-box/job/maven-doxia-sitetools/job/htmlunit-2.24/4/

Changes:

* Disable CSS
* Disable CSS
* Disable CSS
* Disable CSS
* Disable CSS
* Disable CSS

8 tests failed.
FAILED:  org.apache.maven.doxia.siterenderer.DefaultSiteRendererTest.windows-jdk11 / Build windows-jdk11 / testRender

Error Message:
null

Stack Trace:
junit.framework.AssertionFailedError
	at junit.framework.Assert.fail(Assert.java:47)
	at junit.framework.Assert.assertTrue(Assert.java:20)
	at junit.framework.Assert.assertTrue(Assert.java:27)
	at org.apache.maven.doxia.siterenderer.EntitiesVerifier.verify(EntitiesVerifier.java:52)
	at org.apache.maven.doxia.siterenderer.DefaultSiteRendererTest.verifyEntitiesPage(DefaultSiteRendererTest.java:392)
	at org.apache.maven.doxia.siterenderer.DefaultSiteRendererTest.testRender(DefaultSiteRendererTest.java:180)


FAILED:  org.apache.maven.doxia.siterenderer.DefaultSiteRendererTest.linux-jdk11 / Build linux-jdk11 / testRender

Error Message:
null

Stack Trace:
junit.framework.AssertionFailedError
	at junit.framework.Assert.fail(Assert.java:47)
	at junit.framework.Assert.assertTrue(Assert.java:20)
	at junit.framework.Assert.assertTrue(Assert.java:27)
	at org.apache.maven.doxia.siterenderer.EntitiesVerifier.verify(EntitiesVerifier.java:52)
	at org.apache.maven.doxia.siterenderer.DefaultSiteRendererTest.verifyEntitiesPage(DefaultSiteRendererTest.java:392)
	at org.apache.maven.doxia.siterenderer.DefaultSiteRendererTest.testRender(DefaultSiteRendererTest.java:180)


FAILED:  org.apache.maven.doxia.siterenderer.DefaultSiteRendererTest.linux-jdk8 / Build linux-jdk8 / testRender

Error Message:
null

Stack Trace:
junit.framework.AssertionFailedError
	at junit.framework.Assert.fail(Assert.java:47)
	at junit.framework.Assert.assertTrue(Assert.java:20)
	at junit.framework.Assert.assertTrue(Assert.java:27)
	at org.apache.maven.doxia.siterenderer.EntitiesVerifier.verify(EntitiesVerifier.java:52)
	at org.apache.maven.doxia.siterenderer.DefaultSiteRendererTest.verifyEntitiesPage(DefaultSiteRendererTest.java:392)
	at org.apache.maven.doxia.siterenderer.DefaultSiteRendererTest.testRender(DefaultSiteRendererTest.java:180)


FAILED:  org.apache.maven.doxia.siterenderer.DefaultSiteRendererTest.windows-jdk8 / Build windows-jdk8 / testRender

Error Message:
null

Stack Trace:
junit.framework.AssertionFailedError
	at junit.framework.Assert.fail(Assert.java:47)
	at junit.framework.Assert.assertTrue(Assert.java:20)
	at junit.framework.Assert.assertTrue(Assert.java:27)
	at org.apache.maven.doxia.siterenderer.EntitiesVerifier.verify(EntitiesVerifier.java:52)
	at org.apache.maven.doxia.siterenderer.DefaultSiteRendererTest.verifyEntitiesPage(DefaultSiteRendererTest.java:392)
	at org.apache.maven.doxia.siterenderer.DefaultSiteRendererTest.testRender(DefaultSiteRendererTest.java:180)


FAILED:  org.apache.maven.doxia.siterenderer.DefaultSiteRendererTest.linux-jdk7 / Build linux-jdk7 / testRender

Error Message:
null

Stack Trace:
junit.framework.AssertionFailedError
	at junit.framework.Assert.fail(Assert.java:47)
	at junit.framework.Assert.assertTrue(Assert.java:20)
	at junit.framework.Assert.assertTrue(Assert.java:27)
	at org.apache.maven.doxia.siterenderer.EntitiesVerifier.verify(EntitiesVerifier.java:52)
	at org.apache.maven.doxia.siterenderer.DefaultSiteRendererTest.verifyEntitiesPage(DefaultSiteRendererTest.java:392)
	at org.apache.maven.doxia.siterenderer.DefaultSiteRendererTest.testRender(DefaultSiteRendererTest.java:180)


FAILED:  org.apache.maven.doxia.siterenderer.DefaultSiteRendererTest.windows-jdk7 / Build windows-jdk7 / testRender

Error Message:
null

Stack Trace:
junit.framework.AssertionFailedError
	at junit.framework.Assert.fail(Assert.java:47)
	at junit.framework.Assert.assertTrue(Assert.java:20)
	at junit.framework.Assert.assertTrue(Assert.java:27)
	at org.apache.maven.doxia.siterenderer.EntitiesVerifier.verify(EntitiesVerifier.java:52)
	at org.apache.maven.doxia.siterenderer.DefaultSiteRendererTest.verifyEntitiesPage(DefaultSiteRendererTest.java:392)
	at org.apache.maven.doxia.siterenderer.DefaultSiteRendererTest.testRender(DefaultSiteRendererTest.java:180)


FAILED:  org.apache.maven.doxia.siterenderer.DefaultSiteRendererTest.windows-jdk12 / Build windows-jdk12 / testRender

Error Message:
null

Stack Trace:
junit.framework.AssertionFailedError
	at junit.framework.Assert.fail(Assert.java:47)
	at junit.framework.Assert.assertTrue(Assert.java:20)
	at junit.framework.Assert.assertTrue(Assert.java:27)
	at org.apache.maven.doxia.siterenderer.EntitiesVerifier.verify(EntitiesVerifier.java:52)
	at org.apache.maven.doxia.siterenderer.DefaultSiteRendererTest.verifyEntitiesPage(DefaultSiteRendererTest.java:392)
	at org.apache.maven.doxia.siterenderer.DefaultSiteRendererTest.testRender(DefaultSiteRendererTest.java:180)


FAILED:  org.apache.maven.doxia.siterenderer.DefaultSiteRendererTest.linux-jdk12 / Build linux-jdk12 / testRender

Error Message:
null

Stack Trace:
junit.framework.AssertionFailedError
	at junit.framework.Assert.fail(Assert.java:47)
	at junit.framework.Assert.assertTrue(Assert.java:20)
	at junit.framework.Assert.assertTrue(Assert.java:27)
	at org.apache.maven.doxia.siterenderer.EntitiesVerifier.verify(EntitiesVerifier.java:52)
	at org.apache.maven.doxia.siterenderer.DefaultSiteRendererTest.verifyEntitiesPage(DefaultSiteRendererTest.java:392)
	at org.apache.maven.doxia.siterenderer.DefaultSiteRendererTest.testRender(DefaultSiteRendererTest.java:180)




Build log:
[...truncated 26576 lines...]
[INFO] Downloaded from central: https://repo.maven.apache.org/maven2/com/vladsch/flexmark/flexmark-all/0.42.8/flexmark-all-0.42.8.jar (2.2 kB at 14 kB/s)
[INFO] Downloaded from central: https://repo.maven.apache.org/maven2/org/apache/maven/doxia/doxia-module-markdown/1.9/doxia-module-markdown-1.9.jar (23 kB at 151 kB/s)
[INFO] Downloading from central: https://repo.maven.apache.org/maven2/com/vladsch/flexmark/flexmark-ext-admonition/0.42.8/flexmark-ext-admonition-0.42.8.jar
[INFO] Downloading from central: https://repo.maven.apache.org/maven2/com/vladsch/flexmark/flexmark-ext-abbreviation/0.42.8/flexmark-ext-abbreviation-0.42.8.jar
[INFO] Downloaded from central: https://repo.maven.apache.org/maven2/com/vladsch/flexmark/flexmark/0.42.8/flexmark-0.42.8.jar (388 kB at 2.4 MB/s)
[INFO] Downloading from central: https://repo.maven.apache.org/maven2/com/vladsch/flexmark/flexmark-ext-anchorlink/0.42.8/flexmark-ext-anchorlink-0.42.8.jar
[INFO] Downloaded from central: https://repo.maven.apache.org/maven2/log4j/log4j/1.2.17/log4j-1.2.17.jar (490 kB at 3.0 MB/s)
[INFO] Downloading from central: https://repo.maven.apache.org/maven2/com/vladsch/flexmark/flexmark-ext-aside/0.42.8/flexmark-ext-aside-0.42.8.jar
[INFO] Downloaded from central: https://repo.maven.apache.org/maven2/com/vladsch/flexmark/flexmark-ext-abbreviation/0.42.8/flexmark-ext-abbreviation-0.42.8.jar (35 kB at 212 kB/s)
[INFO] Downloading from central: https://repo.maven.apache.org/maven2/com/vladsch/flexmark/flexmark-ext-attributes/0.42.8/flexmark-ext-attributes-0.42.8.jar
[INFO] Downloaded from central: https://repo.maven.apache.org/maven2/com/vladsch/flexmark/flexmark-ext-admonition/0.42.8/flexmark-ext-admonition-0.42.8.jar (34 kB at 205 kB/s)
[INFO] Downloading from central: https://repo.maven.apache.org/maven2/com/vladsch/flexmark/flexmark-ext-autolink/0.42.8/flexmark-ext-autolink-0.42.8.jar
[INFO] Downloaded from central: https://repo.maven.apache.org/maven2/com/vladsch/flexmark/flexmark-ext-anchorlink/0.42.8/flexmark-ext-anchorlink-0.42.8.jar (17 kB at 97 kB/s)
[INFO] Downloading from central: https://repo.maven.apache.org/maven2/com/vladsch/flexmark/flexmark-ext-definition/0.42.8/flexmark-ext-definition-0.42.8.jar
[INFO] Downloaded from central: https://repo.maven.apache.org/maven2/com/vladsch/flexmark/flexmark-ext-aside/0.42.8/flexmark-ext-aside-0.42.8.jar (16 kB at 92 kB/s)
[INFO] Downloading from central: https://repo.maven.apache.org/maven2/com/vladsch/flexmark/flexmark-ext-emoji/0.42.8/flexmark-ext-emoji-0.42.8.jar
[INFO] Downloaded from central: https://repo.maven.apache.org/maven2/com/vladsch/flexmark/flexmark-ext-autolink/0.42.8/flexmark-ext-autolink-0.42.8.jar (9.4 kB at 52 kB/s)
[INFO] Downloading from central: https://repo.maven.apache.org/maven2/com/vladsch/flexmark/flexmark-ext-enumerated-reference/0.42.8/flexmark-ext-enumerated-reference-0.42.8.jar
[INFO] Downloaded from central: https://repo.maven.apache.org/maven2/com/vladsch/flexmark/flexmark-ext-attributes/0.42.8/flexmark-ext-attributes-0.42.8.jar (36 kB at 198 kB/s)
[INFO] Downloading from central: https://repo.maven.apache.org/maven2/com/vladsch/flexmark/flexmark-ext-escaped-character/0.42.8/flexmark-ext-escaped-character-0.42.8.jar
[INFO] Downloaded from central: https://repo.maven.apache.org/maven2/org/apache/pdfbox/fontbox/2.0.7/fontbox-2.0.7.jar (1.5 MB at 8.1 MB/s)
[INFO] Downloading from central: https://repo.maven.apache.org/maven2/com/vladsch/flexmark/flexmark-ext-footnotes/0.42.8/flexmark-ext-footnotes-0.42.8.jar
[INFO] Downloaded from central: https://repo.maven.apache.org/maven2/com/vladsch/flexmark/flexmark-ext-definition/0.42.8/flexmark-ext-definition-0.42.8.jar (40 kB at 215 kB/s)
[INFO] Downloading from central: https://repo.maven.apache.org/maven2/com/vladsch/flexmark/flexmark-ext-gfm-issues/0.42.8/flexmark-ext-gfm-issues-0.42.8.jar
[INFO] Downloaded from central: https://repo.maven.apache.org/maven2/com/vladsch/flexmark/flexmark-ext-emoji/0.42.8/flexmark-ext-emoji-0.42.8.jar (73 kB at 392 kB/s)
[INFO] Downloading from central: https://repo.maven.apache.org/maven2/com/vladsch/flexmark/flexmark-ext-gfm-strikethrough/0.42.8/flexmark-ext-gfm-strikethrough-0.42.8.jar
[INFO] Downloaded from central: https://repo.maven.apache.org/maven2/com/vladsch/flexmark/flexmark-ext-escaped-character/0.42.8/flexmark-ext-escaped-character-0.42.8.jar (13 kB at 67 kB/s)
[INFO] Downloaded from central: https://repo.maven.apache.org/maven2/com/vladsch/flexmark/flexmark-ext-enumerated-reference/0.42.8/flexmark-ext-enumerated-reference-0.42.8.jar (66 kB at 346 kB/s)
[INFO] Downloading from central: https://repo.maven.apache.org/maven2/com/vladsch/flexmark/flexmark-ext-gfm-tables/0.42.8/flexmark-ext-gfm-tables-0.42.8.jar
[INFO] Downloading from central: https://repo.maven.apache.org/maven2/com/vladsch/flexmark/flexmark-ext-gfm-tasklist/0.42.8/flexmark-ext-gfm-tasklist-0.42.8.jar
[INFO] Downloaded from central: https://repo.maven.apache.org/maven2/com/vladsch/flexmark/flexmark-ext-footnotes/0.42.8/flexmark-ext-footnotes-0.42.8.jar (41 kB at 213 kB/s)
[INFO] Downloading from central: https://repo.maven.apache.org/maven2/com/vladsch/flexmark/flexmark-ext-gfm-users/0.42.8/flexmark-ext-gfm-users-0.42.8.jar
[INFO] Downloaded from central: https://repo.maven.apache.org/maven2/com/vladsch/flexmark/flexmark-ext-gfm-issues/0.42.8/flexmark-ext-gfm-issues-0.42.8.jar (16 kB at 79 kB/s)
[INFO] Downloading from central: https://repo.maven.apache.org/maven2/com/vladsch/flexmark/flexmark-ext-gitlab/0.42.8/flexmark-ext-gitlab-0.42.8.jar
[INFO] Downloaded from central: https://repo.maven.apache.org/maven2/com/vladsch/flexmark/flexmark-ext-gfm-strikethrough/0.42.8/flexmark-ext-gfm-strikethrough-0.42.8.jar (29 kB at 143 kB/s)
[INFO] Downloading from central: https://repo.maven.apache.org/maven2/com/vladsch/flexmark/flexmark-ext-jekyll-front-matter/0.42.8/flexmark-ext-jekyll-front-matter-0.42.8.jar
[INFO] Downloaded from central: https://repo.maven.apache.org/maven2/com/vladsch/flexmark/flexmark-ext-gfm-tables/0.42.8/flexmark-ext-gfm-tables-0.42.8.jar (33 kB at 163 kB/s)
[INFO] Downloading from central: https://repo.maven.apache.org/maven2/com/vladsch/flexmark/flexmark-ext-jekyll-tag/0.42.8/flexmark-ext-jekyll-tag-0.42.8.jar
[INFO] Downloaded from central: https://repo.maven.apache.org/maven2/com/vladsch/flexmark/flexmark-ext-gfm-tasklist/0.42.8/flexmark-ext-gfm-tasklist-0.42.8.jar (28 kB at 136 kB/s)
[INFO] Downloading from central: https://repo.maven.apache.org/maven2/com/vladsch/flexmark/flexmark-ext-media-tags/0.42.8/flexmark-ext-media-tags-0.42.8.jar
[INFO] Downloaded from central: https://repo.maven.apache.org/maven2/com/vladsch/flexmark/flexmark-ext-gfm-users/0.42.8/flexmark-ext-gfm-users-0.42.8.jar (16 kB at 77 kB/s)
[INFO] Downloading from central: https://repo.maven.apache.org/maven2/com/vladsch/flexmark/flexmark-ext-macros/0.42.8/flexmark-ext-macros-0.42.8.jar
[INFO] Downloaded from central: https://repo.maven.apache.org/maven2/com/vladsch/flexmark/flexmark-ext-gitlab/0.42.8/flexmark-ext-gitlab-0.42.8.jar (42 kB at 202 kB/s)
[INFO] Downloading from central: https://repo.maven.apache.org/maven2/com/vladsch/flexmark/flexmark-ext-ins/0.42.8/flexmark-ext-ins-0.42.8.jar
[INFO] Downloaded from central: https://repo.maven.apache.org/maven2/com/vladsch/flexmark/flexmark-ext-jekyll-front-matter/0.42.8/flexmark-ext-jekyll-front-matter-0.42.8.jar (18 kB at 86 kB/s)
[INFO] Downloading from central: https://repo.maven.apache.org/maven2/com/vladsch/flexmark/flexmark-ext-xwiki-macros/0.42.8/flexmark-ext-xwiki-macros-0.42.8.jar
[INFO] Downloaded from central: https://repo.maven.apache.org/maven2/com/vladsch/flexmark/flexmark-ext-jekyll-tag/0.42.8/flexmark-ext-jekyll-tag-0.42.8.jar (21 kB at 98 kB/s)
[INFO] Downloading from central: https://repo.maven.apache.org/maven2/com/vladsch/flexmark/flexmark-ext-superscript/0.42.8/flexmark-ext-superscript-0.42.8.jar
[INFO] Downloaded from central: https://repo.maven.apache.org/maven2/com/vladsch/flexmark/flexmark-ext-media-tags/0.42.8/flexmark-ext-media-tags-0.42.8.jar (25 kB at 115 kB/s)
[INFO] Downloading from central: https://repo.maven.apache.org/maven2/com/vladsch/flexmark/flexmark-ext-tables/0.42.8/flexmark-ext-tables-0.42.8.jar
[INFO] Downloaded from central: https://repo.maven.apache.org/maven2/com/vladsch/flexmark/flexmark-ext-macros/0.42.8/flexmark-ext-macros-0.42.8.jar (35 kB at 161 kB/s)
[INFO] Downloading from central: https://repo.maven.apache.org/maven2/com/vladsch/flexmark/flexmark-ext-toc/0.42.8/flexmark-ext-toc-0.42.8.jar
[INFO] Downloaded from central: https://repo.maven.apache.org/maven2/com/vladsch/flexmark/flexmark-ext-ins/0.42.8/flexmark-ext-ins-0.42.8.jar (13 kB at 59 kB/s)
[INFO] Downloading from central: https://repo.maven.apache.org/maven2/com/vladsch/flexmark/flexmark-ext-typographic/0.42.8/flexmark-ext-typographic-0.42.8.jar
[INFO] Downloaded from central: https://repo.maven.apache.org/maven2/com/vladsch/flexmark/flexmark-ext-xwiki-macros/0.42.8/flexmark-ext-xwiki-macros-0.42.8.jar (31 kB at 137 kB/s)
[INFO] Downloading from central: https://repo.maven.apache.org/maven2/com/vladsch/flexmark/flexmark-ext-wikilink/0.42.8/flexmark-ext-wikilink-0.42.8.jar
[INFO] Downloaded from central: https://repo.maven.apache.org/maven2/com/vladsch/flexmark/flexmark-ext-superscript/0.42.8/flexmark-ext-superscript-0.42.8.jar (13 kB at 59 kB/s)
[INFO] Downloading from central: https://repo.maven.apache.org/maven2/com/vladsch/flexmark/flexmark-ext-yaml-front-matter/0.42.8/flexmark-ext-yaml-front-matter-0.42.8.jar
[INFO] Downloaded from central: https://repo.maven.apache.org/maven2/com/vladsch/flexmark/flexmark-ext-tables/0.42.8/flexmark-ext-tables-0.42.8.jar (76 kB at 330 kB/s)
[INFO] Downloading from central: https://repo.maven.apache.org/maven2/com/vladsch/flexmark/flexmark-ext-youtube-embedded/0.42.8/flexmark-ext-youtube-embedded-0.42.8.jar
[INFO] Downloaded from central: https://repo.maven.apache.org/maven2/com/vladsch/flexmark/flexmark-ext-toc/0.42.8/flexmark-ext-toc-0.42.8.jar (91 kB at 387 kB/s)
[INFO] Downloading from central: https://repo.maven.apache.org/maven2/com/vladsch/flexmark/flexmark-formatter/0.42.8/flexmark-formatter-0.42.8.jar
[INFO] Downloaded from central: https://repo.maven.apache.org/maven2/com/vladsch/flexmark/flexmark-ext-typographic/0.42.8/flexmark-ext-typographic-0.42.8.jar (22 kB at 94 kB/s)
[INFO] Downloading from central: https://repo.maven.apache.org/maven2/com/vladsch/flexmark/flexmark-html-parser/0.42.8/flexmark-html-parser-0.42.8.jar
[INFO] Downloaded from central: https://repo.maven.apache.org/maven2/com/vladsch/flexmark/flexmark-ext-wikilink/0.42.8/flexmark-ext-wikilink-0.42.8.jar (26 kB at 107 kB/s)
[INFO] Downloading from central: https://repo.maven.apache.org/maven2/com/vladsch/flexmark/flexmark-jira-converter/0.42.8/flexmark-jira-converter-0.42.8.jar
[INFO] Downloaded from central: https://repo.maven.apache.org/maven2/com/vladsch/flexmark/flexmark-ext-yaml-front-matter/0.42.8/flexmark-ext-yaml-front-matter-0.42.8.jar (18 kB at 77 kB/s)
[INFO] Downloading from central: https://repo.maven.apache.org/maven2/com/vladsch/flexmark/flexmark-profile-pegdown/0.42.8/flexmark-profile-pegdown-0.42.8.jar
[INFO] Downloaded from central: https://repo.maven.apache.org/maven2/com/vladsch/flexmark/flexmark-ext-youtube-embedded/0.42.8/flexmark-ext-youtube-embedded-0.42.8.jar (13 kB at 52 kB/s)
[INFO] Downloading from central: https://repo.maven.apache.org/maven2/com/vladsch/flexmark/flexmark-util/0.42.8/flexmark-util-0.42.8.jar
[INFO] Downloaded from central: https://repo.maven.apache.org/maven2/com/vladsch/flexmark/flexmark-html-parser/0.42.8/flexmark-html-parser-0.42.8.jar (44 kB at 179 kB/s)
[INFO] Downloaded from central: https://repo.maven.apache.org/maven2/com/vladsch/flexmark/flexmark-formatter/0.42.8/flexmark-formatter-0.42.8.jar (97 kB at 393 kB/s)
[INFO] Downloading from central: https://repo.maven.apache.org/maven2/xalan/xalan/2.7.0/xalan-2.7.0.jar
[INFO] Downloading from central: https://repo.maven.apache.org/maven2/com/vladsch/flexmark/flexmark-youtrack-converter/0.42.8/flexmark-youtrack-converter-0.42.8.jar
[INFO] Downloaded from central: https://repo.maven.apache.org/maven2/com/vladsch/flexmark/flexmark-profile-pegdown/0.42.8/flexmark-profile-pegdown-0.42.8.jar (6.3 kB at 25 kB/s)
[INFO] Downloaded from central: https://repo.maven.apache.org/maven2/com/vladsch/flexmark/flexmark-jira-converter/0.42.8/flexmark-jira-converter-0.42.8.jar (40 kB at 158 kB/s)
[INFO] Downloaded from central: https://repo.maven.apache.org/maven2/com/vladsch/flexmark/flexmark-util/0.42.8/flexmark-util-0.42.8.jar (385 kB at 1.5 MB/s)
[INFO] Downloaded from central: https://repo.maven.apache.org/maven2/com/vladsch/flexmark/flexmark-youtrack-converter/0.42.8/flexmark-youtrack-converter-0.42.8.jar (41 kB at 155 kB/s)
[INFO] Downloaded from central: https://repo.maven.apache.org/maven2/xalan/xalan/2.7.0/xalan-2.7.0.jar (2.7 MB at 8.5 MB/s)
[INFO] 
[INFO] --- maven-clean-plugin:3.1.0:clean (default-clean) @ doxia-doc-renderer ---
[INFO] 
[INFO] --- maven-enforcer-plugin:1.4.1:enforce (enforce-maven-version) @ doxia-doc-renderer ---
[INFO] 
[INFO] --- maven-enforcer-plugin:1.4.1:enforce (enforce-bytecode-version) @ doxia-doc-renderer ---
[INFO] 
[INFO] --- maven-enforcer-plugin:1.4.1:enforce (ban-known-bad-maven-versions) @ doxia-doc-renderer ---
[INFO] 
[INFO] --- apache-rat-plugin:0.12:check (rat-check) @ doxia-doc-renderer ---
[INFO] Enabled default license matchers.
[INFO] Will parse SCM ignores for exclusions...
[INFO] Finished adding exclusions from SCM ignore files.
[INFO] 61 implicit excludes (use -debug for more details).
[INFO] Exclude: src/test/resources/site/confluence/confluence/*.confluence
[INFO] Exclude: src/test/resources/org/apache/maven/doxia/siterenderer/velocity-toolmanager.vm
[INFO] Exclude: src/test/resources/org/apache/maven/doxia/siterenderer/velocity-toolmanager.expected.txt
[INFO] Exclude: src/test/resources/dtd/xhtml-*.ent
[INFO] Exclude: src/test/resources/dtd/xhtml1-transitional.dtd
[INFO] Exclude: src/test/resources/xhtml-lat1.ent
[INFO] Exclude: .repository/**
[INFO] Exclude: .maven/spy.log
[INFO] Exclude: dependency-reduced-pom.xml
[INFO] Exclude: .java-version
[INFO] 32 resources included (use -debug for more details)
[INFO] Rat check: Summary over all files. Unapproved: 0, unknown: 0, generated: 0, approved: 28 licenses.
[INFO] 
[INFO] --- maven-remote-resources-plugin:1.5:process (process-resource-bundles) @ doxia-doc-renderer ---
[INFO] 
[INFO] --- maven-resources-plugin:3.1.0:resources (default-resources) @ doxia-doc-renderer ---
[INFO] Using 'UTF-8' encoding to copy filtered resources.
[INFO] Copying 1 resource
[INFO] skip non existing resourceDirectory /home/jenkins/jenkins-slave/workspace/en-doxia-sitetools_htmlunit-2.24/m/doxia-doc-renderer/target/generated-site/xsd
[INFO] Copying 3 resources
[INFO] 
[INFO] --- maven-compiler-plugin:3.7.0:compile (default-compile) @ doxia-doc-renderer ---
[INFO] Changes detected - recompiling the module!
[INFO] Compiling 14 source files to /home/jenkins/jenkins-slave/workspace/en-doxia-sitetools_htmlunit-2.24/m/doxia-doc-renderer/target/classes
[INFO] /home/jenkins/jenkins-slave/workspace/en-doxia-sitetools_htmlunit-2.24/m/doxia-doc-renderer/src/main/java/org/apache/maven/doxia/docrenderer/itext/AbstractITextRender.java: Some input files use or override a deprecated API.
[INFO] /home/jenkins/jenkins-slave/workspace/en-doxia-sitetools_htmlunit-2.24/m/doxia-doc-renderer/src/main/java/org/apache/maven/doxia/docrenderer/itext/AbstractITextRender.java: Recompile with -Xlint:deprecation for details.
[INFO] 
[INFO] --- plexus-component-metadata:1.7.1:generate-metadata (default) @ doxia-doc-renderer ---
[INFO] Discovered 4 component descriptors(s)
[INFO] 
[INFO] --- maven-resources-plugin:3.1.0:testResources (default-testResources) @ doxia-doc-renderer ---
[INFO] Using 'UTF-8' encoding to copy filtered resources.
[INFO] Copying 13 resources
[INFO] Copying 3 resources
[INFO] 
[INFO] --- maven-compiler-plugin:3.7.0:testCompile (default-testCompile) @ doxia-doc-renderer ---
[INFO] Changes detected - recompiling the module!
[INFO] Compiling 1 source file to /home/jenkins/jenkins-slave/workspace/en-doxia-sitetools_htmlunit-2.24/m/doxia-doc-renderer/target/test-classes
[INFO] 
[INFO] --- maven-surefire-plugin:2.22.0:test (default-test) @ doxia-doc-renderer ---
[INFO] 
[INFO] -------------------------------------------------------
[INFO]  T E S T S
[INFO] -------------------------------------------------------
[INFO] Running org.apache.maven.doxia.docrenderer.DocumentRendererTest
[warn] No document root specified, local links will not be resolved correctly!
[WARNING] [iText Sink] Modified invalid link: 'Frequently Asked Questions_How_to_export_in_PDF' to 'Frequently_Asked_Questions_How_to_export_in_PDF'
[WARNING] [iText Sink] Modified invalid link: 'Frequently Asked Questions_How_to_handle_style_in_the_APT_markup_language' to 'Frequently_Asked_Questions_How_to_handle_style_in_the_APT_markup_language'
[WARNING] [iText Sink] Modified invalid link: 'Frequently Asked Questions_Is_it_possible_to_create_a_book' to 'Frequently_Asked_Questions_Is_it_possible_to_create_a_book'
[WARNING] [iText Sink] Modified invalid link: 'Frequently Asked Questions_top' to 'Frequently_Asked_Questions_top'
[WARNING] [iText Sink] Modified invalid link: 'Frequently Asked Questions_How_to_export_in_PDF' to 'Frequently_Asked_Questions_How_to_export_in_PDF'
[WARNING] [iText Sink] Modified invalid link: 'Frequently Asked Questions_How_to_handle_style_in_the_APT_markup_language' to 'Frequently_Asked_Questions_How_to_handle_style_in_the_APT_markup_language'
[WARNING] [iText Sink] Modified invalid link: 'Frequently Asked Questions_Is_it_possible_to_create_a_book' to 'Frequently_Asked_Questions_Is_it_possible_to_create_a_book'
[WARNING] [iText Sink] Modified invalid link: 'Frequently Asked Questions_top' to 'Frequently_Asked_Questions_top'
[INFO] Tests run: 4, Failures: 0, Errors: 0, Skipped: 0, Time elapsed: 3.814 s - in org.apache.maven.doxia.docrenderer.DocumentRendererTest
[INFO] 
[INFO] Results:
[INFO] 
[INFO] Tests run: 4, Failures: 0, Errors: 0, Skipped: 0
[INFO] 
[INFO] 
[INFO] --- maven-jar-plugin:3.1.0:jar (default-jar) @ doxia-doc-renderer ---
[INFO] Building jar: /home/jenkins/jenkins-slave/workspace/en-doxia-sitetools_htmlunit-2.24/m/doxia-doc-renderer/target/doxia-doc-renderer-1.9-SNAPSHOT.jar
[INFO] 
[INFO] --- maven-site-plugin:3.7.1:attach-descriptor (attach-descriptor) @ doxia-doc-renderer ---
[INFO] Skipping because packaging 'jar' is not pom.
[INFO] 
[INFO] --- maven-checkstyle-plugin:3.0.0:check (checkstyle-check) @ doxia-doc-renderer ---
[INFO] 
[INFO] >>> clirr-maven-plugin:2.8:check (default) > compile @ doxia-doc-renderer >>>
[INFO] 
[INFO] --- maven-enforcer-plugin:1.4.1:enforce (enforce-maven-version) @ doxia-doc-renderer ---
[INFO] 
[INFO] --- maven-enforcer-plugin:1.4.1:enforce (enforce-bytecode-version) @ doxia-doc-renderer ---
[INFO] 
[INFO] --- maven-enforcer-plugin:1.4.1:enforce (ban-known-bad-maven-versions) @ doxia-doc-renderer ---
[INFO] 
[INFO] --- apache-rat-plugin:0.12:check (rat-check) @ doxia-doc-renderer ---
[INFO] Enabled default license matchers.
[INFO] Will parse SCM ignores for exclusions...
[INFO] Finished adding exclusions from SCM ignore files.
[INFO] 61 implicit excludes (use -debug for more details).
[INFO] Exclude: src/test/resources/site/confluence/confluence/*.confluence
[INFO] Exclude: src/test/resources/org/apache/maven/doxia/siterenderer/velocity-toolmanager.vm
[INFO] Exclude: src/test/resources/org/apache/maven/doxia/siterenderer/velocity-toolmanager.expected.txt
[INFO] Exclude: src/test/resources/dtd/xhtml-*.ent
[INFO] Exclude: src/test/resources/dtd/xhtml1-transitional.dtd
[INFO] Exclude: src/test/resources/xhtml-lat1.ent
[INFO] Exclude: .repository/**
[INFO] Exclude: .maven/spy.log
[INFO] Exclude: dependency-reduced-pom.xml
[INFO] Exclude: .java-version
[INFO] 32 resources included (use -debug for more details)
[INFO] Rat check: Summary over all files. Unapproved: 0, unknown: 0, generated: 0, approved: 28 licenses.
[INFO] 
[INFO] --- maven-remote-resources-plugin:1.5:process (process-resource-bundles) @ doxia-doc-renderer ---
[INFO] 
[INFO] --- maven-resources-plugin:3.1.0:resources (default-resources) @ doxia-doc-renderer ---
[INFO] Using 'UTF-8' encoding to copy filtered resources.
[INFO] Copying 1 resource
[INFO] skip non existing resourceDirectory /home/jenkins/jenkins-slave/workspace/en-doxia-sitetools_htmlunit-2.24/m/doxia-doc-renderer/target/generated-site/xsd
[INFO] Copying 3 resources
[INFO] Copying 3 resources
[INFO] 
[INFO] --- maven-compiler-plugin:3.7.0:compile (default-compile) @ doxia-doc-renderer ---
[INFO] Nothing to compile - all classes are up to date
[INFO] 
[INFO] <<< clirr-maven-plugin:2.8:check (default) < compile @ doxia-doc-renderer <<<
[INFO] 
[INFO] 
[INFO] --- clirr-maven-plugin:2.8:check (default) @ doxia-doc-renderer ---
[INFO] Skipping execution
[INFO] ------------------------------------------------------------------------
[INFO] Reactor Summary for Doxia Sitetools 1.9-SNAPSHOT:
[INFO] 
[INFO] Doxia Sitetools .................................... SUCCESS [ 12.984 s]
[INFO] Doxia Sitetools :: Decoration Model ................ SUCCESS [  6.829 s]
[INFO] Doxia Sitetools :: Skin Model ...................... SUCCESS [  0.725 s]
[INFO] Doxia Sitetools :: Integration Tools ............... SUCCESS [  4.433 s]
[INFO] Doxia Sitetools :: Site Renderer ................... SUCCESS [  8.461 s]
[INFO] Doxia Sitetools :: Document Renderer ............... SUCCESS [  9.277 s]
[INFO] ------------------------------------------------------------------------
[INFO] BUILD SUCCESS
[INFO] ------------------------------------------------------------------------
[INFO] Total time:  43.661 s
[INFO] Finished at: 2019-06-06T11:13:11Z
[INFO] ------------------------------------------------------------------------
[WARNING] The requested profile "run-its" could not be activated because it does not exist.
[INFO] [jenkins-event-spy] Generated /home/jenkins/jenkins-slave/workspace/en-doxia-sitetools_htmlunit-2.24@tmp/withMaven20ee26e0/maven-spy-20190606-111227-9637414362056169768958.log
[Pipeline] }
[Pipeline] // dir
[Pipeline] }
[withMaven] junitPublisher - Archive test results for Maven artifact org.apache.maven.doxia:doxia-decoration-model:jar:1.9-SNAPSHOT generated by maven-surefire-plugin:test (default-test): m/doxia-decoration-model/target/surefire-reports/*.xml
[withMaven] junitPublisher - Archive test results for Maven artifact org.apache.maven.doxia:doxia-skin-model:jar:1.9-SNAPSHOT generated by maven-surefire-plugin:test (default-test): m/doxia-skin-model/target/surefire-reports/*.xml
[withMaven] junitPublisher - Archive test results for Maven artifact org.apache.maven.doxia:doxia-integration-tools:jar:1.9-SNAPSHOT generated by maven-surefire-plugin:test (default-test): m/doxia-integration-tools/target/surefire-reports/*.xml
[withMaven] junitPublisher - Archive test results for Maven artifact org.apache.maven.doxia:doxia-site-renderer:jar:1.9-SNAPSHOT generated by maven-surefire-plugin:test (default-test): m/doxia-site-renderer/target/surefire-reports/*.xml
[withMaven] junitPublisher - Archive test results for Maven artifact org.apache.maven.doxia:doxia-doc-renderer:jar:1.9-SNAPSHOT generated by maven-surefire-plugin:test (default-test): m/doxia-doc-renderer/target/surefire-reports/*.xml
Recording test results
[withMaven] Publishers: Pipeline Graph Publisher: 8 ms, Invoker Publisher: 1 ms, Junit Publisher: 5802 ms, Concordion Publisher: 1 ms, Dependencies Fingerprint Publisher: 1867 ms, JGiven Publisher: 1 ms
[Pipeline] // withMaven
[Pipeline] cleanWs
[WS-CLEANUP] Deleting project workspace...
[WS-CLEANUP] Deferred wipeout is used...
[WS-CLEANUP] done
[Pipeline] }
[Pipeline] // stage
[Pipeline] }
[Pipeline] // node
[Pipeline] }
[Pipeline] // parallel
[Pipeline] stage
[Pipeline] { (Notifications)
[Pipeline] echo
Build result: UNSTABLE
[Pipeline] jiraIssueSelector
[Pipeline] emailext

Build failed in Jenkins: Maven TLP » maven-doxia-sitetools » htmlunit-2.24 #3

Posted by Apache Jenkins Server <je...@builds.apache.org>.
See https://builds.apache.org/job/maven-box/job/maven-doxia-sitetools/job/htmlunit-2.24/3/

Changes:

* Disable CSS
* Disable CSS
* Disable CSS
* Disable CSS
* Disable CSS
* Disable CSS
* Disable CSS

All tests passed

Build log:
[...truncated 21778 lines...]
[INFO] Downloading from central: https://repo.maven.apache.org/maven2/org/apache/httpcomponents/project/7/project-7.pom
[INFO] Downloaded from central: https://repo.maven.apache.org/maven2/org/apache/httpcomponents/project/7/project-7.pom (27 kB at 4.5 MB/s)
[INFO] Downloading from central: https://repo.maven.apache.org/maven2/org/apache/httpcomponents/httpcore/4.4.4/httpcore-4.4.4.pom
[INFO] Downloaded from central: https://repo.maven.apache.org/maven2/org/apache/httpcomponents/httpcore/4.4.4/httpcore-4.4.4.pom (5.5 kB at 1.1 MB/s)
[INFO] Downloading from central: https://repo.maven.apache.org/maven2/org/apache/httpcomponents/httpcomponents-core/4.4.4/httpcomponents-core-4.4.4.pom
[INFO] Downloaded from central: https://repo.maven.apache.org/maven2/org/apache/httpcomponents/httpcomponents-core/4.4.4/httpcomponents-core-4.4.4.pom (13 kB at 2.1 MB/s)
[INFO] Downloading from central: https://repo.maven.apache.org/maven2/commons-codec/commons-codec/1.9/commons-codec-1.9.pom
[INFO] Downloaded from central: https://repo.maven.apache.org/maven2/commons-codec/commons-codec/1.9/commons-codec-1.9.pom (12 kB at 2.3 MB/s)
[INFO] Downloading from central: https://repo.maven.apache.org/maven2/org/apache/commons/commons-parent/32/commons-parent-32.pom
[INFO] Downloaded from central: https://repo.maven.apache.org/maven2/org/apache/commons/commons-parent/32/commons-parent-32.pom (53 kB at 8.8 MB/s)
[INFO] Downloading from central: https://repo.maven.apache.org/maven2/org/apache/httpcomponents/httpmime/4.5.2/httpmime-4.5.2.pom
[INFO] Downloaded from central: https://repo.maven.apache.org/maven2/org/apache/httpcomponents/httpmime/4.5.2/httpmime-4.5.2.pom (4.8 kB at 797 kB/s)
[INFO] Downloading from central: https://repo.maven.apache.org/maven2/commons-codec/commons-codec/1.10/commons-codec-1.10.pom
[INFO] Downloaded from central: https://repo.maven.apache.org/maven2/commons-codec/commons-codec/1.10/commons-codec-1.10.pom (12 kB at 2.3 MB/s)
[INFO] Downloading from central: https://repo.maven.apache.org/maven2/org/apache/commons/commons-parent/35/commons-parent-35.pom
[INFO] Downloaded from central: https://repo.maven.apache.org/maven2/org/apache/commons/commons-parent/35/commons-parent-35.pom (58 kB at 9.6 MB/s)
[INFO] Downloading from central: https://repo.maven.apache.org/maven2/net/sourceforge/htmlunit/htmlunit-core-js/2.23/htmlunit-core-js-2.23.pom
[INFO] Downloaded from central: https://repo.maven.apache.org/maven2/net/sourceforge/htmlunit/htmlunit-core-js/2.23/htmlunit-core-js-2.23.pom (1.9 kB at 316 kB/s)
[INFO] Downloading from central: https://repo.maven.apache.org/maven2/net/sourceforge/htmlunit/neko-htmlunit/2.24/neko-htmlunit-2.24.pom
[INFO] Downloaded from central: https://repo.maven.apache.org/maven2/net/sourceforge/htmlunit/neko-htmlunit/2.24/neko-htmlunit-2.24.pom (3.9 kB at 781 kB/s)
[INFO] Downloading from central: https://repo.maven.apache.org/maven2/xerces/xercesImpl/2.11.0/xercesImpl-2.11.0.pom
[INFO] Downloaded from central: https://repo.maven.apache.org/maven2/xerces/xercesImpl/2.11.0/xercesImpl-2.11.0.pom (3.4 kB at 848 kB/s)
[INFO] Downloading from central: https://repo.maven.apache.org/maven2/xml-apis/xml-apis/1.4.01/xml-apis-1.4.01.pom
[INFO] Downloaded from central: https://repo.maven.apache.org/maven2/xml-apis/xml-apis/1.4.01/xml-apis-1.4.01.pom (2.7 kB at 532 kB/s)
[INFO] Downloading from central: https://repo.maven.apache.org/maven2/net/sourceforge/cssparser/cssparser/0.9.21/cssparser-0.9.21.pom
[INFO] Downloaded from central: https://repo.maven.apache.org/maven2/net/sourceforge/cssparser/cssparser/0.9.21/cssparser-0.9.21.pom (14 kB at 2.4 MB/s)
[INFO] Downloading from central: https://repo.maven.apache.org/maven2/org/w3c/css/sac/1.3/sac-1.3.pom
[INFO] Downloaded from central: https://repo.maven.apache.org/maven2/org/w3c/css/sac/1.3/sac-1.3.pom (1.1 kB at 162 kB/s)
[INFO] Downloading from central: https://repo.maven.apache.org/maven2/org/eclipse/jetty/websocket/websocket-client/9.2.20.v20161216/websocket-client-9.2.20.v20161216.pom
[INFO] Downloaded from central: https://repo.maven.apache.org/maven2/org/eclipse/jetty/websocket/websocket-client/9.2.20.v20161216/websocket-client-9.2.20.v20161216.pom (5.1 kB at 852 kB/s)
[INFO] Downloading from central: https://repo.maven.apache.org/maven2/org/eclipse/jetty/websocket/websocket-parent/9.2.20.v20161216/websocket-parent-9.2.20.v20161216.pom
[INFO] Downloaded from central: https://repo.maven.apache.org/maven2/org/eclipse/jetty/websocket/websocket-parent/9.2.20.v20161216/websocket-parent-9.2.20.v20161216.pom (3.5 kB at 583 kB/s)
[INFO] Downloading from central: https://repo.maven.apache.org/maven2/org/eclipse/jetty/jetty-project/9.2.20.v20161216/jetty-project-9.2.20.v20161216.pom
[INFO] Downloaded from central: https://repo.maven.apache.org/maven2/org/eclipse/jetty/jetty-project/9.2.20.v20161216/jetty-project-9.2.20.v20161216.pom (43 kB at 6.1 MB/s)
[INFO] Downloading from central: https://repo.maven.apache.org/maven2/org/eclipse/jetty/jetty-parent/23/jetty-parent-23.pom
[INFO] Downloaded from central: https://repo.maven.apache.org/maven2/org/eclipse/jetty/jetty-parent/23/jetty-parent-23.pom (22 kB at 3.1 MB/s)
[INFO] Downloading from central: https://repo.maven.apache.org/maven2/org/eclipse/jetty/jetty-util/9.2.20.v20161216/jetty-util-9.2.20.v20161216.pom
[INFO] Downloaded from central: https://repo.maven.apache.org/maven2/org/eclipse/jetty/jetty-util/9.2.20.v20161216/jetty-util-9.2.20.v20161216.pom (3.6 kB at 600 kB/s)
[INFO] Downloading from central: https://repo.maven.apache.org/maven2/org/eclipse/jetty/jetty-io/9.2.20.v20161216/jetty-io-9.2.20.v20161216.pom
[INFO] Downloaded from central: https://repo.maven.apache.org/maven2/org/eclipse/jetty/jetty-io/9.2.20.v20161216/jetty-io-9.2.20.v20161216.pom (2.3 kB at 381 kB/s)
[INFO] Downloading from central: https://repo.maven.apache.org/maven2/org/eclipse/jetty/websocket/websocket-common/9.2.20.v20161216/websocket-common-9.2.20.v20161216.pom
[INFO] Downloaded from central: https://repo.maven.apache.org/maven2/org/eclipse/jetty/websocket/websocket-common/9.2.20.v20161216/websocket-common-9.2.20.v20161216.pom (2.6 kB at 441 kB/s)
[INFO] Downloading from central: https://repo.maven.apache.org/maven2/org/eclipse/jetty/websocket/websocket-api/9.2.20.v20161216/websocket-api-9.2.20.v20161216.pom
[INFO] Downloaded from central: https://repo.maven.apache.org/maven2/org/eclipse/jetty/websocket/websocket-api/9.2.20.v20161216/websocket-api-9.2.20.v20161216.pom (2.2 kB at 367 kB/s)
[INFO] Downloading from central: https://repo.maven.apache.org/maven2/org/mockito/mockito-core/2.22.0/mockito-core-2.22.0.pom
[INFO] Downloaded from central: https://repo.maven.apache.org/maven2/org/mockito/mockito-core/2.22.0/mockito-core-2.22.0.pom (17 kB at 2.1 MB/s)
[INFO] Downloading from central: https://repo.maven.apache.org/maven2/net/bytebuddy/byte-buddy/1.8.21/byte-buddy-1.8.21.pom
[INFO] Downloaded from central: https://repo.maven.apache.org/maven2/net/bytebuddy/byte-buddy/1.8.21/byte-buddy-1.8.21.pom (9.4 kB at 1.6 MB/s)
[INFO] Downloading from central: https://repo.maven.apache.org/maven2/net/bytebuddy/byte-buddy-parent/1.8.21/byte-buddy-parent-1.8.21.pom
[INFO] Downloaded from central: https://repo.maven.apache.org/maven2/net/bytebuddy/byte-buddy-parent/1.8.21/byte-buddy-parent-1.8.21.pom (27 kB at 3.9 MB/s)
[INFO] Downloading from central: https://repo.maven.apache.org/maven2/net/bytebuddy/byte-buddy-agent/1.8.21/byte-buddy-agent-1.8.21.pom
[INFO] Downloaded from central: https://repo.maven.apache.org/maven2/net/bytebuddy/byte-buddy-agent/1.8.21/byte-buddy-agent-1.8.21.pom (4.8 kB at 399 kB/s)
[INFO] Downloading from central: https://repo.maven.apache.org/maven2/org/objenesis/objenesis/2.6/objenesis-2.6.pom
[INFO] Downloaded from central: https://repo.maven.apache.org/maven2/org/objenesis/objenesis/2.6/objenesis-2.6.pom (2.8 kB at 464 kB/s)
[INFO] Downloading from central: https://repo.maven.apache.org/maven2/org/objenesis/objenesis-parent/2.6/objenesis-parent-2.6.pom
[INFO] Downloaded from central: https://repo.maven.apache.org/maven2/org/objenesis/objenesis-parent/2.6/objenesis-parent-2.6.pom (17 kB at 3.3 MB/s)
[INFO] Downloading from central: https://repo.maven.apache.org/maven2/org/apache/httpcomponents/httpcore/4.4.11/httpcore-4.4.11.jar
[INFO] Downloading from central: https://repo.maven.apache.org/maven2/org/apache/maven/doxia/doxia-module-confluence/1.9/doxia-module-confluence-1.9.jar
[INFO] Downloading from central: https://repo.maven.apache.org/maven2/org/apache/maven/doxia/doxia-module-apt/1.9/doxia-module-apt-1.9.jar
[INFO] Downloading from central: https://repo.maven.apache.org/maven2/org/apache/maven/doxia/doxia-core/1.9/doxia-core-1.9.jar
[INFO] Downloading from central: https://repo.maven.apache.org/maven2/org/apache/httpcomponents/httpclient/4.5.8/httpclient-4.5.8.jar
[INFO] Downloaded from central: https://repo.maven.apache.org/maven2/org/apache/maven/doxia/doxia-module-apt/1.9/doxia-module-apt-1.9.jar (55 kB at 3.1 MB/s)
[INFO] Downloading from central: https://repo.maven.apache.org/maven2/org/apache/maven/doxia/doxia-module-docbook-simple/1.9/doxia-module-docbook-simple-1.9.jar
[INFO] Downloaded from central: https://repo.maven.apache.org/maven2/org/apache/maven/doxia/doxia-module-confluence/1.9/doxia-module-confluence-1.9.jar (59 kB at 2.8 MB/s)
[INFO] Downloading from central: https://repo.maven.apache.org/maven2/org/apache/maven/doxia/doxia-module-xdoc/1.9/doxia-module-xdoc-1.9.jar
[INFO] Downloaded from central: https://repo.maven.apache.org/maven2/org/apache/httpcomponents/httpcore/4.4.11/httpcore-4.4.11.jar (327 kB at 11 MB/s)
[INFO] Downloading from central: https://repo.maven.apache.org/maven2/org/apache/maven/doxia/doxia-module-xhtml/1.9/doxia-module-xhtml-1.9.jar
[INFO] Downloaded from central: https://repo.maven.apache.org/maven2/org/apache/maven/doxia/doxia-module-docbook-simple/1.9/doxia-module-docbook-simple-1.9.jar (131 kB at 4.2 MB/s)
[INFO] Downloading from central: https://repo.maven.apache.org/maven2/org/apache/maven/doxia/doxia-module-fml/1.9/doxia-module-fml-1.9.jar
[INFO] Downloaded from central: https://repo.maven.apache.org/maven2/org/apache/maven/doxia/doxia-module-xdoc/1.9/doxia-module-xdoc-1.9.jar (38 kB at 1.1 MB/s)
[INFO] Downloading from central: https://repo.maven.apache.org/maven2/org/codehaus/plexus/plexus-classworlds/1.2-alpha-9/plexus-classworlds-1.2-alpha-9.jar
[INFO] Downloaded from central: https://repo.maven.apache.org/maven2/org/apache/maven/doxia/doxia-core/1.9/doxia-core-1.9.jar (219 kB at 5.6 MB/s)
[INFO] Downloading from central: https://repo.maven.apache.org/maven2/javax/servlet/servlet-api/2.3/servlet-api-2.3.jar
[INFO] Downloaded from central: https://repo.maven.apache.org/maven2/org/apache/maven/doxia/doxia-module-xhtml/1.9/doxia-module-xhtml-1.9.jar (18 kB at 430 kB/s)
[INFO] Downloading from central: https://repo.maven.apache.org/maven2/org/apache/commons/commons-lang3/3.5/commons-lang3-3.5.jar
[INFO] Downloaded from central: https://repo.maven.apache.org/maven2/org/apache/httpcomponents/httpclient/4.5.8/httpclient-4.5.8.jar (772 kB at 18 MB/s)
[INFO] Downloading from central: https://repo.maven.apache.org/maven2/org/apache/maven/doxia/doxia-core/1.9/doxia-core-1.9-tests.jar
[INFO] Downloaded from central: https://repo.maven.apache.org/maven2/org/apache/maven/doxia/doxia-module-fml/1.9/doxia-module-fml-1.9.jar (39 kB at 948 kB/s)
[INFO] Downloading from central: https://repo.maven.apache.org/maven2/net/sourceforge/htmlunit/htmlunit/2.24/htmlunit-2.24.jar
[INFO] Downloaded from central: https://repo.maven.apache.org/maven2/org/codehaus/plexus/plexus-classworlds/1.2-alpha-9/plexus-classworlds-1.2-alpha-9.jar (43 kB at 945 kB/s)
[INFO] Downloading from central: https://repo.maven.apache.org/maven2/xalan/xalan/2.7.2/xalan-2.7.2.jar
[INFO] Downloaded from central: https://repo.maven.apache.org/maven2/javax/servlet/servlet-api/2.3/servlet-api-2.3.jar (78 kB at 1.4 MB/s)
[INFO] Downloading from central: https://repo.maven.apache.org/maven2/xalan/serializer/2.7.2/serializer-2.7.2.jar
[INFO] Downloaded from central: https://repo.maven.apache.org/maven2/org/apache/maven/doxia/doxia-core/1.9/doxia-core-1.9-tests.jar (126 kB at 2.1 MB/s)
[INFO] Downloading from central: https://repo.maven.apache.org/maven2/org/apache/httpcomponents/httpmime/4.5.2/httpmime-4.5.2.jar
[INFO] Downloaded from central: https://repo.maven.apache.org/maven2/org/apache/commons/commons-lang3/3.5/commons-lang3-3.5.jar (480 kB at 6.8 MB/s)
[INFO] Downloading from central: https://repo.maven.apache.org/maven2/commons-codec/commons-codec/1.10/commons-codec-1.10.jar
[INFO] Downloaded from central: https://repo.maven.apache.org/maven2/org/apache/httpcomponents/httpmime/4.5.2/httpmime-4.5.2.jar (41 kB at 554 kB/s)
[INFO] Downloading from central: https://repo.maven.apache.org/maven2/net/sourceforge/htmlunit/htmlunit-core-js/2.23/htmlunit-core-js-2.23.jar
[INFO] Downloaded from central: https://repo.maven.apache.org/maven2/xalan/serializer/2.7.2/serializer-2.7.2.jar (276 kB at 3.7 MB/s)
[INFO] Downloading from central: https://repo.maven.apache.org/maven2/net/sourceforge/htmlunit/neko-htmlunit/2.24/neko-htmlunit-2.24.jar
[INFO] Downloaded from central: https://repo.maven.apache.org/maven2/net/sourceforge/htmlunit/neko-htmlunit/2.24/neko-htmlunit-2.24.jar (125 kB at 1.1 MB/s)
[INFO] Downloading from central: https://repo.maven.apache.org/maven2/xerces/xercesImpl/2.11.0/xercesImpl-2.11.0.jar
[INFO] Downloaded from central: https://repo.maven.apache.org/maven2/commons-codec/commons-codec/1.10/commons-codec-1.10.jar (284 kB at 2.4 MB/s)
[INFO] Downloading from central: https://repo.maven.apache.org/maven2/xml-apis/xml-apis/1.4.01/xml-apis-1.4.01.jar
[INFO] Downloaded from central: https://repo.maven.apache.org/maven2/net/sourceforge/htmlunit/htmlunit/2.24/htmlunit-2.24.jar (1.9 MB at 16 MB/s)
[INFO] Downloading from central: https://repo.maven.apache.org/maven2/net/sourceforge/cssparser/cssparser/0.9.21/cssparser-0.9.21.jar
[INFO] Downloaded from central: https://repo.maven.apache.org/maven2/net/sourceforge/htmlunit/htmlunit-core-js/2.23/htmlunit-core-js-2.23.jar (1.2 MB at 10 MB/s)
[INFO] Downloading from central: https://repo.maven.apache.org/maven2/org/w3c/css/sac/1.3/sac-1.3.jar
[INFO] Downloaded from central: https://repo.maven.apache.org/maven2/xalan/xalan/2.7.2/xalan-2.7.2.jar (3.2 MB at 26 MB/s)
[INFO] Downloading from central: https://repo.maven.apache.org/maven2/org/eclipse/jetty/websocket/websocket-client/9.2.20.v20161216/websocket-client-9.2.20.v20161216.jar
[INFO] Downloaded from central: https://repo.maven.apache.org/maven2/org/w3c/css/sac/1.3/sac-1.3.jar (16 kB at 121 kB/s)
[INFO] Downloading from central: https://repo.maven.apache.org/maven2/org/eclipse/jetty/jetty-util/9.2.20.v20161216/jetty-util-9.2.20.v20161216.jar
[INFO] Downloaded from central: https://repo.maven.apache.org/maven2/org/eclipse/jetty/websocket/websocket-client/9.2.20.v20161216/websocket-client-9.2.20.v20161216.jar (36 kB at 269 kB/s)
[INFO] Downloading from central: https://repo.maven.apache.org/maven2/org/eclipse/jetty/jetty-io/9.2.20.v20161216/jetty-io-9.2.20.v20161216.jar
[INFO] Downloaded from central: https://repo.maven.apache.org/maven2/xml-apis/xml-apis/1.4.01/xml-apis-1.4.01.jar (221 kB at 1.5 MB/s)
[INFO] Downloading from central: https://repo.maven.apache.org/maven2/org/eclipse/jetty/websocket/websocket-common/9.2.20.v20161216/websocket-common-9.2.20.v20161216.jar
[INFO] Downloaded from central: https://repo.maven.apache.org/maven2/net/sourceforge/cssparser/cssparser/0.9.21/cssparser-0.9.21.jar (381 kB at 2.6 MB/s)
[INFO] Downloading from central: https://repo.maven.apache.org/maven2/org/eclipse/jetty/websocket/websocket-api/9.2.20.v20161216/websocket-api-9.2.20.v20161216.jar
[INFO] Downloaded from central: https://repo.maven.apache.org/maven2/org/eclipse/jetty/jetty-io/9.2.20.v20161216/jetty-io-9.2.20.v20161216.jar (108 kB at 717 kB/s)
[INFO] Downloading from central: https://repo.maven.apache.org/maven2/org/mockito/mockito-core/2.22.0/mockito-core-2.22.0.jar
[INFO] Downloaded from central: https://repo.maven.apache.org/maven2/org/eclipse/jetty/jetty-util/9.2.20.v20161216/jetty-util-9.2.20.v20161216.jar (377 kB at 2.4 MB/s)
[INFO] Downloading from central: https://repo.maven.apache.org/maven2/net/bytebuddy/byte-buddy/1.8.21/byte-buddy-1.8.21.jar
[INFO] Downloaded from central: https://repo.maven.apache.org/maven2/org/eclipse/jetty/websocket/websocket-api/9.2.20.v20161216/websocket-api-9.2.20.v20161216.jar (44 kB at 282 kB/s)
[INFO] Downloading from central: https://repo.maven.apache.org/maven2/net/bytebuddy/byte-buddy-agent/1.8.21/byte-buddy-agent-1.8.21.jar
[INFO] Downloaded from central: https://repo.maven.apache.org/maven2/xerces/xercesImpl/2.11.0/xercesImpl-2.11.0.jar (1.4 MB at 8.3 MB/s)
[INFO] Downloading from central: https://repo.maven.apache.org/maven2/org/objenesis/objenesis/2.6/objenesis-2.6.jar
[INFO] Downloaded from central: https://repo.maven.apache.org/maven2/net/bytebuddy/byte-buddy-agent/1.8.21/byte-buddy-agent-1.8.21.jar (42 kB at 250 kB/s)
[INFO] Downloaded from central: https://repo.maven.apache.org/maven2/org/eclipse/jetty/websocket/websocket-common/9.2.20.v20161216/websocket-common-9.2.20.v20161216.jar (180 kB at 1.1 MB/s)
[INFO] Downloaded from central: https://repo.maven.apache.org/maven2/org/mockito/mockito-core/2.22.0/mockito-core-2.22.0.jar (565 kB at 3.3 MB/s)
[INFO] Downloaded from central: https://repo.maven.apache.org/maven2/org/objenesis/objenesis/2.6/objenesis-2.6.jar (56 kB at 318 kB/s)
[INFO] Downloaded from central: https://repo.maven.apache.org/maven2/net/bytebuddy/byte-buddy/1.8.21/byte-buddy-1.8.21.jar (3.1 MB at 14 MB/s)
[INFO] 
[INFO] --- maven-clean-plugin:3.1.0:clean (default-clean) @ doxia-site-renderer ---
[INFO] 
[INFO] --- maven-enforcer-plugin:1.4.1:enforce (enforce-maven-version) @ doxia-site-renderer ---
[INFO] 
[INFO] --- maven-enforcer-plugin:1.4.1:enforce (enforce-bytecode-version) @ doxia-site-renderer ---
[INFO] 
[INFO] --- maven-enforcer-plugin:1.4.1:enforce (ban-known-bad-maven-versions) @ doxia-site-renderer ---
[INFO] 
[INFO] --- apache-rat-plugin:0.12:check (rat-check) @ doxia-site-renderer ---
[INFO] Enabled default license matchers.
[INFO] Will parse SCM ignores for exclusions...
[INFO] Finished adding exclusions from SCM ignore files.
[INFO] 61 implicit excludes (use -debug for more details).
[INFO] Exclude: src/test/resources/site/confluence/confluence/*.confluence
[INFO] Exclude: src/test/resources/org/apache/maven/doxia/siterenderer/velocity-toolmanager.vm
[INFO] Exclude: src/test/resources/org/apache/maven/doxia/siterenderer/velocity-toolmanager.expected.txt
[INFO] Exclude: src/test/resources/dtd/xhtml-*.ent
[INFO] Exclude: src/test/resources/dtd/xhtml1-transitional.dtd
[INFO] Exclude: src/test/resources/xhtml-lat1.ent
[INFO] Exclude: .repository/**
[INFO] Exclude: .maven/spy.log
[INFO] Exclude: dependency-reduced-pom.xml
[INFO] Exclude: .java-version
[INFO] 73 resources included (use -debug for more details)
[INFO] Rat check: Summary over all files. Unapproved: 0, unknown: 0, generated: 0, approved: 65 licenses.
[INFO] 
[INFO] --- maven-remote-resources-plugin:1.5:process (process-resource-bundles) @ doxia-site-renderer ---
[INFO] 
[INFO] --- maven-resources-plugin:3.1.0:resources (default-resources) @ doxia-site-renderer ---
[INFO] Using 'UTF-8' encoding to copy filtered resources.
[INFO] Copying 22 resources
[INFO] skip non existing resourceDirectory F:\jenkins\jenkins-slave\workspace\en-doxia-sitetools_htmlunit-2.24\m\doxia-site-renderer\target\generated-site\xsd
[INFO] Copying 3 resources
[INFO] 
[INFO] --- maven-compiler-plugin:3.7.0:compile (default-compile) @ doxia-site-renderer ---
[INFO] Changes detected - recompiling the module!
[INFO] Compiling 11 source files to F:\jenkins\jenkins-slave\workspace\en-doxia-sitetools_htmlunit-2.24\m\doxia-site-renderer\target\classes
[INFO] /F:/jenkins/jenkins-slave/workspace/en-doxia-sitetools_htmlunit-2.24/m/doxia-site-renderer/src/main/java/org/apache/maven/doxia/siterenderer/DefaultSiteRenderer.java: Some input files use or override a deprecated API.
[INFO] /F:/jenkins/jenkins-slave/workspace/en-doxia-sitetools_htmlunit-2.24/m/doxia-site-renderer/src/main/java/org/apache/maven/doxia/siterenderer/DefaultSiteRenderer.java: Recompile with -Xlint:deprecation for details.
[INFO] 
[INFO] --- plexus-component-metadata:1.7.1:generate-metadata (default) @ doxia-site-renderer ---
[INFO] Discovered 1 component descriptors(s)
[INFO] 
[INFO] --- maven-resources-plugin:3.1.0:testResources (default-testResources) @ doxia-site-renderer ---
[INFO] Using 'UTF-8' encoding to copy filtered resources.
[INFO] Copying 47 resources
[INFO] Copying 3 resources
[INFO] 
[INFO] --- maven-compiler-plugin:3.7.0:testCompile (default-testCompile) @ doxia-site-renderer ---
[INFO] Changes detected - recompiling the module!
[INFO] Compiling 15 source files to F:\jenkins\jenkins-slave\workspace\en-doxia-sitetools_htmlunit-2.24\m\doxia-site-renderer\target\test-classes
[INFO] /F:/jenkins/jenkins-slave/workspace/en-doxia-sitetools_htmlunit-2.24/m/doxia-site-renderer/src/test/java/org/apache/maven/doxia/siterenderer/DefaultSiteRendererTest.java: Some input files use or override a deprecated API.
[INFO] /F:/jenkins/jenkins-slave/workspace/en-doxia-sitetools_htmlunit-2.24/m/doxia-site-renderer/src/test/java/org/apache/maven/doxia/siterenderer/DefaultSiteRendererTest.java: Recompile with -Xlint:deprecation for details.
[INFO] -------------------------------------------------------------
[ERROR] COMPILATION ERROR : 
[INFO] -------------------------------------------------------------
[ERROR] /F:/jenkins/jenkins-slave/workspace/en-doxia-sitetools_htmlunit-2.24/m/doxia-site-renderer/src/test/java/org/apache/maven/doxia/siterenderer/AbstractVerifier.java:[55,18] cannot find symbol
  symbol:   method setCssEnabled(boolean)
  location: variable webClient of type com.gargoylesoftware.htmlunit.WebClient
[INFO] 1 error
[INFO] -------------------------------------------------------------
[INFO] ------------------------------------------------------------------------
[INFO] Reactor Summary for Doxia Sitetools 1.9-SNAPSHOT:
[INFO] 
[INFO] Doxia Sitetools .................................... SUCCESS [ 10.010 s]
[INFO] Doxia Sitetools :: Decoration Model ................ SUCCESS [  5.925 s]
[INFO] Doxia Sitetools :: Skin Model ...................... SUCCESS [  0.625 s]
[INFO] Doxia Sitetools :: Integration Tools ............... SUCCESS [  3.777 s]
[INFO] Doxia Sitetools :: Site Renderer ................... FAILURE [  2.790 s]
[INFO] Doxia Sitetools :: Document Renderer ............... SKIPPED
[INFO] ------------------------------------------------------------------------
[INFO] BUILD FAILURE
[INFO] ------------------------------------------------------------------------
[INFO] Total time:  23.901 s
[INFO] Finished at: 2019-06-06T11:06:13Z
[INFO] ------------------------------------------------------------------------
[WARNING] The requested profile "run-its" could not be activated because it does not exist.
[INFO] [jenkins-event-spy] Generated F:\jenkins\jenkins-slave\workspace\en-doxia-sitetools_htmlunit-2.24@tmp\withMavenfeb29e2a\maven-spy-20190606-110549-1704911164500748601472.log
[ERROR] Failed to execute goal org.apache.maven.plugins:maven-compiler-plugin:3.7.0:testCompile (default-testCompile) on project doxia-site-renderer: Compilation failure
[ERROR] /F:/jenkins/jenkins-slave/workspace/en-doxia-sitetools_htmlunit-2.24/m/doxia-site-renderer/src/test/java/org/apache/maven/doxia/siterenderer/AbstractVerifier.java:[55,18] cannot find symbol
[ERROR]   symbol:   method setCssEnabled(boolean)
[ERROR]   location: variable webClient of type com.gargoylesoftware.htmlunit.WebClient
[ERROR] -> [Help 1]
[ERROR] 
[ERROR] To see the full stack trace of the errors, re-run Maven with the -e switch.
[ERROR] Re-run Maven using the -X switch to enable full debug logging.
[ERROR] 
[ERROR] For more information about the errors and possible solutions, please read the following articles:
[ERROR] [Help 1] http://cwiki.apache.org/confluence/display/MAVEN/MojoFailureException
[ERROR] 
[ERROR] After correcting the problems, you can resume the build with the command
[ERROR]   mvn <goals> -rf :doxia-site-renderer
[Pipeline] }
[Pipeline] // dir
[Pipeline] }
[withMaven] junitPublisher - Archive test results for Maven artifact org.apache.maven.doxia:doxia-decoration-model:jar:1.9-SNAPSHOT generated by maven-surefire-plugin:test (default-test): m\doxia-decoration-model\target\surefire-reports\*.xml
[withMaven] junitPublisher - Archive test results for Maven artifact org.apache.maven.doxia:doxia-skin-model:jar:1.9-SNAPSHOT generated by maven-surefire-plugin:test (default-test): m\doxia-skin-model\target\surefire-reports\*.xml
[withMaven] junitPublisher - Archive test results for Maven artifact org.apache.maven.doxia:doxia-integration-tools:jar:1.9-SNAPSHOT generated by maven-surefire-plugin:test (default-test): m\doxia-integration-tools\target\surefire-reports\*.xml
Recording test results
[withMaven] Publishers: Pipeline Graph Publisher: 5 ms, Junit Publisher: 2636 ms, Dependencies Fingerprint Publisher: 832 ms
[Pipeline] // withMaven
[Pipeline] echo
[FAILURE-004] hudson.AbortException: script returned exit code 1
[Pipeline] cleanWs
[WS-CLEANUP] Deleting project workspace...
[WS-CLEANUP] Deferred wipeout is used...
[WS-CLEANUP] done
[Pipeline] cleanWs
[WS-CLEANUP] Deleting project workspace...
[WS-CLEANUP] Deferred wipeout is used...
[WS-CLEANUP] done
[Pipeline] }
[Pipeline] // stage
[Pipeline] }
[Pipeline] // node
[Pipeline] }
Failed in branch windows-jdk12
[Pipeline] // parallel
[Pipeline] echo
[FAILURE-003] AbortException hudson.AbortException: script returned exit code 1
[Pipeline] stage
[Pipeline] { (Notifications)
[Pipeline] echo
Build result: FAILURE
[Pipeline] jiraIssueSelector
[Pipeline] emailext