You are viewing a plain text version of this content. The canonical link for it is here.
Posted to yarn-dev@hadoop.apache.org by Apache Jenkins Server <je...@builds.apache.org> on 2014/06/26 12:02:25 UTC
Failed: YARN-2142 PreCommit Build #4089
Jira: https://issues.apache.org/jira/browse/YARN-2142
Build: https://builds.apache.org/job/PreCommit-YARN-Build/4089/
###################################################################################
########################## LAST 60 LINES OF THE CONSOLE ###########################
[...truncated 3032 lines...]
http://issues.apache.org/jira/secure/attachment/12652587/test.patch
against trunk revision .
{color:green}+1 @author{color}. The patch does not contain any @author tags.
{color:red}-1 tests included{color}. The patch doesn't appear to include any new or modified tests.
Please justify why no new tests are needed for this patch.
Also please list what manual steps were performed to verify this patch.
{color:green}+1 javac{color}. The applied patch does not increase the total number of javac compiler warnings.
{color:green}+1 javadoc{color}. There were no new javadoc warning messages.
{color:green}+1 eclipse:eclipse{color}. The patch built with eclipse:eclipse.
{color:green}+1 findbugs{color}. The patch does not introduce any new Findbugs (version 1.3.9) warnings.
{color:green}+1 release audit{color}. The applied patch does not increase the total number of release audit warnings.
{color:green}+1 core tests{color}. The patch passed unit tests in hadoop-yarn-project/hadoop-yarn/hadoop-yarn-server/hadoop-yarn-server-nodemanager.
{color:green}+1 contrib tests{color}. The patch passed contrib unit tests.
Test results: https://builds.apache.org/job/PreCommit-YARN-Build/4089//testReport/
Console output: https://builds.apache.org/job/PreCommit-YARN-Build/4089//console
This message is automatically generated.
======================================================================
======================================================================
Adding comment to Jira.
======================================================================
======================================================================
Comment added.
f7ee36780fe3f8ccbe4c8b6149092a54415197ff logged out
======================================================================
======================================================================
Finished build.
======================================================================
======================================================================
Build step 'Execute shell' marked build as failure
Archiving artifacts
Sending artifact delta relative to PreCommit-YARN-Build #4080
Archived 17 artifacts
Archive block size is 32768
Received 219 blocks and 920245 bytes
Compression is 88.6%
Took 0.64 sec
[description-setter] Could not determine description.
Recording test results
Email was triggered for: Failure
Sending email for trigger: Failure
###################################################################################
############################## FAILED TESTS (if any) ##############################
All tests passed
Success: YARN-2216 PreCommit Build #4093
Posted by Apache Jenkins Server <je...@builds.apache.org>.
Jira: https://issues.apache.org/jira/browse/YARN-2216
Build: https://builds.apache.org/job/PreCommit-YARN-Build/4093/
###################################################################################
########################## LAST 60 LINES OF THE CONSOLE ###########################
[...truncated 3007 lines...]
{color:green}+1 overall{color}. Here are the results of testing the latest attachment
http://issues.apache.org/jira/secure/attachment/12652615/YARN-2216.1.patch
against trunk revision .
{color:green}+1 @author{color}. The patch does not contain any @author tags.
{color:green}+1 tests included{color}. The patch appears to include 1 new or modified test files.
{color:green}+1 javac{color}. The applied patch does not increase the total number of javac compiler warnings.
{color:green}+1 javadoc{color}. There were no new javadoc warning messages.
{color:green}+1 eclipse:eclipse{color}. The patch built with eclipse:eclipse.
{color:green}+1 findbugs{color}. The patch does not introduce any new Findbugs (version 1.3.9) warnings.
{color:green}+1 release audit{color}. The applied patch does not increase the total number of release audit warnings.
{color:green}+1 core tests{color}. The patch passed unit tests in hadoop-yarn-project/hadoop-yarn/hadoop-yarn-server/hadoop-yarn-server-resourcemanager.
{color:green}+1 contrib tests{color}. The patch passed contrib unit tests.
Test results: https://builds.apache.org/job/PreCommit-YARN-Build/4093//testReport/
Console output: https://builds.apache.org/job/PreCommit-YARN-Build/4093//console
This message is automatically generated.
======================================================================
======================================================================
Adding comment to Jira.
======================================================================
======================================================================
Comment added.
cff6e99a7cafa5bbe1036b4ae2ca5cf5299dd1b5 logged out
======================================================================
======================================================================
Finished build.
======================================================================
======================================================================
Archiving artifacts
Sending artifact delta relative to PreCommit-YARN-Build #4080
Archived 17 artifacts
Archive block size is 32768
Received 222 blocks and 805250 bytes
Compression is 90.0%
Took 1.7 sec
Description set: YARN-2216
Recording test results
Email was triggered for: Success
Sending email for trigger: Success
###################################################################################
############################## FAILED TESTS (if any) ##############################
All tests passed
Failed: YARN-2201 PreCommit Build #4092
Posted by Apache Jenkins Server <je...@builds.apache.org>.
Jira: https://issues.apache.org/jira/browse/YARN-2201
Build: https://builds.apache.org/job/PreCommit-YARN-Build/4092/
###################################################################################
########################## LAST 60 LINES OF THE CONSOLE ###########################
[...truncated 3074 lines...]
Compression is 17.4%
Took 3 sec
[description-setter] Could not determine description.
Recording test results
ERROR: Failed to archive test reports
java.io.IOException: remote file operation failed: /home/jenkins/jenkins-slave/workspace/PreCommit-YARN-Build at hudson.remoting.Channel@58a54ac6:hadoop7
at hudson.FilePath.act(FilePath.java:910)
at hudson.FilePath.act(FilePath.java:887)
at hudson.tasks.junit.JUnitParser.parse(JUnitParser.java:87)
at hudson.tasks.junit.JUnitResultArchiver.parse(JUnitResultArchiver.java:121)
at hudson.tasks.junit.JUnitResultArchiver.perform(JUnitResultArchiver.java:133)
at hudson.tasks.BuildStepMonitor$1.perform(BuildStepMonitor.java:20)
at hudson.model.AbstractBuild$AbstractBuildExecution.perform(AbstractBuild.java:804)
at hudson.model.AbstractBuild$AbstractBuildExecution.performAllBuildSteps(AbstractBuild.java:776)
at hudson.model.Build$BuildExecution.post2(Build.java:183)
at hudson.model.AbstractBuild$AbstractBuildExecution.post(AbstractBuild.java:725)
at hudson.model.Run.execute(Run.java:1701)
at hudson.model.FreeStyleBuild.run(FreeStyleBuild.java:43)
at hudson.model.ResourceController.execute(ResourceController.java:88)
at hudson.model.Executor.run(Executor.java:231)
Caused by: java.io.IOException: Remote call on hadoop7 failed
at hudson.remoting.Channel.call(Channel.java:731)
at hudson.FilePath.act(FilePath.java:903)
... 13 more
Caused by: java.lang.OutOfMemoryError: Java heap space
at com.sun.org.apache.xerces.internal.util.XMLStringBuffer.append(XMLStringBuffer.java:205)
at com.sun.org.apache.xerces.internal.impl.XMLEntityScanner.scanData(XMLEntityScanner.java:1380)
at com.sun.org.apache.xerces.internal.impl.XMLDocumentFragmentScannerImpl.scanCDATASection(XMLDocumentFragmentScannerImpl.java:1654)
at com.sun.org.apache.xerces.internal.impl.XMLDocumentFragmentScannerImpl$FragmentContentDriver.next(XMLDocumentFragmentScannerImpl.java:2985)
at com.sun.org.apache.xerces.internal.impl.XMLDocumentScannerImpl.next(XMLDocumentScannerImpl.java:648)
at com.sun.org.apache.xerces.internal.impl.XMLNSDocumentScannerImpl.next(XMLNSDocumentScannerImpl.java:140)
at com.sun.org.apache.xerces.internal.impl.XMLDocumentFragmentScannerImpl.scanDocument(XMLDocumentFragmentScannerImpl.java:511)
at com.sun.org.apache.xerces.internal.parsers.XML11Configuration.parse(XML11Configuration.java:808)
at com.sun.org.apache.xerces.internal.parsers.XML11Configuration.parse(XML11Configuration.java:737)
at com.sun.org.apache.xerces.internal.parsers.XMLParser.parse(XMLParser.java:119)
at com.sun.org.apache.xerces.internal.parsers.AbstractSAXParser.parse(AbstractSAXParser.java:1205)
at com.sun.org.apache.xerces.internal.jaxp.SAXParserImpl$JAXPSAXParser.parse(SAXParserImpl.java:522)
at org.dom4j.io.SAXReader.read(SAXReader.java:465)
at org.dom4j.io.SAXReader.read(SAXReader.java:264)
at hudson.tasks.junit.SuiteResult.parse(SuiteResult.java:123)
at hudson.tasks.junit.TestResult.parse(TestResult.java:273)
at hudson.tasks.junit.TestResult.parsePossiblyEmpty(TestResult.java:229)
at hudson.tasks.junit.TestResult.parse(TestResult.java:164)
at hudson.tasks.junit.TestResult.parse(TestResult.java:147)
at hudson.tasks.junit.TestResult.<init>(TestResult.java:123)
at hudson.tasks.junit.JUnitParser$ParseResultCallable.invoke(JUnitParser.java:117)
at hudson.tasks.junit.JUnitParser$ParseResultCallable.invoke(JUnitParser.java:90)
at hudson.FilePath$FileCallableWrapper.call(FilePath.java:2462)
at hudson.remoting.UserRequest.perform(UserRequest.java:118)
at hudson.remoting.UserRequest.perform(UserRequest.java:48)
at hudson.remoting.Request$2.run(Request.java:328)
at hudson.remoting.InterceptingExecutorService$1.call(InterceptingExecutorService.java:72)
at java.util.concurrent.FutureTask$Sync.innerRun(FutureTask.java:303)
at java.util.concurrent.FutureTask.run(FutureTask.java:138)
at java.util.concurrent.ThreadPoolExecutor$Worker.runTask(ThreadPoolExecutor.java:886)
at java.util.concurrent.ThreadPoolExecutor$Worker.run(ThreadPoolExecutor.java:908)
at java.lang.Thread.run(Thread.java:662)
Email was triggered for: Failure
Sending email for trigger: Failure
###################################################################################
############################## FAILED TESTS (if any) ##############################
No tests ran.
Failed: YARN-1713 PreCommit Build #4091
Posted by Apache Jenkins Server <je...@builds.apache.org>.
Jira: https://issues.apache.org/jira/browse/YARN-1713
Build: https://builds.apache.org/job/PreCommit-YARN-Build/4091/
###################################################################################
########################## LAST 60 LINES OF THE CONSOLE ###########################
[...truncated 3321 lines...]
Compression is 15.6%
Took 2.3 sec
[description-setter] Could not determine description.
Recording test results
ERROR: Failed to archive test reports
java.io.IOException: remote file operation failed: /home/jenkins/jenkins-slave/workspace/PreCommit-YARN-Build at hudson.remoting.Channel@58a54ac6:hadoop7
at hudson.FilePath.act(FilePath.java:910)
at hudson.FilePath.act(FilePath.java:887)
at hudson.tasks.junit.JUnitParser.parse(JUnitParser.java:87)
at hudson.tasks.junit.JUnitResultArchiver.parse(JUnitResultArchiver.java:121)
at hudson.tasks.junit.JUnitResultArchiver.perform(JUnitResultArchiver.java:133)
at hudson.tasks.BuildStepMonitor$1.perform(BuildStepMonitor.java:20)
at hudson.model.AbstractBuild$AbstractBuildExecution.perform(AbstractBuild.java:804)
at hudson.model.AbstractBuild$AbstractBuildExecution.performAllBuildSteps(AbstractBuild.java:776)
at hudson.model.Build$BuildExecution.post2(Build.java:183)
at hudson.model.AbstractBuild$AbstractBuildExecution.post(AbstractBuild.java:725)
at hudson.model.Run.execute(Run.java:1701)
at hudson.model.FreeStyleBuild.run(FreeStyleBuild.java:43)
at hudson.model.ResourceController.execute(ResourceController.java:88)
at hudson.model.Executor.run(Executor.java:231)
Caused by: java.io.IOException: Remote call on hadoop7 failed
at hudson.remoting.Channel.call(Channel.java:731)
at hudson.FilePath.act(FilePath.java:903)
... 13 more
Caused by: java.lang.OutOfMemoryError: Java heap space
at com.sun.org.apache.xerces.internal.util.XMLStringBuffer.append(XMLStringBuffer.java:205)
at com.sun.org.apache.xerces.internal.impl.XMLEntityScanner.scanData(XMLEntityScanner.java:1380)
at com.sun.org.apache.xerces.internal.impl.XMLDocumentFragmentScannerImpl.scanCDATASection(XMLDocumentFragmentScannerImpl.java:1654)
at com.sun.org.apache.xerces.internal.impl.XMLDocumentFragmentScannerImpl$FragmentContentDriver.next(XMLDocumentFragmentScannerImpl.java:2985)
at com.sun.org.apache.xerces.internal.impl.XMLDocumentScannerImpl.next(XMLDocumentScannerImpl.java:648)
at com.sun.org.apache.xerces.internal.impl.XMLNSDocumentScannerImpl.next(XMLNSDocumentScannerImpl.java:140)
at com.sun.org.apache.xerces.internal.impl.XMLDocumentFragmentScannerImpl.scanDocument(XMLDocumentFragmentScannerImpl.java:511)
at com.sun.org.apache.xerces.internal.parsers.XML11Configuration.parse(XML11Configuration.java:808)
at com.sun.org.apache.xerces.internal.parsers.XML11Configuration.parse(XML11Configuration.java:737)
at com.sun.org.apache.xerces.internal.parsers.XMLParser.parse(XMLParser.java:119)
at com.sun.org.apache.xerces.internal.parsers.AbstractSAXParser.parse(AbstractSAXParser.java:1205)
at com.sun.org.apache.xerces.internal.jaxp.SAXParserImpl$JAXPSAXParser.parse(SAXParserImpl.java:522)
at org.dom4j.io.SAXReader.read(SAXReader.java:465)
at org.dom4j.io.SAXReader.read(SAXReader.java:264)
at hudson.tasks.junit.SuiteResult.parse(SuiteResult.java:123)
at hudson.tasks.junit.TestResult.parse(TestResult.java:273)
at hudson.tasks.junit.TestResult.parsePossiblyEmpty(TestResult.java:229)
at hudson.tasks.junit.TestResult.parse(TestResult.java:164)
at hudson.tasks.junit.TestResult.parse(TestResult.java:147)
at hudson.tasks.junit.TestResult.<init>(TestResult.java:123)
at hudson.tasks.junit.JUnitParser$ParseResultCallable.invoke(JUnitParser.java:117)
at hudson.tasks.junit.JUnitParser$ParseResultCallable.invoke(JUnitParser.java:90)
at hudson.FilePath$FileCallableWrapper.call(FilePath.java:2462)
at hudson.remoting.UserRequest.perform(UserRequest.java:118)
at hudson.remoting.UserRequest.perform(UserRequest.java:48)
at hudson.remoting.Request$2.run(Request.java:328)
at hudson.remoting.InterceptingExecutorService$1.call(InterceptingExecutorService.java:72)
at java.util.concurrent.FutureTask$Sync.innerRun(FutureTask.java:303)
at java.util.concurrent.FutureTask.run(FutureTask.java:138)
at java.util.concurrent.ThreadPoolExecutor$Worker.runTask(ThreadPoolExecutor.java:886)
at java.util.concurrent.ThreadPoolExecutor$Worker.run(ThreadPoolExecutor.java:908)
at java.lang.Thread.run(Thread.java:662)
Email was triggered for: Failure
Sending email for trigger: Failure
###################################################################################
############################## FAILED TESTS (if any) ##############################
No tests ran.
Failed: YARN-2181 PreCommit Build #4090
Posted by Apache Jenkins Server <je...@builds.apache.org>.
Jira: https://issues.apache.org/jira/browse/YARN-2181
Build: https://builds.apache.org/job/PreCommit-YARN-Build/4090/
###################################################################################
########################## LAST 60 LINES OF THE CONSOLE ###########################
[...truncated 3062 lines...]
{color:green}+1 contrib tests{color}. The patch passed contrib unit tests.
Test results: https://builds.apache.org/job/PreCommit-YARN-Build/4090//testReport/
Console output: https://builds.apache.org/job/PreCommit-YARN-Build/4090//console
This message is automatically generated.
======================================================================
======================================================================
Adding comment to Jira.
======================================================================
======================================================================
Comment added.
6deb1d9a0fce3885cca4de805043270968c5d036 logged out
======================================================================
======================================================================
Finished build.
======================================================================
======================================================================
Build step 'Execute shell' marked build as failure
Archiving artifacts
Sending artifact delta relative to PreCommit-YARN-Build #4080
Archived 17 artifacts
Archive block size is 32768
Received 221 blocks and 976112 bytes
Compression is 88.1%
Took 0.64 sec
[description-setter] Could not determine description.
Recording test results
ERROR: Failed to archive test reports
java.io.IOException: remote file operation failed: /home/jenkins/jenkins-slave/workspace/PreCommit-YARN-Build at hudson.remoting.Channel@17c77c3d:hadoop4
at hudson.FilePath.act(FilePath.java:910)
at hudson.FilePath.act(FilePath.java:887)
at hudson.tasks.junit.JUnitParser.parse(JUnitParser.java:87)
at hudson.tasks.junit.JUnitResultArchiver.parse(JUnitResultArchiver.java:121)
at hudson.tasks.junit.JUnitResultArchiver.perform(JUnitResultArchiver.java:133)
at hudson.tasks.BuildStepMonitor$1.perform(BuildStepMonitor.java:20)
at hudson.model.AbstractBuild$AbstractBuildExecution.perform(AbstractBuild.java:804)
at hudson.model.AbstractBuild$AbstractBuildExecution.performAllBuildSteps(AbstractBuild.java:776)
at hudson.model.Build$BuildExecution.post2(Build.java:183)
at hudson.model.AbstractBuild$AbstractBuildExecution.post(AbstractBuild.java:725)
at hudson.model.Run.execute(Run.java:1701)
at hudson.model.FreeStyleBuild.run(FreeStyleBuild.java:43)
at hudson.model.ResourceController.execute(ResourceController.java:88)
at hudson.model.Executor.run(Executor.java:231)
Caused by: java.io.IOException: Remote call on hadoop4 failed
at hudson.remoting.Channel.call(Channel.java:731)
at hudson.FilePath.act(FilePath.java:903)
... 13 more
Caused by: java.lang.OutOfMemoryError: Java heap space
Email was triggered for: Failure
Sending email for trigger: Failure
###################################################################################
############################## FAILED TESTS (if any) ##############################
No tests ran.