You are viewing a plain text version of this content. The canonical link for it is here.
Posted to builds@cassandra.apache.org by Apache Jenkins Server <je...@builds.apache.org> on 2025/01/13 19:55:03 UTC

Build complete: Cassandra-5.0 #357 [FAILURE] 332341b9b60c078914a1ca99d951f5127f43068f

-------------------------------------------------------------------------------
  Build Cassandra-5.0 #357 Failure
  URL: https://ci-cassandra.apache.org/job/Cassandra-5.0/357/
  -------------------------------------------------------------------------------
  Changes:
  [Sam Tunnicliffe] Enforce CQL message size limit on multiframe messages


  -------------------------------------------------------------------------------
  Failed Tests:
  20 tests failed.
FAILED:  dtest-latest.bootstrap_test.TestBootstrap.Tests / dtest-latest jdk11 7/64 / test_consistent_range_movement_false_with_rf1_should_succeed
FAILED:  dtest-latest.disk_balance_test.TestDiskBalance.Tests / dtest-latest jdk11 40/64 / test_disk_balance_after_boundary_change_stcs
FAILED:  dtest-latest.materialized_views_test.TestMaterializedViewsConsistency.Tests / dtest-latest jdk17 12/64 / test_multi_partition_consistent_reads_after_write
FAILED:  dtest-latest.repair_tests.incremental_repair_test.TestIncRepair.Tests / dtest-latest jdk11 28/64 / test_multiple_full_repairs_lcs
FAILED:  dtest-novnode.disk_balance_test.TestDiskBalance.Tests / dtest-novnode jdk11 46/64 / test_disk_balance_after_joining_ring_stcs
FAILED:  dtest-upgrade-large.upgrade_tests.upgrade_through_versions_test.TestUpgrade_current_4_0_x_To_indev_5_0_x.Tests / dtest-upgrade-large jdk11 1/32 / test_parallel_upgrade_with_internode_ssl
FAILED:  dtest-upgrade-large.upgrade_tests.upgrade_through_versions_test.TestUpgrade_current_4_1_x_To_indev_5_0_x.Tests / dtest-upgrade-large jdk11 4/32 / test_bootstrap_multidc
FAILED:  dtest.bootstrap_test.TestBootstrap.Tests / dtest jdk11 20/64 / test_cleanup
FAILED:  org.apache.cassandra.transport.SimpleClientPerfTest.Tests / test-burn jdk11 2/2 / measureLargeWithCompression[5/v5]-_jdk11_x86_64
FAILED:  org.apache.cassandra.transport.SimpleClientPerfTest.Tests / test-burn jdk17 2/2 / measureLargeWithCompression[5/v5]-_jdk17_x86_64
FAILED:  org.apache.cassandra.transport.SimpleClientPerfTest.Tests / test-burn jdk11 2/2 / measureLargeWithCompression[6/v6-beta]-_jdk11_x86_64
FAILED:  org.apache.cassandra.transport.SimpleClientPerfTest.Tests / test-burn jdk17 2/2 / measureLargeWithCompression[6/v6-beta]-_jdk17_x86_64
FAILED:  org.apache.cassandra.transport.SimpleClientPerfTest.Tests / test-burn jdk11 2/2 / measureLarge[5/v5]-_jdk11_x86_64
FAILED:  org.apache.cassandra.transport.SimpleClientPerfTest.Tests / test-burn jdk17 2/2 / measureLarge[5/v5]-_jdk17_x86_64
FAILED:  org.apache.cassandra.transport.SimpleClientPerfTest.Tests / test-burn jdk11 2/2 / measureLarge[6/v6-beta]-_jdk11_x86_64
FAILED:  org.apache.cassandra.transport.SimpleClientPerfTest.Tests / test-burn jdk17 2/2 / measureLarge[6/v6-beta]-_jdk17_x86_64
FAILED:  org.apache.cassandra.distributed.test.RepairTest.Tests / jvm-dtest jdk11 2/12 / testForcedNormalRepairWithOneNodeDown-_jdk11_x86_64
FAILED:  org.apache.cassandra.distributed.test.RepairTest.Tests / jvm-dtest jdk17 2/12 / testForcedNormalRepairWithOneNodeDown-_jdk17_x86_64
FAILED:  junit.framework.TestSuite.Tests / jvm-dtest jdk11 2/12 / org.apache.cassandra.distributed.test.RepairTest-_jdk11_x86_64
FAILED:  junit.framework.TestSuite.Tests / jvm-dtest jdk17 2/12 / org.apache.cassandra.distributed.test.RepairTest-_jdk17_x86_64

  -------------------------------------------------------------------------------
  For complete test report and logs see https://nightlies.apache.org/cassandra/Cassandra-5.0/357/