You are viewing a plain text version of this content. The canonical link for it is here.
Posted to builds@cassandra.apache.org by Apache Jenkins Server <je...@builds.apache.org> on 2026/03/16 15:09:12 UTC
Build complete: Cassandra-4.1 #640 [UNSTABLE] 4c7367d7395ed4090590a178d91819f6e825a008
-------------------------------------------------------------------------------
Build Cassandra-4.1 #640 Still Unstable
URL: https://ci-cassandra.apache.org/job/Cassandra-4.1/640/
-------------------------------------------------------------------------------
Changes:
[Stefan Miklosovic] Node does not send multiple inflight echos
-------------------------------------------------------------------------------
Failed Tests:
6 tests failed.
FAILED: dtest-upgrade.upgrade_tests.cql_tests.TestCQLNodes2RF1_Upgrade_current_3_11_x_To_indev_4_1_x.test_materialized_view_simple
FAILED: dtest-upgrade.upgrade_tests.cql_tests.TestCQLNodes3RF3_Upgrade_indev_4_0_x_To_indev_4_1_x.test_timeuuid
FAILED: dtest.materialized_views_test.TestMaterializedViews.test_gcgs_validation
FAILED: org.apache.cassandra.distributed.upgrade.MixedModeReadTest.mixedModeReadColumnSubsetDigestCheck
FAILED: org.apache.cassandra.distributed.upgrade.MixedModeReadTest.mixedModeReadColumnSubsetDigestCheck
FAILED: org.apache.cassandra.db.compaction.CompactionTaskTest.testFullyExpiredSSTablesAreNotReleasedPrematurely-compression
-------------------------------------------------------------------------------
For complete test report and logs see https://nightlies.apache.org/cassandra/Cassandra-4.1/640/