You are viewing a plain text version of this content. The canonical link for it is here.
Posted to commits@logging.apache.org by Apache Jenkins Server <je...@builds.apache.org> on 2017/07/08 16:39:04 UTC
Build failed in Jenkins: logging-log4net » feature/cd-pipeline #91
See <https://builds.apache.org/job/logging-log4net/job/feature%252Fcd-pipeline/91/display/redirect>
------------------------------------------
[...truncated 122.80 KB...]
set-build-configuration-flags:
compile-mono-4.0-current-configuration:
check-bin-dir:
check-doc-dir:
check-sdkdoc-dir:
check-sdkdoc-debug:
check-current-build-config:
check-build-debug:
check-build-defines:
set-mono-4.0-runtime-configuration:
check-log4net-basedir:
check-current-bin-dir:
[mkdir] Creating directory '/home/jenkins/jenkins-slave/workspace/log4net_feature_cd-pipeline-76KUCPODUF6LCE45226EBUR4GNVLYPMYVC23Z4ITBOMNJT3CA2WA/bin/mono/4.0/release'.
clean-current-bin-dir:
[echo] Cleaning the bin/mono/4.0/release binaries directory.
[delete] Deleting directory '/home/jenkins/jenkins-slave/workspace/log4net_feature_cd-pipeline-76KUCPODUF6LCE45226EBUR4GNVLYPMYVC23Z4ITBOMNJT3CA2WA/bin/mono/4.0/release'.
[mkdir] Creating directory '/home/jenkins/jenkins-slave/workspace/log4net_feature_cd-pipeline-76KUCPODUF6LCE45226EBUR4GNVLYPMYVC23Z4ITBOMNJT3CA2WA/bin/mono/4.0/release'.
[echo] Old key file not found.
[echo] The release build using the old key will be skipped.
[csc] Compiling 226 files to '/home/jenkins/jenkins-slave/workspace/log4net_feature_cd-pipeline-76KUCPODUF6LCE45226EBUR4GNVLYPMYVC23Z4ITBOMNJT3CA2WA/bin/mono/4.0/release/log4net.dll'.
[csc] /home/jenkins/jenkins-slave/workspace/log4net_feature_cd-pipeline-76KUCPODUF6LCE45226EBUR4GNVLYPMYVC23Z4ITBOMNJT3CA2WA/src/Appender/EventLogAppender.cs(360,13): warning CS0618: `System.Diagnostics.EventLog.CreateEventSource(string, string, string)' is obsolete: `use CreateEventSource(EventSourceCreationData) instead'
[csc] /home/jenkins/jenkins-slave/workspace/log4net_feature_cd-pipeline-76KUCPODUF6LCE45226EBUR4GNVLYPMYVC23Z4ITBOMNJT3CA2WA/src/Config/XmlConfigurator.cs(134,64): warning CS0618: `System.Configuration.ConfigurationSettings.GetConfig(string)' is obsolete: `This method is obsolete, it has been replaced by System.Configuration!System.Configuration.ConfigurationManager.GetSection'
[csc] /home/jenkins/jenkins-slave/workspace/log4net_feature_cd-pipeline-76KUCPODUF6LCE45226EBUR4GNVLYPMYVC23Z4ITBOMNJT3CA2WA/src/Config/XmlConfigurator.cs(748,6): warning CS0618: `System.Xml.XmlValidatingReader' is obsolete: `Use XmlReader created by XmlReader.Create() method using appropriate XmlReaderSettings instead.'
[csc] /home/jenkins/jenkins-slave/workspace/log4net_feature_cd-pipeline-76KUCPODUF6LCE45226EBUR4GNVLYPMYVC23Z4ITBOMNJT3CA2WA/src/Config/XmlConfigurator.cs(748,42): warning CS0618: `System.Xml.XmlValidatingReader' is obsolete: `Use XmlReader created by XmlReader.Create() method using appropriate XmlReaderSettings instead.'
[csc] /home/jenkins/jenkins-slave/workspace/log4net_feature_cd-pipeline-76KUCPODUF6LCE45226EBUR4GNVLYPMYVC23Z4ITBOMNJT3CA2WA/src/Util/TypeConverters/IPAddressConverter.cs(122,29): warning CS0618: `System.Net.Dns.GetHostByName(string)' is obsolete: `Use GetHostEntry instead'
[csc] /home/jenkins/jenkins-slave/workspace/log4net_feature_cd-pipeline-76KUCPODUF6LCE45226EBUR4GNVLYPMYVC23Z4ITBOMNJT3CA2WA/src/Util/SystemInfo.cs(1007,34): warning CS0618: `System.Configuration.ConfigurationSettings.AppSettings' is obsolete: `This property is obsolete. Please use System.Configuration.ConfigurationManager.AppSettings'
[csc] Compilation succeeded - 6 warning(s)
BUILD SUCCEEDED - 0 non-fatal error(s), 12 warning(s)
Total time: 3.1 seconds.
[Pipeline] stash
Stashed 6 file(s)
[Pipeline] sh
[log4net_feature_cd-pipeline-76KUCPODUF6LCE45226EBUR4GNVLYPMYVC23Z4ITBOMNJT3CA2WA] Running shell script
+ nant -t:mono-4.0 -buildfile:tests/nant.build runtests-mono-4.0
NAnt 0.92 (Build 0.92.4526.0; rc1; 05/23/2012)
Copyright (C) 2001-2012 Gerry Shaw
http://nant.sourceforge.net
Buildfile: file:///home/jenkins/jenkins-slave/workspace/log4net_feature_cd-pipeline-76KUCPODUF6LCE45226EBUR4GNVLYPMYVC23Z4ITBOMNJT3CA2WA/tests/nant.build
Target framework: Mono 4.0 Profile
Target(s) specified: runtests-mono-4.0
check-current-build-config:
set-build-configuration:
set-debug-build-configuration:
check-current-build-config:
set-build-configuration-flags:
check-bin-dir:
[mkdir] Creating directory '/home/jenkins/jenkins-slave/workspace/log4net_feature_cd-pipeline-76KUCPODUF6LCE45226EBUR4GNVLYPMYVC23Z4ITBOMNJT3CA2WA/tests/bin'.
check-doc-dir:
[mkdir] Creating directory '/home/jenkins/jenkins-slave/workspace/log4net_feature_cd-pipeline-76KUCPODUF6LCE45226EBUR4GNVLYPMYVC23Z4ITBOMNJT3CA2WA/tests/doc'.
check-sdkdoc-dir:
check-sdkdoc-debug:
check-build-debug:
check-build-defines:
set-mono-4.0-runtime-configuration:
check-log4net-basedir:
check-current-bin-dir:
[mkdir] Creating directory '/home/jenkins/jenkins-slave/workspace/log4net_feature_cd-pipeline-76KUCPODUF6LCE45226EBUR4GNVLYPMYVC23Z4ITBOMNJT3CA2WA/tests/bin/mono/4.0/debug'.
clean-current-bin-dir:
[echo] Cleaning the bin/mono/4.0/debug binaries directory.
[delete] Deleting directory '/home/jenkins/jenkins-slave/workspace/log4net_feature_cd-pipeline-76KUCPODUF6LCE45226EBUR4GNVLYPMYVC23Z4ITBOMNJT3CA2WA/tests/bin/mono/4.0/debug'.
[mkdir] Creating directory '/home/jenkins/jenkins-slave/workspace/log4net_feature_cd-pipeline-76KUCPODUF6LCE45226EBUR4GNVLYPMYVC23Z4ITBOMNJT3CA2WA/tests/bin/mono/4.0/debug'.
check-log4net-output-dir:
check-log4net-assembly:
[echo] Testing if file exists: ..//bin/mono/4.0/debug/log4net.dll
install-nunit:
[get] Retrieving 'https://github.com/nunit/nunitv2/releases/download/2.6.4/NUnit-2.6.4.zip' to '/home/jenkins/jenkins-slave/workspace/log4net_feature_cd-pipeline-76KUCPODUF6LCE45226EBUR4GNVLYPMYVC23Z4ITBOMNJT3CA2WA/tests/.tmp-nunit.zip'.
[unzip] Unzipping '/home/jenkins/jenkins-slave/workspace/log4net_feature_cd-pipeline-76KUCPODUF6LCE45226EBUR4GNVLYPMYVC23Z4ITBOMNJT3CA2WA/tests/.tmp-nunit.zip' to '/home/jenkins/jenkins-slave/workspace/log4net_feature_cd-pipeline-76KUCPODUF6LCE45226EBUR4GNVLYPMYVC23Z4ITBOMNJT3CA2WA/tests/.tmp-nunit'.
[copy] Copying 1 file to '/home/jenkins/jenkins-slave/workspace/log4net_feature_cd-pipeline-76KUCPODUF6LCE45226EBUR4GNVLYPMYVC23Z4ITBOMNJT3CA2WA/tests/lib/mono/4.0/debug'.
[delete] Deleting file /home/jenkins/jenkins-slave/workspace/log4net_feature_cd-pipeline-76KUCPODUF6LCE45226EBUR4GNVLYPMYVC23Z4ITBOMNJT3CA2WA/tests/.tmp-nunit.zip.
[delete] Deleting directory '/home/jenkins/jenkins-slave/workspace/log4net_feature_cd-pipeline-76KUCPODUF6LCE45226EBUR4GNVLYPMYVC23Z4ITBOMNJT3CA2WA/tests/.tmp-nunit'.
compile-mono-4.0:
[copy] Copying 3 files to '/home/jenkins/jenkins-slave/workspace/log4net_feature_cd-pipeline-76KUCPODUF6LCE45226EBUR4GNVLYPMYVC23Z4ITBOMNJT3CA2WA/tests/bin/mono/4.0/debug'.
[copy] Copying 1 file to '/home/jenkins/jenkins-slave/workspace/log4net_feature_cd-pipeline-76KUCPODUF6LCE45226EBUR4GNVLYPMYVC23Z4ITBOMNJT3CA2WA/tests/bin/mono/4.0/debug'.
[csc] Compiling 46 files to '/home/jenkins/jenkins-slave/workspace/log4net_feature_cd-pipeline-76KUCPODUF6LCE45226EBUR4GNVLYPMYVC23Z4ITBOMNJT3CA2WA/tests/bin/mono/4.0/debug/log4net.Tests.dll'.
runtests-mono-4.0:
[nunit2] log4net:WARN Exception while rendering format [IGNORE THIS WARNING - EXCEPTION EXPECTED Before {0} After {1} {2}]
[nunit2] System.FormatException: Index (zero based) must be greater than or equal to zero and less than the size of the argument list.
[nunit2] at System.Text.StringBuilder.AppendFormat (IFormatProvider provider, System.String format, System.Object[] args) <0x40510c20 + 0x009cb> in <filename unknown>:0
[nunit2] at System.String.Format (IFormatProvider provider, System.String format, System.Object[] args) <0x40510a60 + 0x00093> in <filename unknown>:0
[nunit2] at log4net.Util.SystemStringFormat.StringFormat (IFormatProvider provider, System.String format, System.Object[] args) <0x40626a80 + 0x00068> in <filename unknown>:0
[nunit2] log4net:ERROR Hello
[nunit2] log4net:ERROR World
[nunit2] log4net:ERROR This will be recorded.
[nunit2] log4net:ERROR This will be recorded.
[nunit2]
[nunit2] /home/jenkins/jenkins-slave/workspace/log4net_feature_cd-pipeline-76KUCPODUF6LCE45226EBUR4GNVLYPMYVC23Z4ITBOMNJT3CA2WA/tests/nant.build(828,10):
[nunit2] Tests Failed.
BUILD SUCCEEDED - 1 non-fatal error(s), 0 warning(s)
Total time: 20.4 seconds.
Stashed 1 file(s)
[Pipeline] stash
[Pipeline] }
$ docker stop --time=1 86a8a23eae6fea1ad4eccbaa62a3e043f9c74c169a81f97eb136c3b6c2d6ff13
$ docker rm -f 86a8a23eae6fea1ad4eccbaa62a3e043f9c74c169a81f97eb136c3b6c2d6ff13
[Pipeline] // withDockerContainer
[Pipeline] }
[Pipeline] // stage
[Pipeline] stage
[Pipeline] { (build netstandard)
[Pipeline] getContext
[Pipeline] readFile
[Pipeline] sh
[log4net_feature_cd-pipeline-76KUCPODUF6LCE45226EBUR4GNVLYPMYVC23Z4ITBOMNJT3CA2WA] Running shell script
+ docker build -t 89f4c62ab6f57a668610ef268a76c2b64c72b7c4 -f buildtools/docker/builder-netstandard/Dockerfile buildtools/docker/builder-netstandard
Sending build context to Docker daemon 4.096 kB
Step 1/7 : FROM microsoft/dotnet
---> ab1dcd1a2496
Step 2/7 : MAINTAINER "dev@logging.apache.org"
---> Using cache
---> 1a392e603f49
Step 3/7 : RUN apt-get update && apt-get install -y nant git
---> Using cache
---> 67e2a492c30d
Step 4/7 : RUN apt-get update && apt-get -y --no-install-recommends install ca-certificates curl
---> Using cache
---> ce017ec1e886
Step 5/7 : RUN curl -o /usr/local/bin/gosu -SL "https://github.com/tianon/gosu/releases/download/1.4/gosu-$(dpkg --print-architecture)" && chmod +x /usr/local/bin/gosu
---> Using cache
---> 9d0846b5aefa
Step 6/7 : COPY entrypoint.sh /usr/local/bin/entrypoint.sh
---> Using cache
---> 76d841be4f40
Step 7/7 : ENTRYPOINT /usr/local/bin/entrypoint.sh
---> Using cache
---> baa9b6e6513a
Successfully built baa9b6e6513a
[Pipeline] dockerFingerprintFrom
[Pipeline] sh
[log4net_feature_cd-pipeline-76KUCPODUF6LCE45226EBUR4GNVLYPMYVC23Z4ITBOMNJT3CA2WA] Running shell script
+ docker inspect -f . 89f4c62ab6f57a668610ef268a76c2b64c72b7c4
.
[Pipeline] withDockerContainer
H22 does not seem to be running inside a container
$ docker run -t -d -u 10025:12040 -w /home/jenkins/jenkins-slave/workspace/log4net_feature_cd-pipeline-76KUCPODUF6LCE45226EBUR4GNVLYPMYVC23Z4ITBOMNJT3CA2WA -v /home/jenkins/jenkins-slave/workspace/log4net_feature_cd-pipeline-76KUCPODUF6LCE45226EBUR4GNVLYPMYVC23Z4ITBOMNJT3CA2WA:/home/jenkins/jenkins-slave/workspace/log4net_feature_cd-pipeline-76KUCPODUF6LCE45226EBUR4GNVLYPMYVC23Z4ITBOMNJT3CA2WA:rw -v /home/jenkins/jenkins-slave/workspace/log4net_feature_cd-pipeline-76KUCPODUF6LCE45226EBUR4GNVLYPMYVC23Z4ITBOMNJT3CA2WA@tmp:/home/jenkins/jenkins-slave/workspace/log4net_feature_cd-pipeline-76KUCPODUF6LCE45226EBUR4GNVLYPMYVC23Z4ITBOMNJT3CA2WA@tmp:rw -e ******** -e ******** -e ******** -e ******** -e ******** -e ******** -e ******** -e ******** -e ******** -e ******** -e ******** -e ******** -e ******** -e ******** -e ******** -e ******** -e ******** -e ******** -e ******** -e ******** -e ******** -e ******** -e ******** --entrypoint cat 89f4c62ab6f57a668610ef268a76c2b64c72b7c4
[Pipeline] {
[Pipeline] sh
[log4net_feature_cd-pipeline-76KUCPODUF6LCE45226EBUR4GNVLYPMYVC23Z4ITBOMNJT3CA2WA] Running shell script
++ pwd
++ uid -u
/home/jenkins/jenkins-slave/workspace/log4net_feature_cd-pipeline-76KUCPODUF6LCE45226EBUR4GNVLYPMYVC23Z4ITBOMNJT3CA2WA@tmp/durable-b860ea24/script.sh: line 2: uid: command not found
++ uid -g
/home/jenkins/jenkins-slave/workspace/log4net_feature_cd-pipeline-76KUCPODUF6LCE45226EBUR4GNVLYPMYVC23Z4ITBOMNJT3CA2WA@tmp/durable-b860ea24/script.sh: line 2: uid: command not found
++ uid -g
/home/jenkins/jenkins-slave/workspace/log4net_feature_cd-pipeline-76KUCPODUF6LCE45226EBUR4GNVLYPMYVC23Z4ITBOMNJT3CA2WA@tmp/durable-b860ea24/script.sh: line 2: uid: command not found
+ useradd --home-dir /home/jenkins/jenkins-slave/workspace/log4net_feature_cd-pipeline-76KUCPODUF6LCE45226EBUR4GNVLYPMYVC23Z4ITBOMNJT3CA2WA --shell /bin/bash --uid --gid --groups -p -M jenkins
useradd: invalid user ID '--gid'
[Pipeline] }
$ docker stop --time=1 4b95e9741745ba51cd6fbf7b600d48228c80486c64a69f69e16419675a46fe03
$ docker rm -f 4b95e9741745ba51cd6fbf7b600d48228c80486c64a69f69e16419675a46fe03
[Pipeline] // withDockerContainer
[Pipeline] }
[Pipeline] // stage
[Pipeline] stage
[Pipeline] { (build site)
Stage 'build site' skipped due to earlier failure(s)
[Pipeline] }
[Pipeline] // stage
[Pipeline] stage
[Pipeline] { (prepare package)
Stage 'prepare package' skipped due to earlier failure(s)
[Pipeline] }
[Pipeline] // stage
[Pipeline] stage
[Pipeline] { (check test results)
Stage 'check test results' skipped due to earlier failure(s)
[Pipeline] }
[Pipeline] // stage
[Pipeline] stage
[Pipeline] { (publish site)
Stage 'publish site' skipped due to earlier failure(s)
[Pipeline] }
[Pipeline] // stage
[Pipeline] stage
[Pipeline] { (Declarative: Post Actions)
[Pipeline] step
Build failed in Jenkins: logging-log4net » feature/cd-pipeline #97
Posted by Apache Jenkins Server <je...@builds.apache.org>.
See <https://builds.apache.org/job/logging-log4net/job/feature%252Fcd-pipeline/97/display/redirect>
------------------------------------------
[...truncated 120.15 KB...]
[echo] Cleaning the bin/mono/4.0/debug binaries directory.
[delete] Deleting directory '/home/jenkins/jenkins-slave/workspace/log4net_feature_cd-pipeline-76KUCPODUF6LCE45226EBUR4GNVLYPMYVC23Z4ITBOMNJT3CA2WA/bin/mono/4.0/debug'.
[mkdir] Creating directory '/home/jenkins/jenkins-slave/workspace/log4net_feature_cd-pipeline-76KUCPODUF6LCE45226EBUR4GNVLYPMYVC23Z4ITBOMNJT3CA2WA/bin/mono/4.0/debug'.
[csc] Compiling 226 files to '/home/jenkins/jenkins-slave/workspace/log4net_feature_cd-pipeline-76KUCPODUF6LCE45226EBUR4GNVLYPMYVC23Z4ITBOMNJT3CA2WA/bin/mono/4.0/debug/log4net.dll'.
[csc] /home/jenkins/jenkins-slave/workspace/log4net_feature_cd-pipeline-76KUCPODUF6LCE45226EBUR4GNVLYPMYVC23Z4ITBOMNJT3CA2WA/src/Appender/EventLogAppender.cs(360,13): warning CS0618: `System.Diagnostics.EventLog.CreateEventSource(string, string, string)' is obsolete: `use CreateEventSource(EventSourceCreationData) instead'
[csc] /home/jenkins/jenkins-slave/workspace/log4net_feature_cd-pipeline-76KUCPODUF6LCE45226EBUR4GNVLYPMYVC23Z4ITBOMNJT3CA2WA/src/Config/XmlConfigurator.cs(134,64): warning CS0618: `System.Configuration.ConfigurationSettings.GetConfig(string)' is obsolete: `This method is obsolete, it has been replaced by System.Configuration!System.Configuration.ConfigurationManager.GetSection'
[csc] /home/jenkins/jenkins-slave/workspace/log4net_feature_cd-pipeline-76KUCPODUF6LCE45226EBUR4GNVLYPMYVC23Z4ITBOMNJT3CA2WA/src/Config/XmlConfigurator.cs(748,6): warning CS0618: `System.Xml.XmlValidatingReader' is obsolete: `Use XmlReader created by XmlReader.Create() method using appropriate XmlReaderSettings instead.'
[csc] /home/jenkins/jenkins-slave/workspace/log4net_feature_cd-pipeline-76KUCPODUF6LCE45226EBUR4GNVLYPMYVC23Z4ITBOMNJT3CA2WA/src/Config/XmlConfigurator.cs(748,42): warning CS0618: `System.Xml.XmlValidatingReader' is obsolete: `Use XmlReader created by XmlReader.Create() method using appropriate XmlReaderSettings instead.'
[csc] /home/jenkins/jenkins-slave/workspace/log4net_feature_cd-pipeline-76KUCPODUF6LCE45226EBUR4GNVLYPMYVC23Z4ITBOMNJT3CA2WA/src/Util/TypeConverters/IPAddressConverter.cs(122,29): warning CS0618: `System.Net.Dns.GetHostByName(string)' is obsolete: `Use GetHostEntry instead'
[csc] /home/jenkins/jenkins-slave/workspace/log4net_feature_cd-pipeline-76KUCPODUF6LCE45226EBUR4GNVLYPMYVC23Z4ITBOMNJT3CA2WA/src/Util/SystemInfo.cs(1007,34): warning CS0618: `System.Configuration.ConfigurationSettings.AppSettings' is obsolete: `This property is obsolete. Please use System.Configuration.ConfigurationManager.AppSettings'
[csc] Compilation succeeded - 6 warning(s)
set-release-build-configuration:
check-current-build-config:
set-build-configuration-flags:
compile-mono-4.0-current-configuration:
check-bin-dir:
check-doc-dir:
check-sdkdoc-dir:
check-sdkdoc-debug:
check-current-build-config:
check-build-debug:
check-build-defines:
set-mono-4.0-runtime-configuration:
check-log4net-basedir:
check-current-bin-dir:
[mkdir] Creating directory '/home/jenkins/jenkins-slave/workspace/log4net_feature_cd-pipeline-76KUCPODUF6LCE45226EBUR4GNVLYPMYVC23Z4ITBOMNJT3CA2WA/bin/mono/4.0/release'.
clean-current-bin-dir:
[echo] Cleaning the bin/mono/4.0/release binaries directory.
[delete] Deleting directory '/home/jenkins/jenkins-slave/workspace/log4net_feature_cd-pipeline-76KUCPODUF6LCE45226EBUR4GNVLYPMYVC23Z4ITBOMNJT3CA2WA/bin/mono/4.0/release'.
[mkdir] Creating directory '/home/jenkins/jenkins-slave/workspace/log4net_feature_cd-pipeline-76KUCPODUF6LCE45226EBUR4GNVLYPMYVC23Z4ITBOMNJT3CA2WA/bin/mono/4.0/release'.
[echo] Old key file not found.
[echo] The release build using the old key will be skipped.
[csc] Compiling 226 files to '/home/jenkins/jenkins-slave/workspace/log4net_feature_cd-pipeline-76KUCPODUF6LCE45226EBUR4GNVLYPMYVC23Z4ITBOMNJT3CA2WA/bin/mono/4.0/release/log4net.dll'.
[csc] /home/jenkins/jenkins-slave/workspace/log4net_feature_cd-pipeline-76KUCPODUF6LCE45226EBUR4GNVLYPMYVC23Z4ITBOMNJT3CA2WA/src/Appender/EventLogAppender.cs(360,13): warning CS0618: `System.Diagnostics.EventLog.CreateEventSource(string, string, string)' is obsolete: `use CreateEventSource(EventSourceCreationData) instead'
[csc] /home/jenkins/jenkins-slave/workspace/log4net_feature_cd-pipeline-76KUCPODUF6LCE45226EBUR4GNVLYPMYVC23Z4ITBOMNJT3CA2WA/src/Config/XmlConfigurator.cs(134,64): warning CS0618: `System.Configuration.ConfigurationSettings.GetConfig(string)' is obsolete: `This method is obsolete, it has been replaced by System.Configuration!System.Configuration.ConfigurationManager.GetSection'
[csc] /home/jenkins/jenkins-slave/workspace/log4net_feature_cd-pipeline-76KUCPODUF6LCE45226EBUR4GNVLYPMYVC23Z4ITBOMNJT3CA2WA/src/Config/XmlConfigurator.cs(748,6): warning CS0618: `System.Xml.XmlValidatingReader' is obsolete: `Use XmlReader created by XmlReader.Create() method using appropriate XmlReaderSettings instead.'
[csc] /home/jenkins/jenkins-slave/workspace/log4net_feature_cd-pipeline-76KUCPODUF6LCE45226EBUR4GNVLYPMYVC23Z4ITBOMNJT3CA2WA/src/Config/XmlConfigurator.cs(748,42): warning CS0618: `System.Xml.XmlValidatingReader' is obsolete: `Use XmlReader created by XmlReader.Create() method using appropriate XmlReaderSettings instead.'
[csc] /home/jenkins/jenkins-slave/workspace/log4net_feature_cd-pipeline-76KUCPODUF6LCE45226EBUR4GNVLYPMYVC23Z4ITBOMNJT3CA2WA/src/Util/TypeConverters/IPAddressConverter.cs(122,29): warning CS0618: `System.Net.Dns.GetHostByName(string)' is obsolete: `Use GetHostEntry instead'
[csc] /home/jenkins/jenkins-slave/workspace/log4net_feature_cd-pipeline-76KUCPODUF6LCE45226EBUR4GNVLYPMYVC23Z4ITBOMNJT3CA2WA/src/Util/SystemInfo.cs(1007,34): warning CS0618: `System.Configuration.ConfigurationSettings.AppSettings' is obsolete: `This property is obsolete. Please use System.Configuration.ConfigurationManager.AppSettings'
[csc] Compilation succeeded - 6 warning(s)
BUILD SUCCEEDED - 0 non-fatal error(s), 12 warning(s)
Total time: 3.2 seconds.
[Pipeline] stash
Stashed 6 file(s)
[Pipeline] sh
[log4net_feature_cd-pipeline-76KUCPODUF6LCE45226EBUR4GNVLYPMYVC23Z4ITBOMNJT3CA2WA] Running shell script
+ nant -t:mono-4.0 -buildfile:tests/nant.build runtests-mono-4.0
NAnt 0.92 (Build 0.92.4526.0; rc1; 05/23/2012)
Copyright (C) 2001-2012 Gerry Shaw
http://nant.sourceforge.net
Buildfile: file:///home/jenkins/jenkins-slave/workspace/log4net_feature_cd-pipeline-76KUCPODUF6LCE45226EBUR4GNVLYPMYVC23Z4ITBOMNJT3CA2WA/tests/nant.build
Target framework: Mono 4.0 Profile
Target(s) specified: runtests-mono-4.0
check-current-build-config:
set-build-configuration:
set-debug-build-configuration:
check-current-build-config:
set-build-configuration-flags:
check-bin-dir:
[mkdir] Creating directory '/home/jenkins/jenkins-slave/workspace/log4net_feature_cd-pipeline-76KUCPODUF6LCE45226EBUR4GNVLYPMYVC23Z4ITBOMNJT3CA2WA/tests/bin'.
check-doc-dir:
[mkdir] Creating directory '/home/jenkins/jenkins-slave/workspace/log4net_feature_cd-pipeline-76KUCPODUF6LCE45226EBUR4GNVLYPMYVC23Z4ITBOMNJT3CA2WA/tests/doc'.
check-sdkdoc-dir:
check-sdkdoc-debug:
check-build-debug:
check-build-defines:
set-mono-4.0-runtime-configuration:
check-log4net-basedir:
check-current-bin-dir:
[mkdir] Creating directory '/home/jenkins/jenkins-slave/workspace/log4net_feature_cd-pipeline-76KUCPODUF6LCE45226EBUR4GNVLYPMYVC23Z4ITBOMNJT3CA2WA/tests/bin/mono/4.0/debug'.
clean-current-bin-dir:
[echo] Cleaning the bin/mono/4.0/debug binaries directory.
[delete] Deleting directory '/home/jenkins/jenkins-slave/workspace/log4net_feature_cd-pipeline-76KUCPODUF6LCE45226EBUR4GNVLYPMYVC23Z4ITBOMNJT3CA2WA/tests/bin/mono/4.0/debug'.
[mkdir] Creating directory '/home/jenkins/jenkins-slave/workspace/log4net_feature_cd-pipeline-76KUCPODUF6LCE45226EBUR4GNVLYPMYVC23Z4ITBOMNJT3CA2WA/tests/bin/mono/4.0/debug'.
check-log4net-output-dir:
check-log4net-assembly:
[echo] Testing if file exists: ..//bin/mono/4.0/debug/log4net.dll
install-nunit:
[get] Retrieving 'https://github.com/nunit/nunitv2/releases/download/2.6.4/NUnit-2.6.4.zip' to '/home/jenkins/jenkins-slave/workspace/log4net_feature_cd-pipeline-76KUCPODUF6LCE45226EBUR4GNVLYPMYVC23Z4ITBOMNJT3CA2WA/tests/.tmp-nunit.zip'.
[unzip] Unzipping '/home/jenkins/jenkins-slave/workspace/log4net_feature_cd-pipeline-76KUCPODUF6LCE45226EBUR4GNVLYPMYVC23Z4ITBOMNJT3CA2WA/tests/.tmp-nunit.zip' to '/home/jenkins/jenkins-slave/workspace/log4net_feature_cd-pipeline-76KUCPODUF6LCE45226EBUR4GNVLYPMYVC23Z4ITBOMNJT3CA2WA/tests/.tmp-nunit'.
[copy] Copying 1 file to '/home/jenkins/jenkins-slave/workspace/log4net_feature_cd-pipeline-76KUCPODUF6LCE45226EBUR4GNVLYPMYVC23Z4ITBOMNJT3CA2WA/tests/lib/mono/4.0/debug'.
[delete] Deleting file /home/jenkins/jenkins-slave/workspace/log4net_feature_cd-pipeline-76KUCPODUF6LCE45226EBUR4GNVLYPMYVC23Z4ITBOMNJT3CA2WA/tests/.tmp-nunit.zip.
[delete] Deleting directory '/home/jenkins/jenkins-slave/workspace/log4net_feature_cd-pipeline-76KUCPODUF6LCE45226EBUR4GNVLYPMYVC23Z4ITBOMNJT3CA2WA/tests/.tmp-nunit'.
compile-mono-4.0:
[copy] Copying 3 files to '/home/jenkins/jenkins-slave/workspace/log4net_feature_cd-pipeline-76KUCPODUF6LCE45226EBUR4GNVLYPMYVC23Z4ITBOMNJT3CA2WA/tests/bin/mono/4.0/debug'.
[copy] Copying 1 file to '/home/jenkins/jenkins-slave/workspace/log4net_feature_cd-pipeline-76KUCPODUF6LCE45226EBUR4GNVLYPMYVC23Z4ITBOMNJT3CA2WA/tests/bin/mono/4.0/debug'.
[csc] Compiling 46 files to '/home/jenkins/jenkins-slave/workspace/log4net_feature_cd-pipeline-76KUCPODUF6LCE45226EBUR4GNVLYPMYVC23Z4ITBOMNJT3CA2WA/tests/bin/mono/4.0/debug/log4net.Tests.dll'.
runtests-mono-4.0:
[nunit2] log4net:WARN Exception while rendering format [IGNORE THIS WARNING - EXCEPTION EXPECTED Before {0} After {1} {2}]
[nunit2] System.FormatException: Index (zero based) must be greater than or equal to zero and less than the size of the argument list.
[nunit2] at System.Text.StringBuilder.AppendFormat (IFormatProvider provider, System.String format, System.Object[] args) <0x4131ac20 + 0x009cb> in <filename unknown>:0
[nunit2] at System.String.Format (IFormatProvider provider, System.String format, System.Object[] args) <0x4131aa60 + 0x00093> in <filename unknown>:0
[nunit2] at log4net.Util.SystemStringFormat.StringFormat (IFormatProvider provider, System.String format, System.Object[] args) <0x400ae790 + 0x00068> in <filename unknown>:0
[nunit2] log4net:ERROR Hello
[nunit2] log4net:ERROR World
[nunit2] log4net:ERROR This will be recorded.
[nunit2] log4net:ERROR This will be recorded.
[nunit2]
[nunit2] /home/jenkins/jenkins-slave/workspace/log4net_feature_cd-pipeline-76KUCPODUF6LCE45226EBUR4GNVLYPMYVC23Z4ITBOMNJT3CA2WA/tests/nant.build(828,10):
[nunit2] Tests Failed.
BUILD SUCCEEDED - 1 non-fatal error(s), 0 warning(s)
Total time: 20.4 seconds.
[Pipeline] stash
Stashed 1 file(s)
[Pipeline] }
$ docker stop --time=1 a27a9844efcab350300af7dc5332af3deaafb7d0d58dba6fc82b11be17f19944
$ docker rm -f a27a9844efcab350300af7dc5332af3deaafb7d0d58dba6fc82b11be17f19944
[Pipeline] // withDockerContainer
[Pipeline] }
[Pipeline] // stage
[Pipeline] stage
[Pipeline] { (build netstandard)
[Pipeline] getContext
[Pipeline] readFile
[Pipeline] sh
[log4net_feature_cd-pipeline-76KUCPODUF6LCE45226EBUR4GNVLYPMYVC23Z4ITBOMNJT3CA2WA] Running shell script
+ docker build -t 600e428b315d84e92364eed09c1e209b94f0dbaa -f buildtools/docker/builder-netstandard/Dockerfile buildtools/docker/builder-netstandard
Sending build context to Docker daemon 4.096 kB
Step 1/5 : FROM microsoft/dotnet
---> ab1dcd1a2496
Step 2/5 : MAINTAINER "dev@logging.apache.org"
---> Using cache
---> 1a392e603f49
Step 3/5 : RUN apt-get update && apt-get install -y nant git
---> Using cache
---> 67e2a492c30d
Step 4/5 : COPY "useradd-jenkins.sh" /usr/local/bin/useradd-jenkins.sh
---> 5bb9bef0e445
Removing intermediate container ec2cc1743aa1
Step 5/5 : RUN /usr/local/bin/useradd-jenkins.sh
---> Running in 68f5d27022c7
[91mUsage: groupadd [options] GROUP
Options:
-f, --force exit successfully if the group already exists,
and cancel -g if the GID is already used
-g, --gid GID use GID for the new group
-h, --help display this help message and exit
-K, --key KEY=VALUE override /etc/login.defs defaults
-o, --non-unique allow to create groups with duplicate
(non-unique) GID
-p, --password PASSWORD use this encrypted password for the new group
-r, --system create a system account
-R, --root CHROOT_DIR directory to chroot into
[0m[91museradd: group '12040' does not exist
[0mThe command '/bin/sh -c /usr/local/bin/useradd-jenkins.sh' returned a non-zero code: 6
[Pipeline] }
[Pipeline] // stage
[Pipeline] stage
[Pipeline] { (build site)
Stage 'build site' skipped due to earlier failure(s)
[Pipeline] }
[Pipeline] // stage
[Pipeline] stage
[Pipeline] { (prepare package)
Stage 'prepare package' skipped due to earlier failure(s)
[Pipeline] }
[Pipeline] // stage
[Pipeline] stage
[Pipeline] { (check test results)
Stage 'check test results' skipped due to earlier failure(s)
[Pipeline] }
[Pipeline] // stage
[Pipeline] stage
[Pipeline] { (publish site)
Stage 'publish site' skipped due to earlier failure(s)
[Pipeline] }
[Pipeline] // stage
[Pipeline] stage
[Pipeline] { (Declarative: Post Actions)
Build failed in Jenkins: logging-log4net » feature/cd-pipeline #96
Posted by Apache Jenkins Server <je...@builds.apache.org>.
See <https://builds.apache.org/job/logging-log4net/job/feature%252Fcd-pipeline/96/display/redirect>
------------------------------------------
[...truncated 120.15 KB...]
[delete] Deleting directory '/home/jenkins/jenkins-slave/workspace/log4net_feature_cd-pipeline-76KUCPODUF6LCE45226EBUR4GNVLYPMYVC23Z4ITBOMNJT3CA2WA/bin/mono/4.0/debug'.
[mkdir] Creating directory '/home/jenkins/jenkins-slave/workspace/log4net_feature_cd-pipeline-76KUCPODUF6LCE45226EBUR4GNVLYPMYVC23Z4ITBOMNJT3CA2WA/bin/mono/4.0/debug'.
[csc] Compiling 226 files to '/home/jenkins/jenkins-slave/workspace/log4net_feature_cd-pipeline-76KUCPODUF6LCE45226EBUR4GNVLYPMYVC23Z4ITBOMNJT3CA2WA/bin/mono/4.0/debug/log4net.dll'.
[csc] /home/jenkins/jenkins-slave/workspace/log4net_feature_cd-pipeline-76KUCPODUF6LCE45226EBUR4GNVLYPMYVC23Z4ITBOMNJT3CA2WA/src/Appender/EventLogAppender.cs(360,13): warning CS0618: `System.Diagnostics.EventLog.CreateEventSource(string, string, string)' is obsolete: `use CreateEventSource(EventSourceCreationData) instead'
[csc] /home/jenkins/jenkins-slave/workspace/log4net_feature_cd-pipeline-76KUCPODUF6LCE45226EBUR4GNVLYPMYVC23Z4ITBOMNJT3CA2WA/src/Config/XmlConfigurator.cs(134,64): warning CS0618: `System.Configuration.ConfigurationSettings.GetConfig(string)' is obsolete: `This method is obsolete, it has been replaced by System.Configuration!System.Configuration.ConfigurationManager.GetSection'
[csc] /home/jenkins/jenkins-slave/workspace/log4net_feature_cd-pipeline-76KUCPODUF6LCE45226EBUR4GNVLYPMYVC23Z4ITBOMNJT3CA2WA/src/Config/XmlConfigurator.cs(748,6): warning CS0618: `System.Xml.XmlValidatingReader' is obsolete: `Use XmlReader created by XmlReader.Create() method using appropriate XmlReaderSettings instead.'
[csc] /home/jenkins/jenkins-slave/workspace/log4net_feature_cd-pipeline-76KUCPODUF6LCE45226EBUR4GNVLYPMYVC23Z4ITBOMNJT3CA2WA/src/Config/XmlConfigurator.cs(748,42): warning CS0618: `System.Xml.XmlValidatingReader' is obsolete: `Use XmlReader created by XmlReader.Create() method using appropriate XmlReaderSettings instead.'
[csc] /home/jenkins/jenkins-slave/workspace/log4net_feature_cd-pipeline-76KUCPODUF6LCE45226EBUR4GNVLYPMYVC23Z4ITBOMNJT3CA2WA/src/Util/TypeConverters/IPAddressConverter.cs(122,29): warning CS0618: `System.Net.Dns.GetHostByName(string)' is obsolete: `Use GetHostEntry instead'
[csc] /home/jenkins/jenkins-slave/workspace/log4net_feature_cd-pipeline-76KUCPODUF6LCE45226EBUR4GNVLYPMYVC23Z4ITBOMNJT3CA2WA/src/Util/SystemInfo.cs(1007,34): warning CS0618: `System.Configuration.ConfigurationSettings.AppSettings' is obsolete: `This property is obsolete. Please use System.Configuration.ConfigurationManager.AppSettings'
[csc] Compilation succeeded - 6 warning(s)
set-release-build-configuration:
check-current-build-config:
set-build-configuration-flags:
compile-mono-4.0-current-configuration:
check-bin-dir:
check-doc-dir:
check-sdkdoc-dir:
check-sdkdoc-debug:
check-current-build-config:
check-build-debug:
check-build-defines:
set-mono-4.0-runtime-configuration:
check-log4net-basedir:
check-current-bin-dir:
[mkdir] Creating directory '/home/jenkins/jenkins-slave/workspace/log4net_feature_cd-pipeline-76KUCPODUF6LCE45226EBUR4GNVLYPMYVC23Z4ITBOMNJT3CA2WA/bin/mono/4.0/release'.
clean-current-bin-dir:
[echo] Cleaning the bin/mono/4.0/release binaries directory.
[delete] Deleting directory '/home/jenkins/jenkins-slave/workspace/log4net_feature_cd-pipeline-76KUCPODUF6LCE45226EBUR4GNVLYPMYVC23Z4ITBOMNJT3CA2WA/bin/mono/4.0/release'.
[mkdir] Creating directory '/home/jenkins/jenkins-slave/workspace/log4net_feature_cd-pipeline-76KUCPODUF6LCE45226EBUR4GNVLYPMYVC23Z4ITBOMNJT3CA2WA/bin/mono/4.0/release'.
[echo] Old key file not found.
[echo] The release build using the old key will be skipped.
[csc] Compiling 226 files to '/home/jenkins/jenkins-slave/workspace/log4net_feature_cd-pipeline-76KUCPODUF6LCE45226EBUR4GNVLYPMYVC23Z4ITBOMNJT3CA2WA/bin/mono/4.0/release/log4net.dll'.
[csc] /home/jenkins/jenkins-slave/workspace/log4net_feature_cd-pipeline-76KUCPODUF6LCE45226EBUR4GNVLYPMYVC23Z4ITBOMNJT3CA2WA/src/Appender/EventLogAppender.cs(360,13): warning CS0618: `System.Diagnostics.EventLog.CreateEventSource(string, string, string)' is obsolete: `use CreateEventSource(EventSourceCreationData) instead'
[csc] /home/jenkins/jenkins-slave/workspace/log4net_feature_cd-pipeline-76KUCPODUF6LCE45226EBUR4GNVLYPMYVC23Z4ITBOMNJT3CA2WA/src/Config/XmlConfigurator.cs(134,64): warning CS0618: `System.Configuration.ConfigurationSettings.GetConfig(string)' is obsolete: `This method is obsolete, it has been replaced by System.Configuration!System.Configuration.ConfigurationManager.GetSection'
[csc] /home/jenkins/jenkins-slave/workspace/log4net_feature_cd-pipeline-76KUCPODUF6LCE45226EBUR4GNVLYPMYVC23Z4ITBOMNJT3CA2WA/src/Config/XmlConfigurator.cs(748,6): warning CS0618: `System.Xml.XmlValidatingReader' is obsolete: `Use XmlReader created by XmlReader.Create() method using appropriate XmlReaderSettings instead.'
[csc] /home/jenkins/jenkins-slave/workspace/log4net_feature_cd-pipeline-76KUCPODUF6LCE45226EBUR4GNVLYPMYVC23Z4ITBOMNJT3CA2WA/src/Config/XmlConfigurator.cs(748,42): warning CS0618: `System.Xml.XmlValidatingReader' is obsolete: `Use XmlReader created by XmlReader.Create() method using appropriate XmlReaderSettings instead.'
[csc] /home/jenkins/jenkins-slave/workspace/log4net_feature_cd-pipeline-76KUCPODUF6LCE45226EBUR4GNVLYPMYVC23Z4ITBOMNJT3CA2WA/src/Util/TypeConverters/IPAddressConverter.cs(122,29): warning CS0618: `System.Net.Dns.GetHostByName(string)' is obsolete: `Use GetHostEntry instead'
[csc] /home/jenkins/jenkins-slave/workspace/log4net_feature_cd-pipeline-76KUCPODUF6LCE45226EBUR4GNVLYPMYVC23Z4ITBOMNJT3CA2WA/src/Util/SystemInfo.cs(1007,34): warning CS0618: `System.Configuration.ConfigurationSettings.AppSettings' is obsolete: `This property is obsolete. Please use System.Configuration.ConfigurationManager.AppSettings'
[csc] Compilation succeeded - 6 warning(s)
BUILD SUCCEEDED - 0 non-fatal error(s), 12 warning(s)
Total time: 3.2 seconds.
[Pipeline] stash
Stashed 6 file(s)
[Pipeline] sh
[log4net_feature_cd-pipeline-76KUCPODUF6LCE45226EBUR4GNVLYPMYVC23Z4ITBOMNJT3CA2WA] Running shell script
+ nant -t:mono-4.0 -buildfile:tests/nant.build runtests-mono-4.0
NAnt 0.92 (Build 0.92.4526.0; rc1; 05/23/2012)
Copyright (C) 2001-2012 Gerry Shaw
http://nant.sourceforge.net
Buildfile: file:///home/jenkins/jenkins-slave/workspace/log4net_feature_cd-pipeline-76KUCPODUF6LCE45226EBUR4GNVLYPMYVC23Z4ITBOMNJT3CA2WA/tests/nant.build
Target framework: Mono 4.0 Profile
Target(s) specified: runtests-mono-4.0
check-current-build-config:
set-build-configuration:
set-debug-build-configuration:
check-current-build-config:
set-build-configuration-flags:
check-bin-dir:
[mkdir] Creating directory '/home/jenkins/jenkins-slave/workspace/log4net_feature_cd-pipeline-76KUCPODUF6LCE45226EBUR4GNVLYPMYVC23Z4ITBOMNJT3CA2WA/tests/bin'.
check-doc-dir:
[mkdir] Creating directory '/home/jenkins/jenkins-slave/workspace/log4net_feature_cd-pipeline-76KUCPODUF6LCE45226EBUR4GNVLYPMYVC23Z4ITBOMNJT3CA2WA/tests/doc'.
check-sdkdoc-dir:
check-sdkdoc-debug:
check-build-debug:
check-build-defines:
set-mono-4.0-runtime-configuration:
check-log4net-basedir:
check-current-bin-dir:
[mkdir] Creating directory '/home/jenkins/jenkins-slave/workspace/log4net_feature_cd-pipeline-76KUCPODUF6LCE45226EBUR4GNVLYPMYVC23Z4ITBOMNJT3CA2WA/tests/bin/mono/4.0/debug'.
clean-current-bin-dir:
[echo] Cleaning the bin/mono/4.0/debug binaries directory.
[delete] Deleting directory '/home/jenkins/jenkins-slave/workspace/log4net_feature_cd-pipeline-76KUCPODUF6LCE45226EBUR4GNVLYPMYVC23Z4ITBOMNJT3CA2WA/tests/bin/mono/4.0/debug'.
[mkdir] Creating directory '/home/jenkins/jenkins-slave/workspace/log4net_feature_cd-pipeline-76KUCPODUF6LCE45226EBUR4GNVLYPMYVC23Z4ITBOMNJT3CA2WA/tests/bin/mono/4.0/debug'.
check-log4net-output-dir:
check-log4net-assembly:
[echo] Testing if file exists: ..//bin/mono/4.0/debug/log4net.dll
install-nunit:
[get] Retrieving 'https://github.com/nunit/nunitv2/releases/download/2.6.4/NUnit-2.6.4.zip' to '/home/jenkins/jenkins-slave/workspace/log4net_feature_cd-pipeline-76KUCPODUF6LCE45226EBUR4GNVLYPMYVC23Z4ITBOMNJT3CA2WA/tests/.tmp-nunit.zip'.
[unzip] Unzipping '/home/jenkins/jenkins-slave/workspace/log4net_feature_cd-pipeline-76KUCPODUF6LCE45226EBUR4GNVLYPMYVC23Z4ITBOMNJT3CA2WA/tests/.tmp-nunit.zip' to '/home/jenkins/jenkins-slave/workspace/log4net_feature_cd-pipeline-76KUCPODUF6LCE45226EBUR4GNVLYPMYVC23Z4ITBOMNJT3CA2WA/tests/.tmp-nunit'.
[copy] Copying 1 file to '/home/jenkins/jenkins-slave/workspace/log4net_feature_cd-pipeline-76KUCPODUF6LCE45226EBUR4GNVLYPMYVC23Z4ITBOMNJT3CA2WA/tests/lib/mono/4.0/debug'.
[delete] Deleting file /home/jenkins/jenkins-slave/workspace/log4net_feature_cd-pipeline-76KUCPODUF6LCE45226EBUR4GNVLYPMYVC23Z4ITBOMNJT3CA2WA/tests/.tmp-nunit.zip.
[delete] Deleting directory '/home/jenkins/jenkins-slave/workspace/log4net_feature_cd-pipeline-76KUCPODUF6LCE45226EBUR4GNVLYPMYVC23Z4ITBOMNJT3CA2WA/tests/.tmp-nunit'.
compile-mono-4.0:
[copy] Copying 3 files to '/home/jenkins/jenkins-slave/workspace/log4net_feature_cd-pipeline-76KUCPODUF6LCE45226EBUR4GNVLYPMYVC23Z4ITBOMNJT3CA2WA/tests/bin/mono/4.0/debug'.
[copy] Copying 1 file to '/home/jenkins/jenkins-slave/workspace/log4net_feature_cd-pipeline-76KUCPODUF6LCE45226EBUR4GNVLYPMYVC23Z4ITBOMNJT3CA2WA/tests/bin/mono/4.0/debug'.
[csc] Compiling 46 files to '/home/jenkins/jenkins-slave/workspace/log4net_feature_cd-pipeline-76KUCPODUF6LCE45226EBUR4GNVLYPMYVC23Z4ITBOMNJT3CA2WA/tests/bin/mono/4.0/debug/log4net.Tests.dll'.
runtests-mono-4.0:
[nunit2] log4net:WARN Exception while rendering format [IGNORE THIS WARNING - EXCEPTION EXPECTED Before {0} After {1} {2}]
[nunit2] System.FormatException: Index (zero based) must be greater than or equal to zero and less than the size of the argument list.
[nunit2] at System.Text.StringBuilder.AppendFormat (IFormatProvider provider, System.String format, System.Object[] args) <0x41338c20 + 0x009cb> in <filename unknown>:0
[nunit2] at System.String.Format (IFormatProvider provider, System.String format, System.Object[] args) <0x41338a60 + 0x00093> in <filename unknown>:0
[nunit2] at log4net.Util.SystemStringFormat.StringFormat (IFormatProvider provider, System.String format, System.Object[] args) <0x4144eca0 + 0x00068> in <filename unknown>:0
[nunit2] log4net:ERROR Hello
[nunit2] log4net:ERROR World
[nunit2] log4net:ERROR This will be recorded.
[nunit2] log4net:ERROR This will be recorded.
[nunit2]
[nunit2] /home/jenkins/jenkins-slave/workspace/log4net_feature_cd-pipeline-76KUCPODUF6LCE45226EBUR4GNVLYPMYVC23Z4ITBOMNJT3CA2WA/tests/nant.build(828,10):
[nunit2] Tests Failed.
BUILD SUCCEEDED - 1 non-fatal error(s), 0 warning(s)
Total time: 20.3 seconds.
[Pipeline] stash
Stashed 1 file(s)
[Pipeline] }
$ docker stop --time=1 6735500bd3d006571ffd262bb1fae2178377f294733ea217715a6c0f70620b73
$ docker rm -f 6735500bd3d006571ffd262bb1fae2178377f294733ea217715a6c0f70620b73
[Pipeline] // withDockerContainer
[Pipeline] }
[Pipeline] // stage
[Pipeline] stage
[Pipeline] { (build netstandard)
[Pipeline] getContext
[Pipeline] readFile
[Pipeline] sh
[log4net_feature_cd-pipeline-76KUCPODUF6LCE45226EBUR4GNVLYPMYVC23Z4ITBOMNJT3CA2WA] Running shell script
+ docker build -t 600e428b315d84e92364eed09c1e209b94f0dbaa -f buildtools/docker/builder-netstandard/Dockerfile buildtools/docker/builder-netstandard
Sending build context to Docker daemon 4.096 kB
Step 1/5 : FROM microsoft/dotnet
---> ab1dcd1a2496
Step 2/5 : MAINTAINER "dev@logging.apache.org"
---> Using cache
---> 1a392e603f49
Step 3/5 : RUN apt-get update && apt-get install -y nant git
---> Using cache
---> 67e2a492c30d
Step 4/5 : COPY "useradd-jenkins.sh" /usr/local/bin/useradd-jenkins.sh
---> f60245a7468a
Removing intermediate container 099f89172142
Step 5/5 : RUN /usr/local/bin/useradd-jenkins.sh
---> Running in 70d0b8bcbb28
[91mUsage: groupadd [options] GROUP
Options:
-f, --force exit successfully if the group already exists,
and cancel -g if the GID is already used
-g, --gid GID use GID for the new group
-h, --help display this help message and exit
-K, --key KEY=VALUE override /etc/login.defs defaults
-o, --non-unique allow to create groups with duplicate
(non-unique) GID
-p, --password PASSWORD use this encrypted password for the new group
-r, --system create a system account
-R, --root CHROOT_DIR directory to chroot into
[0m[91museradd: group '12040' does not exist
[0mThe command '/bin/sh -c /usr/local/bin/useradd-jenkins.sh' returned a non-zero code: 6
[Pipeline] }
[Pipeline] // stage
[Pipeline] stage
[Pipeline] { (build site)
Stage 'build site' skipped due to earlier failure(s)
[Pipeline] }
[Pipeline] // stage
[Pipeline] stage
[Pipeline] { (prepare package)
Stage 'prepare package' skipped due to earlier failure(s)
[Pipeline] }
[Pipeline] // stage
[Pipeline] stage
[Pipeline] { (check test results)
Stage 'check test results' skipped due to earlier failure(s)
[Pipeline] }
[Pipeline] // stage
[Pipeline] stage
[Pipeline] { (publish site)
Stage 'publish site' skipped due to earlier failure(s)
[Pipeline] }
[Pipeline] // stage
[Pipeline] stage
[Pipeline] { (Declarative: Post Actions)
[Pipeline] step
Build failed in Jenkins: logging-log4net » feature/cd-pipeline #95
Posted by Apache Jenkins Server <je...@builds.apache.org>.
See <https://builds.apache.org/job/logging-log4net/job/feature%252Fcd-pipeline/95/display/redirect>
------------------------------------------
[...truncated 119.87 KB...]
set-mono-4.0-runtime-configuration:
check-log4net-basedir:
check-current-bin-dir:
[mkdir] Creating directory '/home/jenkins/jenkins-slave/workspace/log4net_feature_cd-pipeline-76KUCPODUF6LCE45226EBUR4GNVLYPMYVC23Z4ITBOMNJT3CA2WA/bin/mono/4.0/debug'.
clean-current-bin-dir:
[echo] Cleaning the bin/mono/4.0/debug binaries directory.
[delete] Deleting directory '/home/jenkins/jenkins-slave/workspace/log4net_feature_cd-pipeline-76KUCPODUF6LCE45226EBUR4GNVLYPMYVC23Z4ITBOMNJT3CA2WA/bin/mono/4.0/debug'.
[mkdir] Creating directory '/home/jenkins/jenkins-slave/workspace/log4net_feature_cd-pipeline-76KUCPODUF6LCE45226EBUR4GNVLYPMYVC23Z4ITBOMNJT3CA2WA/bin/mono/4.0/debug'.
[csc] Compiling 226 files to '/home/jenkins/jenkins-slave/workspace/log4net_feature_cd-pipeline-76KUCPODUF6LCE45226EBUR4GNVLYPMYVC23Z4ITBOMNJT3CA2WA/bin/mono/4.0/debug/log4net.dll'.
[csc] /home/jenkins/jenkins-slave/workspace/log4net_feature_cd-pipeline-76KUCPODUF6LCE45226EBUR4GNVLYPMYVC23Z4ITBOMNJT3CA2WA/src/Appender/EventLogAppender.cs(360,13): warning CS0618: `System.Diagnostics.EventLog.CreateEventSource(string, string, string)' is obsolete: `use CreateEventSource(EventSourceCreationData) instead'
[csc] /home/jenkins/jenkins-slave/workspace/log4net_feature_cd-pipeline-76KUCPODUF6LCE45226EBUR4GNVLYPMYVC23Z4ITBOMNJT3CA2WA/src/Config/XmlConfigurator.cs(134,64): warning CS0618: `System.Configuration.ConfigurationSettings.GetConfig(string)' is obsolete: `This method is obsolete, it has been replaced by System.Configuration!System.Configuration.ConfigurationManager.GetSection'
[csc] /home/jenkins/jenkins-slave/workspace/log4net_feature_cd-pipeline-76KUCPODUF6LCE45226EBUR4GNVLYPMYVC23Z4ITBOMNJT3CA2WA/src/Config/XmlConfigurator.cs(748,6): warning CS0618: `System.Xml.XmlValidatingReader' is obsolete: `Use XmlReader created by XmlReader.Create() method using appropriate XmlReaderSettings instead.'
[csc] /home/jenkins/jenkins-slave/workspace/log4net_feature_cd-pipeline-76KUCPODUF6LCE45226EBUR4GNVLYPMYVC23Z4ITBOMNJT3CA2WA/src/Config/XmlConfigurator.cs(748,42): warning CS0618: `System.Xml.XmlValidatingReader' is obsolete: `Use XmlReader created by XmlReader.Create() method using appropriate XmlReaderSettings instead.'
[csc] /home/jenkins/jenkins-slave/workspace/log4net_feature_cd-pipeline-76KUCPODUF6LCE45226EBUR4GNVLYPMYVC23Z4ITBOMNJT3CA2WA/src/Util/TypeConverters/IPAddressConverter.cs(122,29): warning CS0618: `System.Net.Dns.GetHostByName(string)' is obsolete: `Use GetHostEntry instead'
[csc] /home/jenkins/jenkins-slave/workspace/log4net_feature_cd-pipeline-76KUCPODUF6LCE45226EBUR4GNVLYPMYVC23Z4ITBOMNJT3CA2WA/src/Util/SystemInfo.cs(1007,34): warning CS0618: `System.Configuration.ConfigurationSettings.AppSettings' is obsolete: `This property is obsolete. Please use System.Configuration.ConfigurationManager.AppSettings'
[csc] Compilation succeeded - 6 warning(s)
set-release-build-configuration:
check-current-build-config:
set-build-configuration-flags:
compile-mono-4.0-current-configuration:
check-bin-dir:
check-doc-dir:
check-sdkdoc-dir:
check-sdkdoc-debug:
check-current-build-config:
check-build-debug:
check-build-defines:
set-mono-4.0-runtime-configuration:
check-log4net-basedir:
check-current-bin-dir:
[mkdir] Creating directory '/home/jenkins/jenkins-slave/workspace/log4net_feature_cd-pipeline-76KUCPODUF6LCE45226EBUR4GNVLYPMYVC23Z4ITBOMNJT3CA2WA/bin/mono/4.0/release'.
clean-current-bin-dir:
[echo] Cleaning the bin/mono/4.0/release binaries directory.
[delete] Deleting directory '/home/jenkins/jenkins-slave/workspace/log4net_feature_cd-pipeline-76KUCPODUF6LCE45226EBUR4GNVLYPMYVC23Z4ITBOMNJT3CA2WA/bin/mono/4.0/release'.
[mkdir] Creating directory '/home/jenkins/jenkins-slave/workspace/log4net_feature_cd-pipeline-76KUCPODUF6LCE45226EBUR4GNVLYPMYVC23Z4ITBOMNJT3CA2WA/bin/mono/4.0/release'.
[echo] Old key file not found.
[echo] The release build using the old key will be skipped.
[csc] Compiling 226 files to '/home/jenkins/jenkins-slave/workspace/log4net_feature_cd-pipeline-76KUCPODUF6LCE45226EBUR4GNVLYPMYVC23Z4ITBOMNJT3CA2WA/bin/mono/4.0/release/log4net.dll'.
[csc] /home/jenkins/jenkins-slave/workspace/log4net_feature_cd-pipeline-76KUCPODUF6LCE45226EBUR4GNVLYPMYVC23Z4ITBOMNJT3CA2WA/src/Appender/EventLogAppender.cs(360,13): warning CS0618: `System.Diagnostics.EventLog.CreateEventSource(string, string, string)' is obsolete: `use CreateEventSource(EventSourceCreationData) instead'
[csc] /home/jenkins/jenkins-slave/workspace/log4net_feature_cd-pipeline-76KUCPODUF6LCE45226EBUR4GNVLYPMYVC23Z4ITBOMNJT3CA2WA/src/Config/XmlConfigurator.cs(134,64): warning CS0618: `System.Configuration.ConfigurationSettings.GetConfig(string)' is obsolete: `This method is obsolete, it has been replaced by System.Configuration!System.Configuration.ConfigurationManager.GetSection'
[csc] /home/jenkins/jenkins-slave/workspace/log4net_feature_cd-pipeline-76KUCPODUF6LCE45226EBUR4GNVLYPMYVC23Z4ITBOMNJT3CA2WA/src/Config/XmlConfigurator.cs(748,6): warning CS0618: `System.Xml.XmlValidatingReader' is obsolete: `Use XmlReader created by XmlReader.Create() method using appropriate XmlReaderSettings instead.'
[csc] /home/jenkins/jenkins-slave/workspace/log4net_feature_cd-pipeline-76KUCPODUF6LCE45226EBUR4GNVLYPMYVC23Z4ITBOMNJT3CA2WA/src/Config/XmlConfigurator.cs(748,42): warning CS0618: `System.Xml.XmlValidatingReader' is obsolete: `Use XmlReader created by XmlReader.Create() method using appropriate XmlReaderSettings instead.'
[csc] /home/jenkins/jenkins-slave/workspace/log4net_feature_cd-pipeline-76KUCPODUF6LCE45226EBUR4GNVLYPMYVC23Z4ITBOMNJT3CA2WA/src/Util/TypeConverters/IPAddressConverter.cs(122,29): warning CS0618: `System.Net.Dns.GetHostByName(string)' is obsolete: `Use GetHostEntry instead'
[csc] /home/jenkins/jenkins-slave/workspace/log4net_feature_cd-pipeline-76KUCPODUF6LCE45226EBUR4GNVLYPMYVC23Z4ITBOMNJT3CA2WA/src/Util/SystemInfo.cs(1007,34): warning CS0618: `System.Configuration.ConfigurationSettings.AppSettings' is obsolete: `This property is obsolete. Please use System.Configuration.ConfigurationManager.AppSettings'
[csc] Compilation succeeded - 6 warning(s)
BUILD SUCCEEDED - 0 non-fatal error(s), 12 warning(s)
Total time: 3 seconds.
[Pipeline] stash
Stashed 6 file(s)
[Pipeline] sh
[log4net_feature_cd-pipeline-76KUCPODUF6LCE45226EBUR4GNVLYPMYVC23Z4ITBOMNJT3CA2WA] Running shell script
+ nant -t:mono-4.0 -buildfile:tests/nant.build runtests-mono-4.0
NAnt 0.92 (Build 0.92.4526.0; rc1; 05/23/2012)
Copyright (C) 2001-2012 Gerry Shaw
http://nant.sourceforge.net
Buildfile: file:///home/jenkins/jenkins-slave/workspace/log4net_feature_cd-pipeline-76KUCPODUF6LCE45226EBUR4GNVLYPMYVC23Z4ITBOMNJT3CA2WA/tests/nant.build
Target framework: Mono 4.0 Profile
Target(s) specified: runtests-mono-4.0
check-current-build-config:
set-build-configuration:
set-debug-build-configuration:
check-current-build-config:
set-build-configuration-flags:
check-bin-dir:
[mkdir] Creating directory '/home/jenkins/jenkins-slave/workspace/log4net_feature_cd-pipeline-76KUCPODUF6LCE45226EBUR4GNVLYPMYVC23Z4ITBOMNJT3CA2WA/tests/bin'.
check-doc-dir:
[mkdir] Creating directory '/home/jenkins/jenkins-slave/workspace/log4net_feature_cd-pipeline-76KUCPODUF6LCE45226EBUR4GNVLYPMYVC23Z4ITBOMNJT3CA2WA/tests/doc'.
check-sdkdoc-dir:
check-sdkdoc-debug:
check-build-debug:
check-build-defines:
set-mono-4.0-runtime-configuration:
check-log4net-basedir:
check-current-bin-dir:
[mkdir] Creating directory '/home/jenkins/jenkins-slave/workspace/log4net_feature_cd-pipeline-76KUCPODUF6LCE45226EBUR4GNVLYPMYVC23Z4ITBOMNJT3CA2WA/tests/bin/mono/4.0/debug'.
clean-current-bin-dir:
[echo] Cleaning the bin/mono/4.0/debug binaries directory.
[delete] Deleting directory '/home/jenkins/jenkins-slave/workspace/log4net_feature_cd-pipeline-76KUCPODUF6LCE45226EBUR4GNVLYPMYVC23Z4ITBOMNJT3CA2WA/tests/bin/mono/4.0/debug'.
[mkdir] Creating directory '/home/jenkins/jenkins-slave/workspace/log4net_feature_cd-pipeline-76KUCPODUF6LCE45226EBUR4GNVLYPMYVC23Z4ITBOMNJT3CA2WA/tests/bin/mono/4.0/debug'.
check-log4net-output-dir:
check-log4net-assembly:
[echo] Testing if file exists: ..//bin/mono/4.0/debug/log4net.dll
install-nunit:
[get] Retrieving 'https://github.com/nunit/nunitv2/releases/download/2.6.4/NUnit-2.6.4.zip' to '/home/jenkins/jenkins-slave/workspace/log4net_feature_cd-pipeline-76KUCPODUF6LCE45226EBUR4GNVLYPMYVC23Z4ITBOMNJT3CA2WA/tests/.tmp-nunit.zip'.
[unzip] Unzipping '/home/jenkins/jenkins-slave/workspace/log4net_feature_cd-pipeline-76KUCPODUF6LCE45226EBUR4GNVLYPMYVC23Z4ITBOMNJT3CA2WA/tests/.tmp-nunit.zip' to '/home/jenkins/jenkins-slave/workspace/log4net_feature_cd-pipeline-76KUCPODUF6LCE45226EBUR4GNVLYPMYVC23Z4ITBOMNJT3CA2WA/tests/.tmp-nunit'.
[copy] Copying 1 file to '/home/jenkins/jenkins-slave/workspace/log4net_feature_cd-pipeline-76KUCPODUF6LCE45226EBUR4GNVLYPMYVC23Z4ITBOMNJT3CA2WA/tests/lib/mono/4.0/debug'.
[delete] Deleting file /home/jenkins/jenkins-slave/workspace/log4net_feature_cd-pipeline-76KUCPODUF6LCE45226EBUR4GNVLYPMYVC23Z4ITBOMNJT3CA2WA/tests/.tmp-nunit.zip.
[delete] Deleting directory '/home/jenkins/jenkins-slave/workspace/log4net_feature_cd-pipeline-76KUCPODUF6LCE45226EBUR4GNVLYPMYVC23Z4ITBOMNJT3CA2WA/tests/.tmp-nunit'.
compile-mono-4.0:
[copy] Copying 3 files to '/home/jenkins/jenkins-slave/workspace/log4net_feature_cd-pipeline-76KUCPODUF6LCE45226EBUR4GNVLYPMYVC23Z4ITBOMNJT3CA2WA/tests/bin/mono/4.0/debug'.
[copy] Copying 1 file to '/home/jenkins/jenkins-slave/workspace/log4net_feature_cd-pipeline-76KUCPODUF6LCE45226EBUR4GNVLYPMYVC23Z4ITBOMNJT3CA2WA/tests/bin/mono/4.0/debug'.
[csc] Compiling 46 files to '/home/jenkins/jenkins-slave/workspace/log4net_feature_cd-pipeline-76KUCPODUF6LCE45226EBUR4GNVLYPMYVC23Z4ITBOMNJT3CA2WA/tests/bin/mono/4.0/debug/log4net.Tests.dll'.
runtests-mono-4.0:
[nunit2] log4net:WARN Exception while rendering format [IGNORE THIS WARNING - EXCEPTION EXPECTED Before {0} After {1} {2}]
[nunit2] System.FormatException: Index (zero based) must be greater than or equal to zero and less than the size of the argument list.
[nunit2] at System.Text.StringBuilder.AppendFormat (IFormatProvider provider, System.String format, System.Object[] args) <0x40b90c20 + 0x009cb> in <filename unknown>:0
[nunit2] at System.String.Format (IFormatProvider provider, System.String format, System.Object[] args) <0x40b90a60 + 0x00093> in <filename unknown>:0
[nunit2] at log4net.Util.SystemStringFormat.StringFormat (IFormatProvider provider, System.String format, System.Object[] args) <0x40ca6960 + 0x00068> in <filename unknown>:0
[nunit2] log4net:ERROR Hello
[nunit2] log4net:ERROR World
[nunit2] log4net:ERROR This will be recorded.
[nunit2] log4net:ERROR This will be recorded.
[nunit2]
[nunit2] /home/jenkins/jenkins-slave/workspace/log4net_feature_cd-pipeline-76KUCPODUF6LCE45226EBUR4GNVLYPMYVC23Z4ITBOMNJT3CA2WA/tests/nant.build(828,10):
[nunit2] Tests Failed.
BUILD SUCCEEDED - 1 non-fatal error(s), 0 warning(s)
Total time: 20.2 seconds.
[Pipeline] stash
Stashed 1 file(s)
[Pipeline] }
$ docker stop --time=1 55b788f73657225ec6aff73c30cafc517c74265d2c5825408b67dd58b545131f
$ docker rm -f 55b788f73657225ec6aff73c30cafc517c74265d2c5825408b67dd58b545131f
[Pipeline] // withDockerContainer
[Pipeline] }
[Pipeline] // stage
[Pipeline] stage
[Pipeline] { (build netstandard)
[Pipeline] getContext
[Pipeline] readFile
[Pipeline] sh
[log4net_feature_cd-pipeline-76KUCPODUF6LCE45226EBUR4GNVLYPMYVC23Z4ITBOMNJT3CA2WA] Running shell script
+ docker build -t 600e428b315d84e92364eed09c1e209b94f0dbaa -f buildtools/docker/builder-netstandard/Dockerfile buildtools/docker/builder-netstandard
Sending build context to Docker daemon 4.096 kB
Step 1/5 : FROM microsoft/dotnet
---> ab1dcd1a2496
Step 2/5 : MAINTAINER "dev@logging.apache.org"
---> Using cache
---> 1a392e603f49
Step 3/5 : RUN apt-get update && apt-get install -y nant git
---> Using cache
---> 67e2a492c30d
Step 4/5 : COPY "useradd-jenkins.sh" /usr/local/bin/useradd-jenkins.sh
---> 8ec3d114fdc2
Removing intermediate container ec8eb9a8e344
Step 5/5 : RUN /usr/local/bin/useradd-jenkins.sh
---> Running in 40002bb6e869
[91mgroupadd: GID '0' already exists
[0m[91museradd: UID 0 is not unique
[0mThe command '/bin/sh -c /usr/local/bin/useradd-jenkins.sh' returned a non-zero code: 4
[Pipeline] }
[Pipeline] // stage
[Pipeline] stage
[Pipeline] { (build site)
Stage 'build site' skipped due to earlier failure(s)
[Pipeline] }
[Pipeline] // stage
[Pipeline] stage
[Pipeline] { (prepare package)
Stage 'prepare package' skipped due to earlier failure(s)
[Pipeline] }
[Pipeline] // stage
[Pipeline] stage
[Pipeline] { (check test results)
Stage 'check test results' skipped due to earlier failure(s)
[Pipeline] }
[Pipeline] // stage
[Pipeline] stage
[Pipeline] { (publish site)
Stage 'publish site' skipped due to earlier failure(s)
[Pipeline] }
[Pipeline] // stage
[Pipeline] stage
[Pipeline] { (Declarative: Post Actions)
[Pipeline] step
Build failed in Jenkins: logging-log4net » feature/cd-pipeline #94
Posted by Apache Jenkins Server <je...@builds.apache.org>.
See <https://builds.apache.org/job/logging-log4net/job/feature%252Fcd-pipeline/94/display/redirect>
------------------------------------------
[...truncated 119.84 KB...]
check-build-defines:
set-mono-4.0-runtime-configuration:
check-log4net-basedir:
check-current-bin-dir:
[mkdir] Creating directory '/home/jenkins/jenkins-slave/workspace/log4net_feature_cd-pipeline-76KUCPODUF6LCE45226EBUR4GNVLYPMYVC23Z4ITBOMNJT3CA2WA/bin/mono/4.0/debug'.
clean-current-bin-dir:
[echo] Cleaning the bin/mono/4.0/debug binaries directory.
[delete] Deleting directory '/home/jenkins/jenkins-slave/workspace/log4net_feature_cd-pipeline-76KUCPODUF6LCE45226EBUR4GNVLYPMYVC23Z4ITBOMNJT3CA2WA/bin/mono/4.0/debug'.
[mkdir] Creating directory '/home/jenkins/jenkins-slave/workspace/log4net_feature_cd-pipeline-76KUCPODUF6LCE45226EBUR4GNVLYPMYVC23Z4ITBOMNJT3CA2WA/bin/mono/4.0/debug'.
[csc] Compiling 226 files to '/home/jenkins/jenkins-slave/workspace/log4net_feature_cd-pipeline-76KUCPODUF6LCE45226EBUR4GNVLYPMYVC23Z4ITBOMNJT3CA2WA/bin/mono/4.0/debug/log4net.dll'.
[csc] /home/jenkins/jenkins-slave/workspace/log4net_feature_cd-pipeline-76KUCPODUF6LCE45226EBUR4GNVLYPMYVC23Z4ITBOMNJT3CA2WA/src/Appender/EventLogAppender.cs(360,13): warning CS0618: `System.Diagnostics.EventLog.CreateEventSource(string, string, string)' is obsolete: `use CreateEventSource(EventSourceCreationData) instead'
[csc] /home/jenkins/jenkins-slave/workspace/log4net_feature_cd-pipeline-76KUCPODUF6LCE45226EBUR4GNVLYPMYVC23Z4ITBOMNJT3CA2WA/src/Config/XmlConfigurator.cs(134,64): warning CS0618: `System.Configuration.ConfigurationSettings.GetConfig(string)' is obsolete: `This method is obsolete, it has been replaced by System.Configuration!System.Configuration.ConfigurationManager.GetSection'
[csc] /home/jenkins/jenkins-slave/workspace/log4net_feature_cd-pipeline-76KUCPODUF6LCE45226EBUR4GNVLYPMYVC23Z4ITBOMNJT3CA2WA/src/Config/XmlConfigurator.cs(748,6): warning CS0618: `System.Xml.XmlValidatingReader' is obsolete: `Use XmlReader created by XmlReader.Create() method using appropriate XmlReaderSettings instead.'
[csc] /home/jenkins/jenkins-slave/workspace/log4net_feature_cd-pipeline-76KUCPODUF6LCE45226EBUR4GNVLYPMYVC23Z4ITBOMNJT3CA2WA/src/Config/XmlConfigurator.cs(748,42): warning CS0618: `System.Xml.XmlValidatingReader' is obsolete: `Use XmlReader created by XmlReader.Create() method using appropriate XmlReaderSettings instead.'
[csc] /home/jenkins/jenkins-slave/workspace/log4net_feature_cd-pipeline-76KUCPODUF6LCE45226EBUR4GNVLYPMYVC23Z4ITBOMNJT3CA2WA/src/Util/TypeConverters/IPAddressConverter.cs(122,29): warning CS0618: `System.Net.Dns.GetHostByName(string)' is obsolete: `Use GetHostEntry instead'
[csc] /home/jenkins/jenkins-slave/workspace/log4net_feature_cd-pipeline-76KUCPODUF6LCE45226EBUR4GNVLYPMYVC23Z4ITBOMNJT3CA2WA/src/Util/SystemInfo.cs(1007,34): warning CS0618: `System.Configuration.ConfigurationSettings.AppSettings' is obsolete: `This property is obsolete. Please use System.Configuration.ConfigurationManager.AppSettings'
[csc] Compilation succeeded - 6 warning(s)
set-release-build-configuration:
check-current-build-config:
set-build-configuration-flags:
compile-mono-4.0-current-configuration:
check-bin-dir:
check-doc-dir:
check-sdkdoc-dir:
check-sdkdoc-debug:
check-current-build-config:
check-build-debug:
check-build-defines:
set-mono-4.0-runtime-configuration:
check-log4net-basedir:
check-current-bin-dir:
[mkdir] Creating directory '/home/jenkins/jenkins-slave/workspace/log4net_feature_cd-pipeline-76KUCPODUF6LCE45226EBUR4GNVLYPMYVC23Z4ITBOMNJT3CA2WA/bin/mono/4.0/release'.
clean-current-bin-dir:
[echo] Cleaning the bin/mono/4.0/release binaries directory.
[delete] Deleting directory '/home/jenkins/jenkins-slave/workspace/log4net_feature_cd-pipeline-76KUCPODUF6LCE45226EBUR4GNVLYPMYVC23Z4ITBOMNJT3CA2WA/bin/mono/4.0/release'.
[mkdir] Creating directory '/home/jenkins/jenkins-slave/workspace/log4net_feature_cd-pipeline-76KUCPODUF6LCE45226EBUR4GNVLYPMYVC23Z4ITBOMNJT3CA2WA/bin/mono/4.0/release'.
[echo] Old key file not found.
[echo] The release build using the old key will be skipped.
[csc] Compiling 226 files to '/home/jenkins/jenkins-slave/workspace/log4net_feature_cd-pipeline-76KUCPODUF6LCE45226EBUR4GNVLYPMYVC23Z4ITBOMNJT3CA2WA/bin/mono/4.0/release/log4net.dll'.
[csc] /home/jenkins/jenkins-slave/workspace/log4net_feature_cd-pipeline-76KUCPODUF6LCE45226EBUR4GNVLYPMYVC23Z4ITBOMNJT3CA2WA/src/Appender/EventLogAppender.cs(360,13): warning CS0618: `System.Diagnostics.EventLog.CreateEventSource(string, string, string)' is obsolete: `use CreateEventSource(EventSourceCreationData) instead'
[csc] /home/jenkins/jenkins-slave/workspace/log4net_feature_cd-pipeline-76KUCPODUF6LCE45226EBUR4GNVLYPMYVC23Z4ITBOMNJT3CA2WA/src/Config/XmlConfigurator.cs(134,64): warning CS0618: `System.Configuration.ConfigurationSettings.GetConfig(string)' is obsolete: `This method is obsolete, it has been replaced by System.Configuration!System.Configuration.ConfigurationManager.GetSection'
[csc] /home/jenkins/jenkins-slave/workspace/log4net_feature_cd-pipeline-76KUCPODUF6LCE45226EBUR4GNVLYPMYVC23Z4ITBOMNJT3CA2WA/src/Config/XmlConfigurator.cs(748,6): warning CS0618: `System.Xml.XmlValidatingReader' is obsolete: `Use XmlReader created by XmlReader.Create() method using appropriate XmlReaderSettings instead.'
[csc] /home/jenkins/jenkins-slave/workspace/log4net_feature_cd-pipeline-76KUCPODUF6LCE45226EBUR4GNVLYPMYVC23Z4ITBOMNJT3CA2WA/src/Config/XmlConfigurator.cs(748,42): warning CS0618: `System.Xml.XmlValidatingReader' is obsolete: `Use XmlReader created by XmlReader.Create() method using appropriate XmlReaderSettings instead.'
[csc] /home/jenkins/jenkins-slave/workspace/log4net_feature_cd-pipeline-76KUCPODUF6LCE45226EBUR4GNVLYPMYVC23Z4ITBOMNJT3CA2WA/src/Util/TypeConverters/IPAddressConverter.cs(122,29): warning CS0618: `System.Net.Dns.GetHostByName(string)' is obsolete: `Use GetHostEntry instead'
[csc] /home/jenkins/jenkins-slave/workspace/log4net_feature_cd-pipeline-76KUCPODUF6LCE45226EBUR4GNVLYPMYVC23Z4ITBOMNJT3CA2WA/src/Util/SystemInfo.cs(1007,34): warning CS0618: `System.Configuration.ConfigurationSettings.AppSettings' is obsolete: `This property is obsolete. Please use System.Configuration.ConfigurationManager.AppSettings'
[csc] Compilation succeeded - 6 warning(s)
BUILD SUCCEEDED - 0 non-fatal error(s), 12 warning(s)
Total time: 3.2 seconds.
[Pipeline] stash
Stashed 6 file(s)
[Pipeline] sh
[log4net_feature_cd-pipeline-76KUCPODUF6LCE45226EBUR4GNVLYPMYVC23Z4ITBOMNJT3CA2WA] Running shell script
+ nant -t:mono-4.0 -buildfile:tests/nant.build runtests-mono-4.0
NAnt 0.92 (Build 0.92.4526.0; rc1; 05/23/2012)
Copyright (C) 2001-2012 Gerry Shaw
http://nant.sourceforge.net
Buildfile: file:///home/jenkins/jenkins-slave/workspace/log4net_feature_cd-pipeline-76KUCPODUF6LCE45226EBUR4GNVLYPMYVC23Z4ITBOMNJT3CA2WA/tests/nant.build
Target framework: Mono 4.0 Profile
Target(s) specified: runtests-mono-4.0
check-current-build-config:
set-build-configuration:
set-debug-build-configuration:
check-current-build-config:
set-build-configuration-flags:
check-bin-dir:
[mkdir] Creating directory '/home/jenkins/jenkins-slave/workspace/log4net_feature_cd-pipeline-76KUCPODUF6LCE45226EBUR4GNVLYPMYVC23Z4ITBOMNJT3CA2WA/tests/bin'.
check-doc-dir:
[mkdir] Creating directory '/home/jenkins/jenkins-slave/workspace/log4net_feature_cd-pipeline-76KUCPODUF6LCE45226EBUR4GNVLYPMYVC23Z4ITBOMNJT3CA2WA/tests/doc'.
check-sdkdoc-dir:
check-sdkdoc-debug:
check-build-debug:
check-build-defines:
set-mono-4.0-runtime-configuration:
check-log4net-basedir:
check-current-bin-dir:
[mkdir] Creating directory '/home/jenkins/jenkins-slave/workspace/log4net_feature_cd-pipeline-76KUCPODUF6LCE45226EBUR4GNVLYPMYVC23Z4ITBOMNJT3CA2WA/tests/bin/mono/4.0/debug'.
clean-current-bin-dir:
[echo] Cleaning the bin/mono/4.0/debug binaries directory.
[delete] Deleting directory '/home/jenkins/jenkins-slave/workspace/log4net_feature_cd-pipeline-76KUCPODUF6LCE45226EBUR4GNVLYPMYVC23Z4ITBOMNJT3CA2WA/tests/bin/mono/4.0/debug'.
[mkdir] Creating directory '/home/jenkins/jenkins-slave/workspace/log4net_feature_cd-pipeline-76KUCPODUF6LCE45226EBUR4GNVLYPMYVC23Z4ITBOMNJT3CA2WA/tests/bin/mono/4.0/debug'.
check-log4net-output-dir:
check-log4net-assembly:
[echo] Testing if file exists: ..//bin/mono/4.0/debug/log4net.dll
install-nunit:
[get] Retrieving 'https://github.com/nunit/nunitv2/releases/download/2.6.4/NUnit-2.6.4.zip' to '/home/jenkins/jenkins-slave/workspace/log4net_feature_cd-pipeline-76KUCPODUF6LCE45226EBUR4GNVLYPMYVC23Z4ITBOMNJT3CA2WA/tests/.tmp-nunit.zip'.
[unzip] Unzipping '/home/jenkins/jenkins-slave/workspace/log4net_feature_cd-pipeline-76KUCPODUF6LCE45226EBUR4GNVLYPMYVC23Z4ITBOMNJT3CA2WA/tests/.tmp-nunit.zip' to '/home/jenkins/jenkins-slave/workspace/log4net_feature_cd-pipeline-76KUCPODUF6LCE45226EBUR4GNVLYPMYVC23Z4ITBOMNJT3CA2WA/tests/.tmp-nunit'.
[copy] Copying 1 file to '/home/jenkins/jenkins-slave/workspace/log4net_feature_cd-pipeline-76KUCPODUF6LCE45226EBUR4GNVLYPMYVC23Z4ITBOMNJT3CA2WA/tests/lib/mono/4.0/debug'.
[delete] Deleting file /home/jenkins/jenkins-slave/workspace/log4net_feature_cd-pipeline-76KUCPODUF6LCE45226EBUR4GNVLYPMYVC23Z4ITBOMNJT3CA2WA/tests/.tmp-nunit.zip.
[delete] Deleting directory '/home/jenkins/jenkins-slave/workspace/log4net_feature_cd-pipeline-76KUCPODUF6LCE45226EBUR4GNVLYPMYVC23Z4ITBOMNJT3CA2WA/tests/.tmp-nunit'.
compile-mono-4.0:
[copy] Copying 3 files to '/home/jenkins/jenkins-slave/workspace/log4net_feature_cd-pipeline-76KUCPODUF6LCE45226EBUR4GNVLYPMYVC23Z4ITBOMNJT3CA2WA/tests/bin/mono/4.0/debug'.
[copy] Copying 1 file to '/home/jenkins/jenkins-slave/workspace/log4net_feature_cd-pipeline-76KUCPODUF6LCE45226EBUR4GNVLYPMYVC23Z4ITBOMNJT3CA2WA/tests/bin/mono/4.0/debug'.
[csc] Compiling 46 files to '/home/jenkins/jenkins-slave/workspace/log4net_feature_cd-pipeline-76KUCPODUF6LCE45226EBUR4GNVLYPMYVC23Z4ITBOMNJT3CA2WA/tests/bin/mono/4.0/debug/log4net.Tests.dll'.
runtests-mono-4.0:
[nunit2] log4net:WARN Exception while rendering format [IGNORE THIS WARNING - EXCEPTION EXPECTED Before {0} After {1} {2}]
[nunit2] System.FormatException: Index (zero based) must be greater than or equal to zero and less than the size of the argument list.
[nunit2] at System.Text.StringBuilder.AppendFormat (IFormatProvider provider, System.String format, System.Object[] args) <0x40c20c20 + 0x009cb> in <filename unknown>:0
[nunit2] at System.String.Format (IFormatProvider provider, System.String format, System.Object[] args) <0x40c20a60 + 0x00093> in <filename unknown>:0
[nunit2] at log4net.Util.SystemStringFormat.StringFormat (IFormatProvider provider, System.String format, System.Object[] args) <0x40d37050 + 0x00068> in <filename unknown>:0
[nunit2] log4net:ERROR Hello
[nunit2] log4net:ERROR World
[nunit2] log4net:ERROR This will be recorded.
[nunit2] log4net:ERROR This will be recorded.
[nunit2]
[nunit2] /home/jenkins/jenkins-slave/workspace/log4net_feature_cd-pipeline-76KUCPODUF6LCE45226EBUR4GNVLYPMYVC23Z4ITBOMNJT3CA2WA/tests/nant.build(828,10):
[nunit2] Tests Failed.
BUILD SUCCEEDED - 1 non-fatal error(s), 0 warning(s)
Total time: 20.4 seconds.
[Pipeline] stash
Stashed 1 file(s)
[Pipeline] }
$ docker stop --time=1 595fd557b6f4b34b494059eb55967d6b07b0b4a0dabe8e5a87962b8734b3f547
$ docker rm -f 595fd557b6f4b34b494059eb55967d6b07b0b4a0dabe8e5a87962b8734b3f547
[Pipeline] // withDockerContainer
[Pipeline] }
[Pipeline] // stage
[Pipeline] stage
[Pipeline] { (build netstandard)
[Pipeline] getContext
[Pipeline] readFile
[Pipeline] sh
[log4net_feature_cd-pipeline-76KUCPODUF6LCE45226EBUR4GNVLYPMYVC23Z4ITBOMNJT3CA2WA] Running shell script
+ docker build -t 5de43a870f0889e2a0b7876654784fc548ab6cff -f buildtools/docker/builder-netstandard/Dockerfile buildtools/docker/builder-netstandard
Sending build context to Docker daemon 4.096 kB
Step 1/4 : FROM microsoft/dotnet
---> ab1dcd1a2496
Step 2/4 : MAINTAINER "dev@logging.apache.org"
---> Using cache
---> 1a392e603f49
Step 3/4 : RUN apt-get update && apt-get install -y nant git
---> Using cache
---> 67e2a492c30d
Step 4/4 : RUN bash -c entrypoint.sh
---> Running in f54b6659c2e2
[91mbash: entrypoint.sh: command not found
[0mThe command '/bin/sh -c bash -c entrypoint.sh' returned a non-zero code: 127
[Pipeline] }
[Pipeline] // stage
[Pipeline] stage
[Pipeline] { (build site)
Stage 'build site' skipped due to earlier failure(s)
[Pipeline] }
[Pipeline] // stage
[Pipeline] stage
[Pipeline] { (prepare package)
Stage 'prepare package' skipped due to earlier failure(s)
[Pipeline] }
[Pipeline] // stage
[Pipeline] stage
[Pipeline] { (check test results)
Stage 'check test results' skipped due to earlier failure(s)
[Pipeline] }
[Pipeline] // stage
[Pipeline] stage
[Pipeline] { (publish site)
Stage 'publish site' skipped due to earlier failure(s)
[Pipeline] }
[Pipeline] // stage
[Pipeline] stage
[Pipeline] { (Declarative: Post Actions)
[Pipeline] step
Build failed in Jenkins: logging-log4net » feature/cd-pipeline #93
Posted by Apache Jenkins Server <je...@builds.apache.org>.
See <https://builds.apache.org/job/logging-log4net/job/feature%252Fcd-pipeline/93/display/redirect>
------------------------------------------
[...truncated 119.96 KB...]
clean-current-bin-dir:
[echo] Cleaning the bin/mono/4.0/debug binaries directory.
[delete] Deleting directory '/home/jenkins/jenkins-slave/workspace/log4net_feature_cd-pipeline-76KUCPODUF6LCE45226EBUR4GNVLYPMYVC23Z4ITBOMNJT3CA2WA/bin/mono/4.0/debug'.
[mkdir] Creating directory '/home/jenkins/jenkins-slave/workspace/log4net_feature_cd-pipeline-76KUCPODUF6LCE45226EBUR4GNVLYPMYVC23Z4ITBOMNJT3CA2WA/bin/mono/4.0/debug'.
[csc] Compiling 226 files to '/home/jenkins/jenkins-slave/workspace/log4net_feature_cd-pipeline-76KUCPODUF6LCE45226EBUR4GNVLYPMYVC23Z4ITBOMNJT3CA2WA/bin/mono/4.0/debug/log4net.dll'.
[csc] /home/jenkins/jenkins-slave/workspace/log4net_feature_cd-pipeline-76KUCPODUF6LCE45226EBUR4GNVLYPMYVC23Z4ITBOMNJT3CA2WA/src/Appender/EventLogAppender.cs(360,13): warning CS0618: `System.Diagnostics.EventLog.CreateEventSource(string, string, string)' is obsolete: `use CreateEventSource(EventSourceCreationData) instead'
[csc] /home/jenkins/jenkins-slave/workspace/log4net_feature_cd-pipeline-76KUCPODUF6LCE45226EBUR4GNVLYPMYVC23Z4ITBOMNJT3CA2WA/src/Config/XmlConfigurator.cs(134,64): warning CS0618: `System.Configuration.ConfigurationSettings.GetConfig(string)' is obsolete: `This method is obsolete, it has been replaced by System.Configuration!System.Configuration.ConfigurationManager.GetSection'
[csc] /home/jenkins/jenkins-slave/workspace/log4net_feature_cd-pipeline-76KUCPODUF6LCE45226EBUR4GNVLYPMYVC23Z4ITBOMNJT3CA2WA/src/Config/XmlConfigurator.cs(748,6): warning CS0618: `System.Xml.XmlValidatingReader' is obsolete: `Use XmlReader created by XmlReader.Create() method using appropriate XmlReaderSettings instead.'
[csc] /home/jenkins/jenkins-slave/workspace/log4net_feature_cd-pipeline-76KUCPODUF6LCE45226EBUR4GNVLYPMYVC23Z4ITBOMNJT3CA2WA/src/Config/XmlConfigurator.cs(748,42): warning CS0618: `System.Xml.XmlValidatingReader' is obsolete: `Use XmlReader created by XmlReader.Create() method using appropriate XmlReaderSettings instead.'
[csc] /home/jenkins/jenkins-slave/workspace/log4net_feature_cd-pipeline-76KUCPODUF6LCE45226EBUR4GNVLYPMYVC23Z4ITBOMNJT3CA2WA/src/Util/TypeConverters/IPAddressConverter.cs(122,29): warning CS0618: `System.Net.Dns.GetHostByName(string)' is obsolete: `Use GetHostEntry instead'
[csc] /home/jenkins/jenkins-slave/workspace/log4net_feature_cd-pipeline-76KUCPODUF6LCE45226EBUR4GNVLYPMYVC23Z4ITBOMNJT3CA2WA/src/Util/SystemInfo.cs(1007,34): warning CS0618: `System.Configuration.ConfigurationSettings.AppSettings' is obsolete: `This property is obsolete. Please use System.Configuration.ConfigurationManager.AppSettings'
[csc] Compilation succeeded - 6 warning(s)
set-release-build-configuration:
check-current-build-config:
set-build-configuration-flags:
compile-mono-4.0-current-configuration:
check-bin-dir:
check-doc-dir:
check-sdkdoc-dir:
check-sdkdoc-debug:
check-current-build-config:
check-build-debug:
check-build-defines:
set-mono-4.0-runtime-configuration:
check-log4net-basedir:
check-current-bin-dir:
[mkdir] Creating directory '/home/jenkins/jenkins-slave/workspace/log4net_feature_cd-pipeline-76KUCPODUF6LCE45226EBUR4GNVLYPMYVC23Z4ITBOMNJT3CA2WA/bin/mono/4.0/release'.
clean-current-bin-dir:
[echo] Cleaning the bin/mono/4.0/release binaries directory.
[delete] Deleting directory '/home/jenkins/jenkins-slave/workspace/log4net_feature_cd-pipeline-76KUCPODUF6LCE45226EBUR4GNVLYPMYVC23Z4ITBOMNJT3CA2WA/bin/mono/4.0/release'.
[mkdir] Creating directory '/home/jenkins/jenkins-slave/workspace/log4net_feature_cd-pipeline-76KUCPODUF6LCE45226EBUR4GNVLYPMYVC23Z4ITBOMNJT3CA2WA/bin/mono/4.0/release'.
[echo] Old key file not found.
[echo] The release build using the old key will be skipped.
[csc] Compiling 226 files to '/home/jenkins/jenkins-slave/workspace/log4net_feature_cd-pipeline-76KUCPODUF6LCE45226EBUR4GNVLYPMYVC23Z4ITBOMNJT3CA2WA/bin/mono/4.0/release/log4net.dll'.
[csc] /home/jenkins/jenkins-slave/workspace/log4net_feature_cd-pipeline-76KUCPODUF6LCE45226EBUR4GNVLYPMYVC23Z4ITBOMNJT3CA2WA/src/Appender/EventLogAppender.cs(360,13): warning CS0618: `System.Diagnostics.EventLog.CreateEventSource(string, string, string)' is obsolete: `use CreateEventSource(EventSourceCreationData) instead'
[csc] /home/jenkins/jenkins-slave/workspace/log4net_feature_cd-pipeline-76KUCPODUF6LCE45226EBUR4GNVLYPMYVC23Z4ITBOMNJT3CA2WA/src/Config/XmlConfigurator.cs(134,64): warning CS0618: `System.Configuration.ConfigurationSettings.GetConfig(string)' is obsolete: `This method is obsolete, it has been replaced by System.Configuration!System.Configuration.ConfigurationManager.GetSection'
[csc] /home/jenkins/jenkins-slave/workspace/log4net_feature_cd-pipeline-76KUCPODUF6LCE45226EBUR4GNVLYPMYVC23Z4ITBOMNJT3CA2WA/src/Config/XmlConfigurator.cs(748,6): warning CS0618: `System.Xml.XmlValidatingReader' is obsolete: `Use XmlReader created by XmlReader.Create() method using appropriate XmlReaderSettings instead.'
[csc] /home/jenkins/jenkins-slave/workspace/log4net_feature_cd-pipeline-76KUCPODUF6LCE45226EBUR4GNVLYPMYVC23Z4ITBOMNJT3CA2WA/src/Config/XmlConfigurator.cs(748,42): warning CS0618: `System.Xml.XmlValidatingReader' is obsolete: `Use XmlReader created by XmlReader.Create() method using appropriate XmlReaderSettings instead.'
[csc] /home/jenkins/jenkins-slave/workspace/log4net_feature_cd-pipeline-76KUCPODUF6LCE45226EBUR4GNVLYPMYVC23Z4ITBOMNJT3CA2WA/src/Util/TypeConverters/IPAddressConverter.cs(122,29): warning CS0618: `System.Net.Dns.GetHostByName(string)' is obsolete: `Use GetHostEntry instead'
[csc] /home/jenkins/jenkins-slave/workspace/log4net_feature_cd-pipeline-76KUCPODUF6LCE45226EBUR4GNVLYPMYVC23Z4ITBOMNJT3CA2WA/src/Util/SystemInfo.cs(1007,34): warning CS0618: `System.Configuration.ConfigurationSettings.AppSettings' is obsolete: `This property is obsolete. Please use System.Configuration.ConfigurationManager.AppSettings'
[csc] Compilation succeeded - 6 warning(s)
BUILD SUCCEEDED - 0 non-fatal error(s), 12 warning(s)
Total time: 3.1 seconds.
[Pipeline] stash
Stashed 6 file(s)
[Pipeline] sh
[log4net_feature_cd-pipeline-76KUCPODUF6LCE45226EBUR4GNVLYPMYVC23Z4ITBOMNJT3CA2WA] Running shell script
+ nant -t:mono-4.0 -buildfile:tests/nant.build runtests-mono-4.0
NAnt 0.92 (Build 0.92.4526.0; rc1; 05/23/2012)
Copyright (C) 2001-2012 Gerry Shaw
http://nant.sourceforge.net
Buildfile: file:///home/jenkins/jenkins-slave/workspace/log4net_feature_cd-pipeline-76KUCPODUF6LCE45226EBUR4GNVLYPMYVC23Z4ITBOMNJT3CA2WA/tests/nant.build
Target framework: Mono 4.0 Profile
Target(s) specified: runtests-mono-4.0
check-current-build-config:
set-build-configuration:
set-debug-build-configuration:
check-current-build-config:
set-build-configuration-flags:
check-bin-dir:
[mkdir] Creating directory '/home/jenkins/jenkins-slave/workspace/log4net_feature_cd-pipeline-76KUCPODUF6LCE45226EBUR4GNVLYPMYVC23Z4ITBOMNJT3CA2WA/tests/bin'.
check-doc-dir:
[mkdir] Creating directory '/home/jenkins/jenkins-slave/workspace/log4net_feature_cd-pipeline-76KUCPODUF6LCE45226EBUR4GNVLYPMYVC23Z4ITBOMNJT3CA2WA/tests/doc'.
check-sdkdoc-dir:
check-sdkdoc-debug:
check-build-debug:
check-build-defines:
set-mono-4.0-runtime-configuration:
check-log4net-basedir:
check-current-bin-dir:
[mkdir] Creating directory '/home/jenkins/jenkins-slave/workspace/log4net_feature_cd-pipeline-76KUCPODUF6LCE45226EBUR4GNVLYPMYVC23Z4ITBOMNJT3CA2WA/tests/bin/mono/4.0/debug'.
clean-current-bin-dir:
[echo] Cleaning the bin/mono/4.0/debug binaries directory.
[delete] Deleting directory '/home/jenkins/jenkins-slave/workspace/log4net_feature_cd-pipeline-76KUCPODUF6LCE45226EBUR4GNVLYPMYVC23Z4ITBOMNJT3CA2WA/tests/bin/mono/4.0/debug'.
[mkdir] Creating directory '/home/jenkins/jenkins-slave/workspace/log4net_feature_cd-pipeline-76KUCPODUF6LCE45226EBUR4GNVLYPMYVC23Z4ITBOMNJT3CA2WA/tests/bin/mono/4.0/debug'.
check-log4net-output-dir:
check-log4net-assembly:
[echo] Testing if file exists: ..//bin/mono/4.0/debug/log4net.dll
install-nunit:
[get] Retrieving 'https://github.com/nunit/nunitv2/releases/download/2.6.4/NUnit-2.6.4.zip' to '/home/jenkins/jenkins-slave/workspace/log4net_feature_cd-pipeline-76KUCPODUF6LCE45226EBUR4GNVLYPMYVC23Z4ITBOMNJT3CA2WA/tests/.tmp-nunit.zip'.
[unzip] Unzipping '/home/jenkins/jenkins-slave/workspace/log4net_feature_cd-pipeline-76KUCPODUF6LCE45226EBUR4GNVLYPMYVC23Z4ITBOMNJT3CA2WA/tests/.tmp-nunit.zip' to '/home/jenkins/jenkins-slave/workspace/log4net_feature_cd-pipeline-76KUCPODUF6LCE45226EBUR4GNVLYPMYVC23Z4ITBOMNJT3CA2WA/tests/.tmp-nunit'.
[copy] Copying 1 file to '/home/jenkins/jenkins-slave/workspace/log4net_feature_cd-pipeline-76KUCPODUF6LCE45226EBUR4GNVLYPMYVC23Z4ITBOMNJT3CA2WA/tests/lib/mono/4.0/debug'.
[delete] Deleting file /home/jenkins/jenkins-slave/workspace/log4net_feature_cd-pipeline-76KUCPODUF6LCE45226EBUR4GNVLYPMYVC23Z4ITBOMNJT3CA2WA/tests/.tmp-nunit.zip.
[delete] Deleting directory '/home/jenkins/jenkins-slave/workspace/log4net_feature_cd-pipeline-76KUCPODUF6LCE45226EBUR4GNVLYPMYVC23Z4ITBOMNJT3CA2WA/tests/.tmp-nunit'.
compile-mono-4.0:
[copy] Copying 3 files to '/home/jenkins/jenkins-slave/workspace/log4net_feature_cd-pipeline-76KUCPODUF6LCE45226EBUR4GNVLYPMYVC23Z4ITBOMNJT3CA2WA/tests/bin/mono/4.0/debug'.
[copy] Copying 1 file to '/home/jenkins/jenkins-slave/workspace/log4net_feature_cd-pipeline-76KUCPODUF6LCE45226EBUR4GNVLYPMYVC23Z4ITBOMNJT3CA2WA/tests/bin/mono/4.0/debug'.
[csc] Compiling 46 files to '/home/jenkins/jenkins-slave/workspace/log4net_feature_cd-pipeline-76KUCPODUF6LCE45226EBUR4GNVLYPMYVC23Z4ITBOMNJT3CA2WA/tests/bin/mono/4.0/debug/log4net.Tests.dll'.
runtests-mono-4.0:
[nunit2] log4net:WARN Exception while rendering format [IGNORE THIS WARNING - EXCEPTION EXPECTED Before {0} After {1} {2}]
[nunit2] System.FormatException: Index (zero based) must be greater than or equal to zero and less than the size of the argument list.
[nunit2] at System.Text.StringBuilder.AppendFormat (IFormatProvider provider, System.String format, System.Object[] args) <0x41513c20 + 0x009cb> in <filename unknown>:0
[nunit2] at System.String.Format (IFormatProvider provider, System.String format, System.Object[] args) <0x41513a60 + 0x00093> in <filename unknown>:0
[nunit2] at log4net.Util.SystemStringFormat.StringFormat (IFormatProvider provider, System.String format, System.Object[] args) <0x4162a050 + 0x00068> in <filename unknown>:0
[nunit2] log4net:ERROR Hello
[nunit2] log4net:ERROR World
[nunit2] log4net:ERROR This will be recorded.
[nunit2] log4net:ERROR This will be recorded.
[nunit2]
[nunit2] /home/jenkins/jenkins-slave/workspace/log4net_feature_cd-pipeline-76KUCPODUF6LCE45226EBUR4GNVLYPMYVC23Z4ITBOMNJT3CA2WA/tests/nant.build(828,10):
[nunit2] Tests Failed.
BUILD SUCCEEDED - 1 non-fatal error(s), 0 warning(s)
Total time: 20.4 seconds.
[Pipeline] stash
Stashed 1 file(s)
[Pipeline] }
$ docker stop --time=1 b97f0143e7a48978a17978249ac1004292b992bd1fd3ea27e84072049984c72d
$ docker rm -f b97f0143e7a48978a17978249ac1004292b992bd1fd3ea27e84072049984c72d
[Pipeline] // withDockerContainer
[Pipeline] }
[Pipeline] // stage
[Pipeline] stage
[Pipeline] { (build netstandard)
[Pipeline] getContext
[Pipeline] readFile
[Pipeline] sh
[log4net_feature_cd-pipeline-76KUCPODUF6LCE45226EBUR4GNVLYPMYVC23Z4ITBOMNJT3CA2WA] Running shell script
+ docker build -t 20691160f14b5da07432573e8291f3d223364e34 -f buildtools/docker/builder-netstandard/Dockerfile buildtools/docker/builder-netstandard
Sending build context to Docker daemon 4.096 kB
Step 1/5 : FROM microsoft/dotnet
---> ab1dcd1a2496
Step 2/5 : MAINTAINER "dev@logging.apache.org"
---> Using cache
---> 1a392e603f49
Step 3/5 : RUN apt-get update && apt-get install -y nant git
---> Using cache
---> 67e2a492c30d
Step 4/5 : COPY entrypoint.sh /usr/local/bin/entrypoint.sh
---> bb290b599e64
Removing intermediate container e264474c6479
Step 5/5 : ENTRYPOINT /usr/local/bin/entrypoint.sh
---> Running in c934952cfe4c
---> 6a24c8a2c340
Removing intermediate container c934952cfe4c
Successfully built 6a24c8a2c340
[Pipeline] dockerFingerprintFrom
[Pipeline] sh
[log4net_feature_cd-pipeline-76KUCPODUF6LCE45226EBUR4GNVLYPMYVC23Z4ITBOMNJT3CA2WA] Running shell script
+ docker inspect -f . 20691160f14b5da07432573e8291f3d223364e34
.
[Pipeline] withDockerContainer
H22 does not seem to be running inside a container
$ docker run -t -d -u 10025:12040 -a USER=jenkins -w /home/jenkins/jenkins-slave/workspace/log4net_feature_cd-pipeline-76KUCPODUF6LCE45226EBUR4GNVLYPMYVC23Z4ITBOMNJT3CA2WA -v /home/jenkins/jenkins-slave/workspace/log4net_feature_cd-pipeline-76KUCPODUF6LCE45226EBUR4GNVLYPMYVC23Z4ITBOMNJT3CA2WA:/home/jenkins/jenkins-slave/workspace/log4net_feature_cd-pipeline-76KUCPODUF6LCE45226EBUR4GNVLYPMYVC23Z4ITBOMNJT3CA2WA:rw -v /home/jenkins/jenkins-slave/workspace/log4net_feature_cd-pipeline-76KUCPODUF6LCE45226EBUR4GNVLYPMYVC23Z4ITBOMNJT3CA2WA@tmp:/home/jenkins/jenkins-slave/workspace/log4net_feature_cd-pipeline-76KUCPODUF6LCE45226EBUR4GNVLYPMYVC23Z4ITBOMNJT3CA2WA@tmp:rw -e ******** -e ******** -e ******** -e ******** -e ******** -e ******** -e ******** -e ******** -e ******** -e ******** -e ******** -e ******** -e ******** -e ******** -e ******** -e ******** -e ******** -e ******** -e ******** -e ******** -e ******** -e ******** -e ******** --entrypoint cat 20691160f14b5da07432573e8291f3d223364e34
[Pipeline] // withDockerContainer
[Pipeline] }
[Pipeline] // stage
[Pipeline] stage
[Pipeline] { (build site)
Stage 'build site' skipped due to earlier failure(s)
[Pipeline] }
[Pipeline] // stage
[Pipeline] stage
[Pipeline] { (prepare package)
Stage 'prepare package' skipped due to earlier failure(s)
[Pipeline] }
[Pipeline] // stage
[Pipeline] stage
[Pipeline] { (check test results)
Stage 'check test results' skipped due to earlier failure(s)
[Pipeline] }
[Pipeline] // stage
[Pipeline] stage
[Pipeline] { (publish site)
Stage 'publish site' skipped due to earlier failure(s)
[Pipeline] }
[Pipeline] // stage
[Pipeline] stage
[Pipeline] { (Declarative: Post Actions)
[Pipeline] step
Build failed in Jenkins: logging-log4net » feature/cd-pipeline #92
Posted by Apache Jenkins Server <je...@builds.apache.org>.
See <https://builds.apache.org/job/logging-log4net/job/feature%252Fcd-pipeline/92/display/redirect>
------------------------------------------
[...truncated 122.77 KB...]
check-current-build-config:
set-build-configuration-flags:
compile-mono-4.0-current-configuration:
check-bin-dir:
check-doc-dir:
check-sdkdoc-dir:
check-sdkdoc-debug:
check-current-build-config:
check-build-debug:
check-build-defines:
set-mono-4.0-runtime-configuration:
check-log4net-basedir:
check-current-bin-dir:
[mkdir] Creating directory '/home/jenkins/jenkins-slave/workspace/log4net_feature_cd-pipeline-76KUCPODUF6LCE45226EBUR4GNVLYPMYVC23Z4ITBOMNJT3CA2WA/bin/mono/4.0/release'.
clean-current-bin-dir:
[echo] Cleaning the bin/mono/4.0/release binaries directory.
[delete] Deleting directory '/home/jenkins/jenkins-slave/workspace/log4net_feature_cd-pipeline-76KUCPODUF6LCE45226EBUR4GNVLYPMYVC23Z4ITBOMNJT3CA2WA/bin/mono/4.0/release'.
[mkdir] Creating directory '/home/jenkins/jenkins-slave/workspace/log4net_feature_cd-pipeline-76KUCPODUF6LCE45226EBUR4GNVLYPMYVC23Z4ITBOMNJT3CA2WA/bin/mono/4.0/release'.
[echo] Old key file not found.
[echo] The release build using the old key will be skipped.
[csc] Compiling 226 files to '/home/jenkins/jenkins-slave/workspace/log4net_feature_cd-pipeline-76KUCPODUF6LCE45226EBUR4GNVLYPMYVC23Z4ITBOMNJT3CA2WA/bin/mono/4.0/release/log4net.dll'.
[csc] /home/jenkins/jenkins-slave/workspace/log4net_feature_cd-pipeline-76KUCPODUF6LCE45226EBUR4GNVLYPMYVC23Z4ITBOMNJT3CA2WA/src/Appender/EventLogAppender.cs(360,13): warning CS0618: `System.Diagnostics.EventLog.CreateEventSource(string, string, string)' is obsolete: `use CreateEventSource(EventSourceCreationData) instead'
[csc] /home/jenkins/jenkins-slave/workspace/log4net_feature_cd-pipeline-76KUCPODUF6LCE45226EBUR4GNVLYPMYVC23Z4ITBOMNJT3CA2WA/src/Config/XmlConfigurator.cs(134,64): warning CS0618: `System.Configuration.ConfigurationSettings.GetConfig(string)' is obsolete: `This method is obsolete, it has been replaced by System.Configuration!System.Configuration.ConfigurationManager.GetSection'
[csc] /home/jenkins/jenkins-slave/workspace/log4net_feature_cd-pipeline-76KUCPODUF6LCE45226EBUR4GNVLYPMYVC23Z4ITBOMNJT3CA2WA/src/Config/XmlConfigurator.cs(748,6): warning CS0618: `System.Xml.XmlValidatingReader' is obsolete: `Use XmlReader created by XmlReader.Create() method using appropriate XmlReaderSettings instead.'
[csc] /home/jenkins/jenkins-slave/workspace/log4net_feature_cd-pipeline-76KUCPODUF6LCE45226EBUR4GNVLYPMYVC23Z4ITBOMNJT3CA2WA/src/Config/XmlConfigurator.cs(748,42): warning CS0618: `System.Xml.XmlValidatingReader' is obsolete: `Use XmlReader created by XmlReader.Create() method using appropriate XmlReaderSettings instead.'
[csc] /home/jenkins/jenkins-slave/workspace/log4net_feature_cd-pipeline-76KUCPODUF6LCE45226EBUR4GNVLYPMYVC23Z4ITBOMNJT3CA2WA/src/Util/TypeConverters/IPAddressConverter.cs(122,29): warning CS0618: `System.Net.Dns.GetHostByName(string)' is obsolete: `Use GetHostEntry instead'
[csc] /home/jenkins/jenkins-slave/workspace/log4net_feature_cd-pipeline-76KUCPODUF6LCE45226EBUR4GNVLYPMYVC23Z4ITBOMNJT3CA2WA/src/Util/SystemInfo.cs(1007,34): warning CS0618: `System.Configuration.ConfigurationSettings.AppSettings' is obsolete: `This property is obsolete. Please use System.Configuration.ConfigurationManager.AppSettings'
[csc] Compilation succeeded - 6 warning(s)
BUILD SUCCEEDED - 0 non-fatal error(s), 12 warning(s)
Total time: 3.2 seconds.
Stashed 6 file(s)
[Pipeline] stash
[Pipeline] sh
[log4net_feature_cd-pipeline-76KUCPODUF6LCE45226EBUR4GNVLYPMYVC23Z4ITBOMNJT3CA2WA] Running shell script
+ nant -t:mono-4.0 -buildfile:tests/nant.build runtests-mono-4.0
NAnt 0.92 (Build 0.92.4526.0; rc1; 05/23/2012)
Copyright (C) 2001-2012 Gerry Shaw
http://nant.sourceforge.net
Buildfile: file:///home/jenkins/jenkins-slave/workspace/log4net_feature_cd-pipeline-76KUCPODUF6LCE45226EBUR4GNVLYPMYVC23Z4ITBOMNJT3CA2WA/tests/nant.build
Target framework: Mono 4.0 Profile
Target(s) specified: runtests-mono-4.0
check-current-build-config:
set-build-configuration:
set-debug-build-configuration:
check-current-build-config:
set-build-configuration-flags:
check-bin-dir:
[mkdir] Creating directory '/home/jenkins/jenkins-slave/workspace/log4net_feature_cd-pipeline-76KUCPODUF6LCE45226EBUR4GNVLYPMYVC23Z4ITBOMNJT3CA2WA/tests/bin'.
check-doc-dir:
[mkdir] Creating directory '/home/jenkins/jenkins-slave/workspace/log4net_feature_cd-pipeline-76KUCPODUF6LCE45226EBUR4GNVLYPMYVC23Z4ITBOMNJT3CA2WA/tests/doc'.
check-sdkdoc-dir:
check-sdkdoc-debug:
check-build-debug:
check-build-defines:
set-mono-4.0-runtime-configuration:
check-log4net-basedir:
check-current-bin-dir:
[mkdir] Creating directory '/home/jenkins/jenkins-slave/workspace/log4net_feature_cd-pipeline-76KUCPODUF6LCE45226EBUR4GNVLYPMYVC23Z4ITBOMNJT3CA2WA/tests/bin/mono/4.0/debug'.
clean-current-bin-dir:
[echo] Cleaning the bin/mono/4.0/debug binaries directory.
[delete] Deleting directory '/home/jenkins/jenkins-slave/workspace/log4net_feature_cd-pipeline-76KUCPODUF6LCE45226EBUR4GNVLYPMYVC23Z4ITBOMNJT3CA2WA/tests/bin/mono/4.0/debug'.
[mkdir] Creating directory '/home/jenkins/jenkins-slave/workspace/log4net_feature_cd-pipeline-76KUCPODUF6LCE45226EBUR4GNVLYPMYVC23Z4ITBOMNJT3CA2WA/tests/bin/mono/4.0/debug'.
check-log4net-output-dir:
check-log4net-assembly:
[echo] Testing if file exists: ..//bin/mono/4.0/debug/log4net.dll
install-nunit:
[get] Retrieving 'https://github.com/nunit/nunitv2/releases/download/2.6.4/NUnit-2.6.4.zip' to '/home/jenkins/jenkins-slave/workspace/log4net_feature_cd-pipeline-76KUCPODUF6LCE45226EBUR4GNVLYPMYVC23Z4ITBOMNJT3CA2WA/tests/.tmp-nunit.zip'.
[unzip] Unzipping '/home/jenkins/jenkins-slave/workspace/log4net_feature_cd-pipeline-76KUCPODUF6LCE45226EBUR4GNVLYPMYVC23Z4ITBOMNJT3CA2WA/tests/.tmp-nunit.zip' to '/home/jenkins/jenkins-slave/workspace/log4net_feature_cd-pipeline-76KUCPODUF6LCE45226EBUR4GNVLYPMYVC23Z4ITBOMNJT3CA2WA/tests/.tmp-nunit'.
[copy] Copying 1 file to '/home/jenkins/jenkins-slave/workspace/log4net_feature_cd-pipeline-76KUCPODUF6LCE45226EBUR4GNVLYPMYVC23Z4ITBOMNJT3CA2WA/tests/lib/mono/4.0/debug'.
[delete] Deleting file /home/jenkins/jenkins-slave/workspace/log4net_feature_cd-pipeline-76KUCPODUF6LCE45226EBUR4GNVLYPMYVC23Z4ITBOMNJT3CA2WA/tests/.tmp-nunit.zip.
[delete] Deleting directory '/home/jenkins/jenkins-slave/workspace/log4net_feature_cd-pipeline-76KUCPODUF6LCE45226EBUR4GNVLYPMYVC23Z4ITBOMNJT3CA2WA/tests/.tmp-nunit'.
compile-mono-4.0:
[copy] Copying 3 files to '/home/jenkins/jenkins-slave/workspace/log4net_feature_cd-pipeline-76KUCPODUF6LCE45226EBUR4GNVLYPMYVC23Z4ITBOMNJT3CA2WA/tests/bin/mono/4.0/debug'.
[copy] Copying 1 file to '/home/jenkins/jenkins-slave/workspace/log4net_feature_cd-pipeline-76KUCPODUF6LCE45226EBUR4GNVLYPMYVC23Z4ITBOMNJT3CA2WA/tests/bin/mono/4.0/debug'.
[csc] Compiling 46 files to '/home/jenkins/jenkins-slave/workspace/log4net_feature_cd-pipeline-76KUCPODUF6LCE45226EBUR4GNVLYPMYVC23Z4ITBOMNJT3CA2WA/tests/bin/mono/4.0/debug/log4net.Tests.dll'.
runtests-mono-4.0:
[nunit2] log4net:WARN Exception while rendering format [IGNORE THIS WARNING - EXCEPTION EXPECTED Before {0} After {1} {2}]
[nunit2] System.FormatException: Index (zero based) must be greater than or equal to zero and less than the size of the argument list.
[nunit2] at System.Text.StringBuilder.AppendFormat (IFormatProvider provider, System.String format, System.Object[] args) <0x403fec20 + 0x009cb> in <filename unknown>:0
[nunit2] at System.String.Format (IFormatProvider provider, System.String format, System.Object[] args) <0x403fea60 + 0x00093> in <filename unknown>:0
[nunit2] at log4net.Util.SystemStringFormat.StringFormat (IFormatProvider provider, System.String format, System.Object[] args) <0x40515050 + 0x00068> in <filename unknown>:0
[nunit2] log4net:ERROR Hello
[nunit2] log4net:ERROR World
[nunit2] log4net:ERROR This will be recorded.
[nunit2] log4net:ERROR This will be recorded.
[nunit2]
[nunit2] /home/jenkins/jenkins-slave/workspace/log4net_feature_cd-pipeline-76KUCPODUF6LCE45226EBUR4GNVLYPMYVC23Z4ITBOMNJT3CA2WA/tests/nant.build(828,10):
[nunit2] Tests Failed.
BUILD SUCCEEDED - 1 non-fatal error(s), 0 warning(s)
Total time: 20.3 seconds.
[Pipeline] stash
Stashed 1 file(s)
[Pipeline] }
$ docker stop --time=1 f5ed1689532693218324afca2f4f3462ccb04a95f067cb0eb40d4d633f8a2760
$ docker rm -f f5ed1689532693218324afca2f4f3462ccb04a95f067cb0eb40d4d633f8a2760
[Pipeline] // withDockerContainer
[Pipeline] }
[Pipeline] // stage
[Pipeline] stage
[Pipeline] { (build netstandard)
[Pipeline] getContext
[Pipeline] readFile
[Pipeline] sh
[log4net_feature_cd-pipeline-76KUCPODUF6LCE45226EBUR4GNVLYPMYVC23Z4ITBOMNJT3CA2WA] Running shell script
+ docker build -t 89f4c62ab6f57a668610ef268a76c2b64c72b7c4 -f buildtools/docker/builder-netstandard/Dockerfile buildtools/docker/builder-netstandard
Sending build context to Docker daemon 4.096 kB
Step 1/7 : FROM microsoft/dotnet
---> ab1dcd1a2496
Step 2/7 : MAINTAINER "dev@logging.apache.org"
---> Using cache
---> 1a392e603f49
Step 3/7 : RUN apt-get update && apt-get install -y nant git
---> Using cache
---> 67e2a492c30d
Step 4/7 : RUN apt-get update && apt-get -y --no-install-recommends install ca-certificates curl
---> Using cache
---> ce017ec1e886
Step 5/7 : RUN curl -o /usr/local/bin/gosu -SL "https://github.com/tianon/gosu/releases/download/1.4/gosu-$(dpkg --print-architecture)" && chmod +x /usr/local/bin/gosu
---> Using cache
---> 9d0846b5aefa
Step 6/7 : COPY entrypoint.sh /usr/local/bin/entrypoint.sh
---> Using cache
---> 76d841be4f40
Step 7/7 : ENTRYPOINT /usr/local/bin/entrypoint.sh
---> Using cache
---> baa9b6e6513a
Successfully built baa9b6e6513a
[Pipeline] dockerFingerprintFrom
[Pipeline] sh
[log4net_feature_cd-pipeline-76KUCPODUF6LCE45226EBUR4GNVLYPMYVC23Z4ITBOMNJT3CA2WA] Running shell script
+ docker inspect -f . 89f4c62ab6f57a668610ef268a76c2b64c72b7c4
.
[Pipeline] withDockerContainer
H22 does not seem to be running inside a container
$ docker run -t -d -u 10025:12040 -w /home/jenkins/jenkins-slave/workspace/log4net_feature_cd-pipeline-76KUCPODUF6LCE45226EBUR4GNVLYPMYVC23Z4ITBOMNJT3CA2WA -v /home/jenkins/jenkins-slave/workspace/log4net_feature_cd-pipeline-76KUCPODUF6LCE45226EBUR4GNVLYPMYVC23Z4ITBOMNJT3CA2WA:/home/jenkins/jenkins-slave/workspace/log4net_feature_cd-pipeline-76KUCPODUF6LCE45226EBUR4GNVLYPMYVC23Z4ITBOMNJT3CA2WA:rw -v /home/jenkins/jenkins-slave/workspace/log4net_feature_cd-pipeline-76KUCPODUF6LCE45226EBUR4GNVLYPMYVC23Z4ITBOMNJT3CA2WA@tmp:/home/jenkins/jenkins-slave/workspace/log4net_feature_cd-pipeline-76KUCPODUF6LCE45226EBUR4GNVLYPMYVC23Z4ITBOMNJT3CA2WA@tmp:rw -e ******** -e ******** -e ******** -e ******** -e ******** -e ******** -e ******** -e ******** -e ******** -e ******** -e ******** -e ******** -e ******** -e ******** -e ******** -e ******** -e ******** -e ******** -e ******** -e ******** -e ******** -e ******** -e ******** --entrypoint cat 89f4c62ab6f57a668610ef268a76c2b64c72b7c4
[Pipeline] {
[Pipeline] sh
[log4net_feature_cd-pipeline-76KUCPODUF6LCE45226EBUR4GNVLYPMYVC23Z4ITBOMNJT3CA2WA] Running shell script
++ pwd
++ id -u
++ id -g
++ id -g
+ useradd --home-dir /home/jenkins/jenkins-slave/workspace/log4net_feature_cd-pipeline-76KUCPODUF6LCE45226EBUR4GNVLYPMYVC23Z4ITBOMNJT3CA2WA --shell /bin/bash --uid 10025 --gid 12040 --groups 12040 -p -M jenkins
useradd: group '12040' does not exist
[Pipeline] }
$ docker stop --time=1 6bb3697e10356c6b7c3ed430f9f64b5cf2d58225874f837caa1232c1864b8878
$ docker rm -f 6bb3697e10356c6b7c3ed430f9f64b5cf2d58225874f837caa1232c1864b8878
[Pipeline] // withDockerContainer
[Pipeline] }
[Pipeline] // stage
[Pipeline] stage
[Pipeline] { (build site)
Stage 'build site' skipped due to earlier failure(s)
[Pipeline] }
[Pipeline] // stage
[Pipeline] stage
[Pipeline] { (prepare package)
Stage 'prepare package' skipped due to earlier failure(s)
[Pipeline] }
[Pipeline] // stage
[Pipeline] stage
[Pipeline] { (check test results)
Stage 'check test results' skipped due to earlier failure(s)
[Pipeline] }
[Pipeline] // stage
[Pipeline] stage
[Pipeline] { (publish site)
Stage 'publish site' skipped due to earlier failure(s)
[Pipeline] }
[Pipeline] // stage
[Pipeline] stage
[Pipeline] { (Declarative: Post Actions)
[Pipeline] step