You are viewing a plain text version of this content. The canonical link for it is here.
Posted to builds@beam.apache.org by Apache Jenkins Server <je...@builds.apache.org> on 2023/04/05 08:35:35 UTC
Build failed in Jenkins: beam_PostCommit_Go #11131
See <https://ci-beam.apache.org/job/beam_PostCommit_Go/11131/display/redirect>
Changes:
------------------------------------------
[...truncated 36.26 KB...]
> Task :sdks:java:expansion-service:processResources NO-SOURCE
> Task :sdks:java:expansion-service:classes UP-TO-DATE
> Task :sdks:java:expansion-service:jar
> Task :sdks:java:extensions:arrow:createCheckerFrameworkManifest
> Task :sdks:java:extensions:arrow:compileJava FROM-CACHE
> Task :sdks:java:extensions:arrow:processResources NO-SOURCE
> Task :sdks:java:extensions:arrow:classes UP-TO-DATE
> Task :sdks:java:extensions:arrow:jar
> Task :sdks:java:extensions:protobuf:createCheckerFrameworkManifest
> Task :sdks:java:extensions:protobuf:extractIncludeProto
> Task :sdks:java:extensions:protobuf:extractProto
> Task :sdks:java:extensions:protobuf:generateProto NO-SOURCE
> Task :sdks:java:extensions:protobuf:compileJava FROM-CACHE
> Task :sdks:java:extensions:protobuf:processResources NO-SOURCE
> Task :sdks:java:extensions:protobuf:classes UP-TO-DATE
> Task :sdks:java:extensions:protobuf:jar
> Task :sdks:java:io:google-cloud-platform:createCheckerFrameworkManifest
> Task :sdks:java:io:google-cloud-platform:compileJava FROM-CACHE
> Task :sdks:java:io:google-cloud-platform:processResources NO-SOURCE
> Task :sdks:java:io:google-cloud-platform:classes UP-TO-DATE
> Task :sdks:java:io:google-cloud-platform:jar
> Task :sdks:java:io:kafka:createCheckerFrameworkManifest
> Task :sdks:java:io:kafka:compileJava FROM-CACHE
> Task :sdks:java:io:kafka:processResources NO-SOURCE
> Task :sdks:java:io:kafka:classes UP-TO-DATE
> Task :sdks:java:io:kafka:jar
> Task :runners:google-cloud-dataflow-java:compileJava FROM-CACHE
> Task :runners:google-cloud-dataflow-java:processResources
> Task :runners:google-cloud-dataflow-java:classes
> Task :runners:google-cloud-dataflow-java:jar
> Task :runners:google-cloud-dataflow-java:worker:createCheckerFrameworkManifest
> Task :runners:google-cloud-dataflow-java:worker:windmill:createCheckerFrameworkManifest
> Task :runners:google-cloud-dataflow-java:worker:windmill:extractIncludeProto
> Task :runners:google-cloud-dataflow-java:worker:windmill:extractProto
> Task :runners:google-cloud-dataflow-java:worker:windmill:generateProto FROM-CACHE
> Task :runners:google-cloud-dataflow-java:worker:windmill:compileJava FROM-CACHE
> Task :runners:google-cloud-dataflow-java:worker:windmill:processResources
> Task :runners:google-cloud-dataflow-java:worker:windmill:classes
> Task :runners:google-cloud-dataflow-java:worker:windmill:shadowJar FROM-CACHE
> Task :runners:google-cloud-dataflow-java:worker:processResources
> Task :runners:google-cloud-dataflow-java:worker:compileJava FROM-CACHE
> Task :runners:google-cloud-dataflow-java:worker:classes
> Task :runners:google-cloud-dataflow-java:worker:shadowJar FROM-CACHE
> Task :sdks:go:test:assemble UP-TO-DATE
> Task :sdks:go:test:test UP-TO-DATE
> Task :sdks:go:test:check UP-TO-DATE
> Task :sdks:go:test:build UP-TO-DATE
> Task :goIntegrationTests
$ CURRENT_DIRECTORY=<https://ci-beam.apache.org/job/beam_PostCommit_Go/ws/src/sdks/go/test>
$ TESTS=./test/integration/... ./test/regression
$ RUNNER=portable
$ TIMEOUT=3h
$ SIMULTANEOUS=3
$ GCS_LOCATION=gs://temp-storage-for-end-to-end-tests
$ GCS_SUBFOLDER=test31420
$ PROJECT=apache-beam-testing
$ DATAFLOW_PROJECT=apache-beam-testing
$ REGION=us-central1
$ trap exit_background_processes SIGINT SIGTERM EXIT
$ key=--runner
$ case --runner in
$ RUNNER=dataflow
$ cd <https://ci-beam.apache.org/job/beam_PostCommit_Go/ws/src>
$ test -d sdks/go/test
$ command -v docker
/usr/bin/docker
$ docker -v
Docker version 20.10.23, build 7155243
$ command -v gcloud
/usr/bin/gcloud
$ gcloud --version
Google Cloud SDK 406.0.0
alpha 2022.10.17
beta 2022.10.17
bq 2.0.79
bundled-python3-unix 3.9.12
core 2022.10.17
gcloud-crc32c 1.0.0
gsutil 5.14
$ TMPDIR=/tmp/tmp.BNW5Iu1AKI
$ gcloud_ver=406.0.0
$ TAG=20230405-083456
$ CONTAINER=us.gcr.io/apache-beam-testing/jenkins/beam_go_sdk
Using container us.gcr.io/apache-beam-testing/jenkins/beam_go_sdk
$ ./gradlew :sdks:go:container:docker -Pdocker-repository-root=us.gcr.io/apache-beam-testing/jenkins -Pdocker-tag=20230405-083456
To honour the JVM settings for this build a single-use Daemon process will be forked. See https://docs.gradle.org/7.5.1/userguide/gradle_daemon.html#sec:disabling_the_daemon.
Daemon will be stopped at the end of the build
Configuration on demand is an incubating feature.
> Task :buildSrc:compileJava NO-SOURCE
> Task :buildSrc:compileGroovy UP-TO-DATE
> Task :buildSrc:pluginDescriptors UP-TO-DATE
> Task :buildSrc:processResources UP-TO-DATE
> Task :buildSrc:classes UP-TO-DATE
> Task :buildSrc:jar UP-TO-DATE
> Task :buildSrc:assemble UP-TO-DATE
> Task :buildSrc:spotlessGroovy UP-TO-DATE
> Task :buildSrc:spotlessGroovyCheck UP-TO-DATE
> Task :buildSrc:spotlessGroovyGradle UP-TO-DATE
> Task :buildSrc:spotlessGroovyGradleCheck UP-TO-DATE
> Task :buildSrc:spotlessCheck UP-TO-DATE
> Task :buildSrc:pluginUnderTestMetadata UP-TO-DATE
> Task :buildSrc:compileTestJava NO-SOURCE
> Task :buildSrc:compileTestGroovy NO-SOURCE
> Task :buildSrc:processTestResources NO-SOURCE
> Task :buildSrc:testClasses UP-TO-DATE
> Task :buildSrc:test NO-SOURCE
> Task :buildSrc:validatePlugins UP-TO-DATE
> Task :buildSrc:check UP-TO-DATE
> Task :buildSrc:build UP-TO-DATE
System Go installation: /snap/bin/go is go version go1.16.15 linux/amd64; Preparing to use /home/jenkins/go/bin/go1.20.2
GOCMD=/home/jenkins/go/bin/go1.20.2
go1.20.2: already downloaded in /home/jenkins/sdk/go1.20.2
> Task :sdks:go:container:copyLicenses
> Task :sdks:go:container:dockerClean UP-TO-DATE
> Task :sdks:go:container:goPrepare UP-TO-DATE
> Task :sdks:go:container:goBuild
/home/jenkins/go/bin/go1.20.2 build -o ./build/target/linux_amd64/boot boot.go boot_test.go
> Task :sdks:go:container:skipPullLicenses
> Task :sdks:go:container:dockerPrepare
#1 [internal] load build definition from Dockerfile
> Task :sdks:go:container:docker
#1 transferring dockerfile: 1.94kB done
#1 DONE 0.0s
#2 [internal] load .dockerignore
#2 transferring context: 2B done
#2 DONE 0.0s
#3 [internal] load metadata for docker.io/library/debian:bullseye
#3 DONE 0.6s
#4 [1/8] FROM docker.io/library/debian:bullseye@sha256:7b991788987ad860810df60927e1adbaf8e156520177bd4db82409f81dd3b721
#4 CACHED
#5 [internal] load build context
#5 transferring context: 22.19MB 0.2s done
#5 DONE 0.2s
#6 [2/8] RUN apt-get update && DEBIAN_FRONTEND=noninteractive apt-get install -y ca-certificates && rm -rf /var/lib/apt/lists/*
#6 1.100 Get:1 http://deb.debian.org/debian bullseye InRelease [116 kB]
#6 1.216 Get:2 http://deb.debian.org/debian-security bullseye-security InRelease [48.4 kB]
#6 1.258 Get:3 http://deb.debian.org/debian bullseye-updates InRelease [44.1 kB]
#6 1.625 Get:4 http://deb.debian.org/debian bullseye/main amd64 Packages [8183 kB]
#6 1.938 Get:5 http://deb.debian.org/debian-security bullseye-security/main amd64 Packages [236 kB]
#6 1.940 Get:6 http://deb.debian.org/debian bullseye-updates/main amd64 Packages [14.6 kB]
#6 3.236 Fetched 8642 kB in 2s (3892 kB/s)
#6 3.236 Reading package lists...
#6 3.955 Reading package lists...
#6 4.623 Building dependency tree...
#6 4.797 Reading state information...
#6 5.013 The following additional packages will be installed:
#6 5.014 openssl
#6 5.046 The following NEW packages will be installed:
#6 5.047 ca-certificates openssl
#6 5.136 0 upgraded, 2 newly installed, 0 to remove and 1 not upgraded.
#6 5.136 Need to get 1011 kB of archives.
#6 5.136 After this operation, 1892 kB of additional disk space will be used.
#6 5.136 Get:1 http://deb.debian.org/debian-security bullseye-security/main amd64 openssl amd64 1.1.1n-0+deb11u4 [853 kB]
#6 5.640 Get:2 http://deb.debian.org/debian bullseye/main amd64 ca-certificates all 20210119 [158 kB]
#6 6.297 debconf: delaying package configuration, since apt-utils is not installed
#6 6.332 Fetched 1011 kB in 1s (1720 kB/s)
#6 6.426 Selecting previously unselected package openssl.
#6 6.426 (Reading database ... (Reading database ... 5%(Reading database ... 10%(Reading database ... 15%(Reading database ... 20%(Reading database ... 25%(Reading database ... 30%(Reading database ... 35%(Reading database ... 40%(Reading database ... 45%(Reading database ... 50%(Reading database ... 55%(Reading database ... 60%(Reading database ... 65%(Reading database ... 70%(Reading database ... 75%(Reading database ... 80%(Reading database ... 85%(Reading database ... 90%(Reading database ... 95%(Reading database ... 100%(Reading database ... 6661 files and directories currently installed.)
#6 6.458 Preparing to unpack .../openssl_1.1.1n-0+deb11u4_amd64.deb ...
#6 6.462 Unpacking openssl (1.1.1n-0+deb11u4) ...
#6 6.585 Selecting previously unselected package ca-certificates.
#6 6.586 Preparing to unpack .../ca-certificates_20210119_all.deb ...
#6 6.591 Unpacking ca-certificates (20210119) ...
#6 6.667 Setting up openssl (1.1.1n-0+deb11u4) ...
#6 6.689 Setting up ca-certificates (20210119) ...
#6 7.460 Updating certificates in /etc/ssl/certs...
#6 8.301 129 added, 0 removed; done.
#6 8.350 Processing triggers for ca-certificates (20210119) ...
#6 8.359 Updating certificates in /etc/ssl/certs...
#6 8.964 0 added, 0 removed; done.
#6 8.964 Running hooks in /etc/ca-certificates/update.d...
#6 8.967 done.
#6 DONE 9.9s
#7 [3/8] ADD target/linux_amd64/boot /opt/apache/beam/
#7 DONE 0.3s
#8 [4/8] COPY target/LICENSE /opt/apache/beam/
#8 DONE 0.1s
#9 [5/8] COPY target/NOTICE /opt/apache/beam/
#9 DONE 0.1s
#10 [6/8] COPY target/LICENSE target/go-licenses/* /opt/apache/beam/third_party_licenses/golang/
#10 ERROR: lstat /var/lib/docker/tmp/buildkit-mount496869116/target/go-licenses: no such file or directory
------
> [6/8] COPY target/LICENSE target/go-licenses/* /opt/apache/beam/third_party_licenses/golang/:
------
ERROR: failed to solve: lstat /var/lib/docker/tmp/buildkit-mount496869116/target/go-licenses: no such file or directory
> Task :sdks:go:container:docker FAILED
FAILURE: Build failed with an exception.
* What went wrong:
Execution failed for task ':sdks:go:container:docker'.
> Process 'command 'docker'' finished with non-zero exit value 1
* Try:
> Run with --stacktrace option to get the stack trace.
> Run with --info or --debug option to get more log output.
* Get more help at https://help.gradle.org
16 actionable tasks: 5 executed, 11 up-to-date
BUILD FAILED in 31s
Publishing build scan...
https://gradle.com/s/2nnp7g6rymmpi
$ ./gradlew :sdks:go:container:docker -Pdocker-repository-root=us.gcr.io/apache-beam-testing/jenkins -Pdocker-tag=20230405-083456
> Task :goIntegrationTests FAILED
FAILURE: Build failed with an exception.
* What went wrong:
Execution failed for task ':goIntegrationTests'.
> Process 'command 'sh'' finished with non-zero exit value 1
* Try:
> Run with --stacktrace option to get the stack trace.
> Run with --info or --debug option to get more log output.
* Get more help at https://help.gradle.org
Deprecated Gradle features were used in this build, making it incompatible with Gradle 8.0.
You can use '--warning-mode all' to show the individual deprecation warnings and determine if they come from your own scripts or plugins.
See https://docs.gradle.org/7.5.1/userguide/command_line_interface.html#sec:command_line_warnings
BUILD FAILED in 1m 9s
91 actionable tasks: 55 executed, 34 from cache, 2 up-to-date
Publishing build scan...
https://gradle.com/s/4o5jvb5totcf4
Build step 'Invoke Gradle script' changed build result to FAILURE
Build step 'Invoke Gradle script' marked build as failure
---------------------------------------------------------------------
To unsubscribe, e-mail: builds-unsubscribe@beam.apache.org
For additional commands, e-mail: builds-help@beam.apache.org
Jenkins build is back to normal : beam_PostCommit_Go #11152
Posted by Apache Jenkins Server <je...@builds.apache.org>.
See <https://ci-beam.apache.org/job/beam_PostCommit_Go/11152/display/redirect?page=changes>
---------------------------------------------------------------------
To unsubscribe, e-mail: builds-unsubscribe@beam.apache.org
For additional commands, e-mail: builds-help@beam.apache.org
Build failed in Jenkins: beam_PostCommit_Go #11151
Posted by Apache Jenkins Server <je...@builds.apache.org>.
See <https://ci-beam.apache.org/job/beam_PostCommit_Go/11151/display/redirect>
Changes:
------------------------------------------
[...truncated 25.27 KB...]
> Task :sdks:java:expansion-service:processResources NO-SOURCE
> Task :sdks:java:expansion-service:classes UP-TO-DATE
> Task :sdks:java:expansion-service:jar
> Task :sdks:java:extensions:arrow:createCheckerFrameworkManifest
> Task :sdks:java:extensions:arrow:compileJava FROM-CACHE
> Task :sdks:java:extensions:arrow:processResources NO-SOURCE
> Task :sdks:java:extensions:arrow:classes UP-TO-DATE
> Task :sdks:java:extensions:arrow:jar
> Task :sdks:java:extensions:protobuf:createCheckerFrameworkManifest
> Task :sdks:java:extensions:protobuf:extractIncludeProto
> Task :sdks:java:extensions:protobuf:extractProto
> Task :sdks:java:extensions:protobuf:generateProto NO-SOURCE
> Task :sdks:java:extensions:protobuf:compileJava FROM-CACHE
> Task :sdks:java:extensions:protobuf:processResources NO-SOURCE
> Task :sdks:java:extensions:protobuf:classes UP-TO-DATE
> Task :sdks:java:extensions:protobuf:jar
> Task :sdks:java:io:google-cloud-platform:createCheckerFrameworkManifest
> Task :sdks:java:io:google-cloud-platform:compileJava FROM-CACHE
> Task :sdks:java:io:google-cloud-platform:processResources NO-SOURCE
> Task :sdks:java:io:google-cloud-platform:classes UP-TO-DATE
> Task :sdks:java:io:google-cloud-platform:jar
> Task :sdks:java:io:kafka:createCheckerFrameworkManifest
> Task :sdks:java:io:kafka:compileJava FROM-CACHE
> Task :sdks:java:io:kafka:processResources NO-SOURCE
> Task :sdks:java:io:kafka:classes UP-TO-DATE
> Task :sdks:java:io:kafka:jar
> Task :runners:google-cloud-dataflow-java:compileJava FROM-CACHE
> Task :runners:google-cloud-dataflow-java:processResources
> Task :runners:google-cloud-dataflow-java:classes
> Task :runners:google-cloud-dataflow-java:jar
> Task :runners:google-cloud-dataflow-java:worker:createCheckerFrameworkManifest
> Task :runners:google-cloud-dataflow-java:worker:windmill:createCheckerFrameworkManifest
> Task :runners:google-cloud-dataflow-java:worker:windmill:extractIncludeProto
> Task :runners:google-cloud-dataflow-java:worker:windmill:extractProto
> Task :runners:google-cloud-dataflow-java:worker:windmill:generateProto FROM-CACHE
> Task :runners:google-cloud-dataflow-java:worker:windmill:compileJava FROM-CACHE
> Task :runners:google-cloud-dataflow-java:worker:windmill:processResources
> Task :runners:google-cloud-dataflow-java:worker:windmill:classes
> Task :runners:google-cloud-dataflow-java:worker:windmill:shadowJar FROM-CACHE
> Task :runners:google-cloud-dataflow-java:worker:compileJava FROM-CACHE
> Task :runners:google-cloud-dataflow-java:worker:processResources
> Task :runners:google-cloud-dataflow-java:worker:classes
> Task :runners:google-cloud-dataflow-java:worker:shadowJar FROM-CACHE
> Task :sdks:go:test:assemble UP-TO-DATE
> Task :sdks:go:test:test UP-TO-DATE
> Task :sdks:go:test:check UP-TO-DATE
> Task :sdks:go:test:build UP-TO-DATE
> Task :goIntegrationTests
$ CURRENT_DIRECTORY=<https://ci-beam.apache.org/job/beam_PostCommit_Go/ws/src/sdks/go/test>
$ TESTS=./test/integration/... ./test/regression
$ RUNNER=portable
$ TIMEOUT=3h
$ SIMULTANEOUS=3
$ GCS_LOCATION=gs://temp-storage-for-end-to-end-tests
$ GCS_SUBFOLDER=test30805
$ PROJECT=apache-beam-testing
$ DATAFLOW_PROJECT=apache-beam-testing
$ REGION=us-central1
$ trap exit_background_processes SIGINT SIGTERM EXIT
$ key=--runner
$ case --runner in
$ RUNNER=dataflow
$ cd <https://ci-beam.apache.org/job/beam_PostCommit_Go/ws/src>
$ test -d sdks/go/test
$ command -v docker
/usr/bin/docker
$ docker -v
Docker version 20.10.23, build 7155243
$ command -v gcloud
/usr/bin/gcloud
$ gcloud --version
Google Cloud SDK 406.0.0
alpha 2022.10.17
beta 2022.10.17
bq 2.0.79
bundled-python3-unix 3.9.12
core 2022.10.17
gcloud-crc32c 1.0.0
gsutil 5.14
$ TMPDIR=/tmp/tmp.V6orA8iLkb
$ gcloud_ver=406.0.0
$ TAG=20230410-083454
$ CONTAINER=us.gcr.io/apache-beam-testing/jenkins/beam_go_sdk
Using container us.gcr.io/apache-beam-testing/jenkins/beam_go_sdk
$ ./gradlew :sdks:go:container:docker -Pdocker-repository-root=us.gcr.io/apache-beam-testing/jenkins -Pdocker-tag=20230410-083454
To honour the JVM settings for this build a single-use Daemon process will be forked. See https://docs.gradle.org/7.5.1/userguide/gradle_daemon.html#sec:disabling_the_daemon.
Daemon will be stopped at the end of the build
Configuration on demand is an incubating feature.
> Task :buildSrc:compileJava NO-SOURCE
> Task :buildSrc:compileGroovy UP-TO-DATE
> Task :buildSrc:pluginDescriptors UP-TO-DATE
> Task :buildSrc:processResources UP-TO-DATE
> Task :buildSrc:classes UP-TO-DATE
> Task :buildSrc:jar UP-TO-DATE
> Task :buildSrc:assemble UP-TO-DATE
> Task :buildSrc:spotlessGroovy UP-TO-DATE
> Task :buildSrc:spotlessGroovyCheck UP-TO-DATE
> Task :buildSrc:spotlessGroovyGradle UP-TO-DATE
> Task :buildSrc:spotlessGroovyGradleCheck UP-TO-DATE
> Task :buildSrc:spotlessCheck UP-TO-DATE
> Task :buildSrc:pluginUnderTestMetadata UP-TO-DATE
> Task :buildSrc:compileTestJava NO-SOURCE
> Task :buildSrc:compileTestGroovy NO-SOURCE
> Task :buildSrc:processTestResources NO-SOURCE
> Task :buildSrc:testClasses UP-TO-DATE
> Task :buildSrc:test NO-SOURCE
> Task :buildSrc:validatePlugins UP-TO-DATE
> Task :buildSrc:check UP-TO-DATE
> Task :buildSrc:build UP-TO-DATE
System Go installation: /snap/bin/go is go version go1.16.15 linux/amd64; Preparing to use /home/jenkins/go/bin/go1.20.2
GOCMD=/home/jenkins/go/bin/go1.20.2
go1.20.2: already downloaded in /home/jenkins/sdk/go1.20.2
> Task :sdks:go:container:copyLicenses
> Task :sdks:go:container:dockerClean UP-TO-DATE
> Task :sdks:go:container:goPrepare UP-TO-DATE
> Task :sdks:go:container:goBuild
/home/jenkins/go/bin/go1.20.2 build -o ./build/target/linux_amd64/boot boot.go boot_test.go
> Task :sdks:go:container:skipPullLicenses
> Task :sdks:go:container:dockerPrepare
#1 [internal] load build definition from Dockerfile
> Task :sdks:go:container:docker
#1 transferring dockerfile: 1.94kB done
#1 DONE 0.0s
#2 [internal] load .dockerignore
#2 transferring context: 2B done
#2 DONE 0.0s
#3 [internal] load metadata for docker.io/library/debian:bullseye
#3 DONE 0.3s
#4 [1/8] FROM docker.io/library/debian:bullseye@sha256:7b991788987ad860810df60927e1adbaf8e156520177bd4db82409f81dd3b721
#4 CACHED
#5 [internal] load build context
#5 transferring context: 22.20MB 0.2s done
#5 DONE 0.2s
#6 [2/8] RUN apt-get update && DEBIAN_FRONTEND=noninteractive apt-get install -y ca-certificates && rm -rf /var/lib/apt/lists/*
#6 0.409 Get:1 http://deb.debian.org/debian bullseye InRelease [116 kB]
#6 0.486 Get:2 http://deb.debian.org/debian-security bullseye-security InRelease [48.4 kB]
#6 0.516 Get:3 http://deb.debian.org/debian bullseye-updates InRelease [44.1 kB]
#6 0.622 Get:4 http://deb.debian.org/debian bullseye/main amd64 Packages [8183 kB]
#6 0.820 Get:5 http://deb.debian.org/debian-security bullseye-security/main amd64 Packages [236 kB]
#6 0.852 Get:6 http://deb.debian.org/debian bullseye-updates/main amd64 Packages [14.6 kB]
#6 2.103 Fetched 8642 kB in 2s (4905 kB/s)
#6 2.103 Reading package lists...
#6 2.736 Reading package lists...
#6 3.343 Building dependency tree...
#6 3.489 Reading state information...
#6 3.641 The following additional packages will be installed:
#6 3.641 openssl
#6 3.667 The following NEW packages will be installed:
#6 3.668 ca-certificates openssl
#6 3.739 0 upgraded, 2 newly installed, 0 to remove and 1 not upgraded.
#6 3.739 Need to get 1011 kB of archives.
#6 3.739 After this operation, 1892 kB of additional disk space will be used.
#6 3.739 Get:1 http://deb.debian.org/debian-security bullseye-security/main amd64 openssl amd64 1.1.1n-0+deb11u4 [853 kB]
#6 3.876 Get:2 http://deb.debian.org/debian bullseye/main amd64 ca-certificates all 20210119 [158 kB]
#6 4.035 debconf: delaying package configuration, since apt-utils is not installed
#6 4.067 Fetched 1011 kB in 0s (4957 kB/s)
#6 4.090 Selecting previously unselected package openssl.
#6 4.090 (Reading database ... (Reading database ... 5%(Reading database ... 10%(Reading database ... 15%(Reading database ... 20%(Reading database ... 25%(Reading database ... 30%(Reading database ... 35%(Reading database ... 40%(Reading database ... 45%(Reading database ... 50%(Reading database ... 55%(Reading database ... 60%(Reading database ... 65%(Reading database ... 70%(Reading database ... 75%(Reading database ... 80%(Reading database ... 85%(Reading database ... 90%(Reading database ... 95%(Reading database ... 100%(Reading database ... 6661 files and directories currently installed.)
#6 4.098 Preparing to unpack .../openssl_1.1.1n-0+deb11u4_amd64.deb ...
#6 4.102 Unpacking openssl (1.1.1n-0+deb11u4) ...
#6 4.213 Selecting previously unselected package ca-certificates.
#6 4.214 Preparing to unpack .../ca-certificates_20210119_all.deb ...
#6 4.218 Unpacking ca-certificates (20210119) ...
#6 4.284 Setting up openssl (1.1.1n-0+deb11u4) ...
#6 4.299 Setting up ca-certificates (20210119) ...
#6 4.850 Updating certificates in /etc/ssl/certs...
#6 5.522 129 added, 0 removed; done.
#6 5.562 Processing triggers for ca-certificates (20210119) ...
#6 5.571 Updating certificates in /etc/ssl/certs...
#6 6.121 0 added, 0 removed; done.
#6 6.121 Running hooks in /etc/ca-certificates/update.d...
#6 6.122 done.
#6 DONE 7.6s
#7 [3/8] ADD target/linux_amd64/boot /opt/apache/beam/
#7 DONE 0.3s
#8 [4/8] COPY target/LICENSE /opt/apache/beam/
#8 DONE 0.1s
#9 [5/8] COPY target/NOTICE /opt/apache/beam/
#9 DONE 0.0s
#10 [6/8] COPY target/LICENSE target/go-licenses/* /opt/apache/beam/third_party_licenses/golang/
#10 ERROR: lstat /var/lib/docker/tmp/buildkit-mount3900915332/target/go-licenses: no such file or directory
------
> Task :sdks:go:container:docker FAILED
> [6/8] COPY target/LICENSE target/go-licenses/* /opt/apache/beam/third_party_licenses/golang/:
------
ERROR: failed to solve: lstat /var/lib/docker/tmp/buildkit-mount3900915332/target/go-licenses: no such file or directory
FAILURE: Build failed with an exception.
* What went wrong:
Execution failed for task ':sdks:go:container:docker'.
> Process 'command 'docker'' finished with non-zero exit value 1
* Try:
> Run with --stacktrace option to get the stack trace.
> Run with --info or --debug option to get more log output.
* Get more help at https://help.gradle.org
16 actionable tasks: 5 executed, 11 up-to-date
Publishing build scan...
BUILD FAILED in 22s
https://gradle.com/s/7ptszwsdq4j46
$ ./gradlew :sdks:go:container:docker -Pdocker-repository-root=us.gcr.io/apache-beam-testing/jenkins -Pdocker-tag=20230410-083454
> Task :goIntegrationTests FAILED
FAILURE: Build failed with an exception.
* What went wrong:
Execution failed for task ':goIntegrationTests'.
> Process 'command 'sh'' finished with non-zero exit value 1
* Try:
> Run with --stacktrace option to get the stack trace.
> Run with --info or --debug option to get more log output.
* Get more help at https://help.gradle.org
Deprecated Gradle features were used in this build, making it incompatible with Gradle 8.0.
You can use '--warning-mode all' to show the individual deprecation warnings and determine if they come from your own scripts or plugins.
See https://docs.gradle.org/7.5.1/userguide/command_line_interface.html#sec:command_line_warnings
BUILD FAILED in 53s
91 actionable tasks: 55 executed, 34 from cache, 2 up-to-date
Publishing build scan...
https://gradle.com/s/dtpoalrzc56xu
Build step 'Invoke Gradle script' changed build result to FAILURE
Build step 'Invoke Gradle script' marked build as failure
---------------------------------------------------------------------
To unsubscribe, e-mail: builds-unsubscribe@beam.apache.org
For additional commands, e-mail: builds-help@beam.apache.org
Build failed in Jenkins: beam_PostCommit_Go #11150
Posted by Apache Jenkins Server <je...@builds.apache.org>.
See <https://ci-beam.apache.org/job/beam_PostCommit_Go/11150/display/redirect>
Changes:
------------------------------------------
[...truncated 25.27 KB...]
> Task :sdks:java:expansion-service:processResources NO-SOURCE
> Task :sdks:java:expansion-service:classes UP-TO-DATE
> Task :sdks:java:expansion-service:jar
> Task :sdks:java:extensions:arrow:createCheckerFrameworkManifest
> Task :sdks:java:extensions:arrow:compileJava FROM-CACHE
> Task :sdks:java:extensions:arrow:processResources NO-SOURCE
> Task :sdks:java:extensions:arrow:classes UP-TO-DATE
> Task :sdks:java:extensions:arrow:jar
> Task :sdks:java:extensions:protobuf:createCheckerFrameworkManifest
> Task :sdks:java:extensions:protobuf:extractIncludeProto
> Task :sdks:java:extensions:protobuf:extractProto
> Task :sdks:java:extensions:protobuf:generateProto NO-SOURCE
> Task :sdks:java:extensions:protobuf:compileJava FROM-CACHE
> Task :sdks:java:extensions:protobuf:processResources NO-SOURCE
> Task :sdks:java:extensions:protobuf:classes UP-TO-DATE
> Task :sdks:java:extensions:protobuf:jar
> Task :sdks:java:io:google-cloud-platform:createCheckerFrameworkManifest
> Task :sdks:java:io:google-cloud-platform:compileJava FROM-CACHE
> Task :sdks:java:io:google-cloud-platform:processResources NO-SOURCE
> Task :sdks:java:io:google-cloud-platform:classes UP-TO-DATE
> Task :sdks:java:io:google-cloud-platform:jar
> Task :sdks:java:io:kafka:createCheckerFrameworkManifest
> Task :sdks:java:io:kafka:compileJava FROM-CACHE
> Task :sdks:java:io:kafka:processResources NO-SOURCE
> Task :sdks:java:io:kafka:classes UP-TO-DATE
> Task :sdks:java:io:kafka:jar
> Task :runners:google-cloud-dataflow-java:compileJava FROM-CACHE
> Task :runners:google-cloud-dataflow-java:processResources
> Task :runners:google-cloud-dataflow-java:classes
> Task :runners:google-cloud-dataflow-java:jar
> Task :runners:google-cloud-dataflow-java:worker:createCheckerFrameworkManifest
> Task :runners:google-cloud-dataflow-java:worker:windmill:createCheckerFrameworkManifest
> Task :runners:google-cloud-dataflow-java:worker:windmill:extractIncludeProto
> Task :runners:google-cloud-dataflow-java:worker:windmill:extractProto
> Task :runners:google-cloud-dataflow-java:worker:windmill:generateProto FROM-CACHE
> Task :runners:google-cloud-dataflow-java:worker:windmill:compileJava FROM-CACHE
> Task :runners:google-cloud-dataflow-java:worker:windmill:processResources
> Task :runners:google-cloud-dataflow-java:worker:windmill:classes
> Task :runners:google-cloud-dataflow-java:worker:windmill:shadowJar FROM-CACHE
> Task :runners:google-cloud-dataflow-java:worker:compileJava FROM-CACHE
> Task :runners:google-cloud-dataflow-java:worker:processResources
> Task :runners:google-cloud-dataflow-java:worker:classes
> Task :runners:google-cloud-dataflow-java:worker:shadowJar FROM-CACHE
> Task :sdks:go:test:assemble UP-TO-DATE
> Task :sdks:go:test:test UP-TO-DATE
> Task :sdks:go:test:check UP-TO-DATE
> Task :sdks:go:test:build UP-TO-DATE
> Task :goIntegrationTests
$ CURRENT_DIRECTORY=<https://ci-beam.apache.org/job/beam_PostCommit_Go/ws/src/sdks/go/test>
$ TESTS=./test/integration/... ./test/regression
$ RUNNER=portable
$ TIMEOUT=3h
$ SIMULTANEOUS=3
$ GCS_LOCATION=gs://temp-storage-for-end-to-end-tests
$ GCS_SUBFOLDER=test30209
$ PROJECT=apache-beam-testing
$ DATAFLOW_PROJECT=apache-beam-testing
$ REGION=us-central1
$ trap exit_background_processes SIGINT SIGTERM EXIT
$ key=--runner
$ case --runner in
$ RUNNER=dataflow
$ cd <https://ci-beam.apache.org/job/beam_PostCommit_Go/ws/src>
$ test -d sdks/go/test
$ command -v docker
/usr/bin/docker
$ docker -v
Docker version 20.10.23, build 7155243
$ command -v gcloud
/usr/bin/gcloud
$ gcloud --version
Google Cloud SDK 406.0.0
alpha 2022.10.17
beta 2022.10.17
bq 2.0.79
bundled-python3-unix 3.9.12
core 2022.10.17
gcloud-crc32c 1.0.0
gsutil 5.14
$ TMPDIR=/tmp/tmp.9YJg3MheBM
$ gcloud_ver=406.0.0
$ TAG=20230410-023454
$ CONTAINER=us.gcr.io/apache-beam-testing/jenkins/beam_go_sdk
Using container us.gcr.io/apache-beam-testing/jenkins/beam_go_sdk
$ ./gradlew :sdks:go:container:docker -Pdocker-repository-root=us.gcr.io/apache-beam-testing/jenkins -Pdocker-tag=20230410-023454
To honour the JVM settings for this build a single-use Daemon process will be forked. See https://docs.gradle.org/7.5.1/userguide/gradle_daemon.html#sec:disabling_the_daemon.
Daemon will be stopped at the end of the build
Configuration on demand is an incubating feature.
> Task :buildSrc:compileJava NO-SOURCE
> Task :buildSrc:compileGroovy UP-TO-DATE
> Task :buildSrc:pluginDescriptors UP-TO-DATE
> Task :buildSrc:processResources UP-TO-DATE
> Task :buildSrc:classes UP-TO-DATE
> Task :buildSrc:jar UP-TO-DATE
> Task :buildSrc:assemble UP-TO-DATE
> Task :buildSrc:spotlessGroovy UP-TO-DATE
> Task :buildSrc:spotlessGroovyCheck UP-TO-DATE
> Task :buildSrc:spotlessGroovyGradle UP-TO-DATE
> Task :buildSrc:spotlessGroovyGradleCheck UP-TO-DATE
> Task :buildSrc:spotlessCheck UP-TO-DATE
> Task :buildSrc:pluginUnderTestMetadata UP-TO-DATE
> Task :buildSrc:compileTestJava NO-SOURCE
> Task :buildSrc:compileTestGroovy NO-SOURCE
> Task :buildSrc:processTestResources NO-SOURCE
> Task :buildSrc:testClasses UP-TO-DATE
> Task :buildSrc:test NO-SOURCE
> Task :buildSrc:validatePlugins UP-TO-DATE
> Task :buildSrc:check UP-TO-DATE
> Task :buildSrc:build UP-TO-DATE
System Go installation: /snap/bin/go is go version go1.16.15 linux/amd64; Preparing to use /home/jenkins/go/bin/go1.20.2
GOCMD=/home/jenkins/go/bin/go1.20.2
go1.20.2: already downloaded in /home/jenkins/sdk/go1.20.2
> Task :sdks:go:container:copyLicenses
> Task :sdks:go:container:dockerClean UP-TO-DATE
> Task :sdks:go:container:goPrepare UP-TO-DATE
> Task :sdks:go:container:goBuild
/home/jenkins/go/bin/go1.20.2 build -o ./build/target/linux_amd64/boot boot.go boot_test.go
> Task :sdks:go:container:skipPullLicenses
> Task :sdks:go:container:dockerPrepare
#1 [internal] load .dockerignore
> Task :sdks:go:container:docker
#1 transferring context: 2B done
#1 DONE 0.0s
#2 [internal] load build definition from Dockerfile
#2 transferring dockerfile: 1.94kB done
#2 DONE 0.0s
#3 [internal] load metadata for docker.io/library/debian:bullseye
#3 DONE 0.3s
#4 [1/8] FROM docker.io/library/debian:bullseye@sha256:7b991788987ad860810df60927e1adbaf8e156520177bd4db82409f81dd3b721
#4 CACHED
#5 [internal] load build context
#5 transferring context: 22.20MB 0.2s done
#5 DONE 0.2s
#6 [2/8] RUN apt-get update && DEBIAN_FRONTEND=noninteractive apt-get install -y ca-certificates && rm -rf /var/lib/apt/lists/*
#6 1.698 Get:1 http://deb.debian.org/debian bullseye InRelease [116 kB]
#6 1.776 Get:2 http://deb.debian.org/debian-security bullseye-security InRelease [48.4 kB]
#6 1.814 Get:3 http://deb.debian.org/debian bullseye-updates InRelease [44.1 kB]
#6 2.199 Get:4 http://deb.debian.org/debian bullseye/main amd64 Packages [8183 kB]
#6 2.448 Get:5 http://deb.debian.org/debian-security bullseye-security/main amd64 Packages [236 kB]
#6 2.450 Get:6 http://deb.debian.org/debian bullseye-updates/main amd64 Packages [14.6 kB]
#6 3.732 Fetched 8642 kB in 2s (4046 kB/s)
#6 3.732 Reading package lists...
#6 4.369 Reading package lists...
#6 4.991 Building dependency tree...
#6 5.131 Reading state information...
#6 5.296 The following additional packages will be installed:
#6 5.297 openssl
#6 5.322 The following NEW packages will be installed:
#6 5.323 ca-certificates openssl
#6 5.435 0 upgraded, 2 newly installed, 0 to remove and 1 not upgraded.
#6 5.435 Need to get 1011 kB of archives.
#6 5.435 After this operation, 1892 kB of additional disk space will be used.
#6 5.435 Get:1 http://deb.debian.org/debian-security bullseye-security/main amd64 openssl amd64 1.1.1n-0+deb11u4 [853 kB]
#6 5.638 Get:2 http://deb.debian.org/debian bullseye/main amd64 ca-certificates all 20210119 [158 kB]
#6 6.127 debconf: delaying package configuration, since apt-utils is not installed
#6 6.158 Fetched 1011 kB in 0s (3234 kB/s)
#6 6.213 Selecting previously unselected package openssl.
#6 6.213 (Reading database ... (Reading database ... 5%(Reading database ... 10%(Reading database ... 15%(Reading database ... 20%(Reading database ... 25%(Reading database ... 30%(Reading database ... 35%(Reading database ... 40%(Reading database ... 45%(Reading database ... 50%(Reading database ... 55%(Reading database ... 60%(Reading database ... 65%(Reading database ... 70%(Reading database ... 75%(Reading database ... 80%(Reading database ... 85%(Reading database ... 90%(Reading database ... 95%(Reading database ... 100%(Reading database ... 6661 files and directories currently installed.)
#6 6.222 Preparing to unpack .../openssl_1.1.1n-0+deb11u4_amd64.deb ...
#6 6.226 Unpacking openssl (1.1.1n-0+deb11u4) ...
#6 6.339 Selecting previously unselected package ca-certificates.
#6 6.340 Preparing to unpack .../ca-certificates_20210119_all.deb ...
#6 6.344 Unpacking ca-certificates (20210119) ...
#6 6.404 Setting up openssl (1.1.1n-0+deb11u4) ...
#6 6.419 Setting up ca-certificates (20210119) ...
#6 7.027 Updating certificates in /etc/ssl/certs...
#6 7.854 129 added, 0 removed; done.
#6 7.891 Processing triggers for ca-certificates (20210119) ...
#6 7.899 Updating certificates in /etc/ssl/certs...
#6 8.444 0 added, 0 removed; done.
#6 8.444 Running hooks in /etc/ca-certificates/update.d...
#6 8.446 done.
#6 DONE 9.5s
#7 [3/8] ADD target/linux_amd64/boot /opt/apache/beam/
#7 DONE 0.2s
#8 [4/8] COPY target/LICENSE /opt/apache/beam/
#8 DONE 0.1s
#9 [5/8] COPY target/NOTICE /opt/apache/beam/
#9 DONE 0.1s
> Task :sdks:go:container:docker FAILED
#10 [6/8] COPY target/LICENSE target/go-licenses/* /opt/apache/beam/third_party_licenses/golang/
#10 ERROR: lstat /var/lib/docker/tmp/buildkit-mount3907744303/target/go-licenses: no such file or directory
------
> [6/8] COPY target/LICENSE target/go-licenses/* /opt/apache/beam/third_party_licenses/golang/:
------
ERROR: failed to solve: lstat /var/lib/docker/tmp/buildkit-mount3907744303/target/go-licenses: no such file or directory
FAILURE: Build failed with an exception.
* What went wrong:
Execution failed for task ':sdks:go:container:docker'.
> Process 'command 'docker'' finished with non-zero exit value 1
* Try:
> Run with --stacktrace option to get the stack trace.
> Run with --info or --debug option to get more log output.
16 actionable tasks: 5 executed, 11 up-to-date
* Get more help at https://help.gradle.org
Publishing build scan...
BUILD FAILED in 27s
https://gradle.com/s/ogdoorjy6w5kg
$ ./gradlew :sdks:go:container:docker -Pdocker-repository-root=us.gcr.io/apache-beam-testing/jenkins -Pdocker-tag=20230410-023454
> Task :goIntegrationTests FAILED
FAILURE: Build failed with an exception.
* What went wrong:
Execution failed for task ':goIntegrationTests'.
> Process 'command 'sh'' finished with non-zero exit value 1
* Try:
> Run with --stacktrace option to get the stack trace.
> Run with --info or --debug option to get more log output.
* Get more help at https://help.gradle.org
Deprecated Gradle features were used in this build, making it incompatible with Gradle 8.0.
You can use '--warning-mode all' to show the individual deprecation warnings and determine if they come from your own scripts or plugins.
See https://docs.gradle.org/7.5.1/userguide/command_line_interface.html#sec:command_line_warnings
BUILD FAILED in 1m
91 actionable tasks: 55 executed, 34 from cache, 2 up-to-date
Publishing build scan...
https://gradle.com/s/caqmqbxrdosta
Build step 'Invoke Gradle script' changed build result to FAILURE
Build step 'Invoke Gradle script' marked build as failure
---------------------------------------------------------------------
To unsubscribe, e-mail: builds-unsubscribe@beam.apache.org
For additional commands, e-mail: builds-help@beam.apache.org
Build failed in Jenkins: beam_PostCommit_Go #11149
Posted by Apache Jenkins Server <je...@builds.apache.org>.
See <https://ci-beam.apache.org/job/beam_PostCommit_Go/11149/display/redirect>
Changes:
------------------------------------------
[...truncated 25.27 KB...]
> Task :sdks:java:expansion-service:processResources NO-SOURCE
> Task :sdks:java:expansion-service:classes UP-TO-DATE
> Task :sdks:java:expansion-service:jar
> Task :sdks:java:extensions:arrow:createCheckerFrameworkManifest
> Task :sdks:java:extensions:arrow:compileJava FROM-CACHE
> Task :sdks:java:extensions:arrow:processResources NO-SOURCE
> Task :sdks:java:extensions:arrow:classes UP-TO-DATE
> Task :sdks:java:extensions:arrow:jar
> Task :sdks:java:extensions:protobuf:createCheckerFrameworkManifest
> Task :sdks:java:extensions:protobuf:extractIncludeProto
> Task :sdks:java:extensions:protobuf:extractProto
> Task :sdks:java:extensions:protobuf:generateProto NO-SOURCE
> Task :sdks:java:extensions:protobuf:compileJava FROM-CACHE
> Task :sdks:java:extensions:protobuf:processResources NO-SOURCE
> Task :sdks:java:extensions:protobuf:classes UP-TO-DATE
> Task :sdks:java:extensions:protobuf:jar
> Task :sdks:java:io:google-cloud-platform:createCheckerFrameworkManifest
> Task :sdks:java:io:google-cloud-platform:compileJava FROM-CACHE
> Task :sdks:java:io:google-cloud-platform:processResources NO-SOURCE
> Task :sdks:java:io:google-cloud-platform:classes UP-TO-DATE
> Task :sdks:java:io:google-cloud-platform:jar
> Task :sdks:java:io:kafka:createCheckerFrameworkManifest
> Task :sdks:java:io:kafka:compileJava FROM-CACHE
> Task :sdks:java:io:kafka:processResources NO-SOURCE
> Task :sdks:java:io:kafka:classes UP-TO-DATE
> Task :sdks:java:io:kafka:jar
> Task :runners:google-cloud-dataflow-java:compileJava FROM-CACHE
> Task :runners:google-cloud-dataflow-java:processResources
> Task :runners:google-cloud-dataflow-java:classes
> Task :runners:google-cloud-dataflow-java:jar
> Task :runners:google-cloud-dataflow-java:worker:createCheckerFrameworkManifest
> Task :runners:google-cloud-dataflow-java:worker:windmill:createCheckerFrameworkManifest
> Task :runners:google-cloud-dataflow-java:worker:windmill:extractIncludeProto
> Task :runners:google-cloud-dataflow-java:worker:windmill:extractProto
> Task :runners:google-cloud-dataflow-java:worker:windmill:generateProto FROM-CACHE
> Task :runners:google-cloud-dataflow-java:worker:windmill:compileJava FROM-CACHE
> Task :runners:google-cloud-dataflow-java:worker:windmill:processResources
> Task :runners:google-cloud-dataflow-java:worker:windmill:classes
> Task :runners:google-cloud-dataflow-java:worker:windmill:shadowJar FROM-CACHE
> Task :runners:google-cloud-dataflow-java:worker:compileJava FROM-CACHE
> Task :runners:google-cloud-dataflow-java:worker:processResources
> Task :runners:google-cloud-dataflow-java:worker:classes
> Task :runners:google-cloud-dataflow-java:worker:shadowJar FROM-CACHE
> Task :sdks:go:test:assemble UP-TO-DATE
> Task :sdks:go:test:test UP-TO-DATE
> Task :sdks:go:test:check UP-TO-DATE
> Task :sdks:go:test:build UP-TO-DATE
> Task :goIntegrationTests
$ CURRENT_DIRECTORY=<https://ci-beam.apache.org/job/beam_PostCommit_Go/ws/src/sdks/go/test>
$ TESTS=./test/integration/... ./test/regression
$ RUNNER=portable
$ TIMEOUT=3h
$ SIMULTANEOUS=3
$ GCS_LOCATION=gs://temp-storage-for-end-to-end-tests
$ GCS_SUBFOLDER=test1038
$ PROJECT=apache-beam-testing
$ DATAFLOW_PROJECT=apache-beam-testing
$ REGION=us-central1
$ trap exit_background_processes SIGINT SIGTERM EXIT
$ key=--runner
$ case --runner in
$ RUNNER=dataflow
$ cd <https://ci-beam.apache.org/job/beam_PostCommit_Go/ws/src>
$ test -d sdks/go/test
$ command -v docker
/usr/bin/docker
$ docker -v
Docker version 20.10.23, build 7155243
$ command -v gcloud
/usr/bin/gcloud
$ gcloud --version
Google Cloud SDK 406.0.0
alpha 2022.10.17
beta 2022.10.17
bq 2.0.79
bundled-python3-unix 3.9.12
core 2022.10.17
gcloud-crc32c 1.0.0
gsutil 5.14
$ TMPDIR=/tmp/tmp.PumrdoSsOS
$ gcloud_ver=406.0.0
$ TAG=20230409-203455
$ CONTAINER=us.gcr.io/apache-beam-testing/jenkins/beam_go_sdk
Using container us.gcr.io/apache-beam-testing/jenkins/beam_go_sdk
$ ./gradlew :sdks:go:container:docker -Pdocker-repository-root=us.gcr.io/apache-beam-testing/jenkins -Pdocker-tag=20230409-203455
To honour the JVM settings for this build a single-use Daemon process will be forked. See https://docs.gradle.org/7.5.1/userguide/gradle_daemon.html#sec:disabling_the_daemon.
Daemon will be stopped at the end of the build
Configuration on demand is an incubating feature.
> Task :buildSrc:compileJava NO-SOURCE
> Task :buildSrc:compileGroovy UP-TO-DATE
> Task :buildSrc:pluginDescriptors UP-TO-DATE
> Task :buildSrc:processResources UP-TO-DATE
> Task :buildSrc:classes UP-TO-DATE
> Task :buildSrc:jar UP-TO-DATE
> Task :buildSrc:assemble UP-TO-DATE
> Task :buildSrc:spotlessGroovy UP-TO-DATE
> Task :buildSrc:spotlessGroovyCheck UP-TO-DATE
> Task :buildSrc:spotlessGroovyGradle UP-TO-DATE
> Task :buildSrc:spotlessGroovyGradleCheck UP-TO-DATE
> Task :buildSrc:spotlessCheck UP-TO-DATE
> Task :buildSrc:pluginUnderTestMetadata UP-TO-DATE
> Task :buildSrc:compileTestJava NO-SOURCE
> Task :buildSrc:compileTestGroovy NO-SOURCE
> Task :buildSrc:processTestResources NO-SOURCE
> Task :buildSrc:testClasses UP-TO-DATE
> Task :buildSrc:test NO-SOURCE
> Task :buildSrc:validatePlugins UP-TO-DATE
> Task :buildSrc:check UP-TO-DATE
> Task :buildSrc:build UP-TO-DATE
System Go installation: /snap/bin/go is go version go1.16.15 linux/amd64; Preparing to use /home/jenkins/go/bin/go1.20.2
GOCMD=/home/jenkins/go/bin/go1.20.2
go1.20.2: already downloaded in /home/jenkins/sdk/go1.20.2
> Task :sdks:go:container:copyLicenses
> Task :sdks:go:container:dockerClean UP-TO-DATE
> Task :sdks:go:container:goPrepare UP-TO-DATE
> Task :sdks:go:container:goBuild
/home/jenkins/go/bin/go1.20.2 build -o ./build/target/linux_amd64/boot boot.go boot_test.go
> Task :sdks:go:container:skipPullLicenses
> Task :sdks:go:container:dockerPrepare
#1 [internal] load build definition from Dockerfile
> Task :sdks:go:container:docker
#1 transferring dockerfile: 1.94kB done
#1 DONE 0.0s
#2 [internal] load .dockerignore
#2 transferring context: 2B done
#2 DONE 0.0s
#3 [internal] load metadata for docker.io/library/debian:bullseye
#3 DONE 0.3s
#4 [1/8] FROM docker.io/library/debian:bullseye@sha256:7b991788987ad860810df60927e1adbaf8e156520177bd4db82409f81dd3b721
#4 CACHED
#5 [internal] load build context
#5 transferring context: 22.20MB 0.2s done
#5 DONE 0.2s
#6 [2/8] RUN apt-get update && DEBIAN_FRONTEND=noninteractive apt-get install -y ca-certificates && rm -rf /var/lib/apt/lists/*
#6 1.454 Get:1 http://deb.debian.org/debian bullseye InRelease [116 kB]
#6 1.508 Get:2 http://deb.debian.org/debian-security bullseye-security InRelease [48.4 kB]
#6 1.539 Get:3 http://deb.debian.org/debian bullseye-updates InRelease [44.1 kB]
#6 2.021 Get:4 http://deb.debian.org/debian bullseye/main amd64 Packages [8183 kB]
#6 2.229 Get:5 http://deb.debian.org/debian-security bullseye-security/main amd64 Packages [236 kB]
#6 2.272 Get:6 http://deb.debian.org/debian bullseye-updates/main amd64 Packages [14.6 kB]
#6 3.556 Fetched 8642 kB in 2s (3887 kB/s)
#6 3.556 Reading package lists...
#6 4.231 Reading package lists...
#6 4.874 Building dependency tree...
#6 5.024 Reading state information...
#6 5.192 The following additional packages will be installed:
#6 5.193 openssl
#6 5.219 The following NEW packages will be installed:
#6 5.220 ca-certificates openssl
#6 5.294 0 upgraded, 2 newly installed, 0 to remove and 1 not upgraded.
#6 5.294 Need to get 1011 kB of archives.
#6 5.294 After this operation, 1892 kB of additional disk space will be used.
#6 5.294 Get:1 http://deb.debian.org/debian-security bullseye-security/main amd64 openssl amd64 1.1.1n-0+deb11u4 [853 kB]
#6 5.475 Get:2 http://deb.debian.org/debian bullseye/main amd64 ca-certificates all 20210119 [158 kB]
#6 6.103 debconf: delaying package configuration, since apt-utils is not installed
#6 6.155 Fetched 1011 kB in 0s (4033 kB/s)
#6 6.303 Selecting previously unselected package openssl.
#6 6.303 (Reading database ... (Reading database ... 5%(Reading database ... 10%(Reading database ... 15%(Reading database ... 20%(Reading database ... 25%(Reading database ... 30%(Reading database ... 35%(Reading database ... 40%(Reading database ... 45%(Reading database ... 50%(Reading database ... 55%(Reading database ... 60%(Reading database ... 65%(Reading database ... 70%(Reading database ... 75%(Reading database ... 80%(Reading database ... 85%(Reading database ... 90%(Reading database ... 95%(Reading database ... 100%(Reading database ... 6661 files and directories currently installed.)
#6 6.341 Preparing to unpack .../openssl_1.1.1n-0+deb11u4_amd64.deb ...
#6 6.346 Unpacking openssl (1.1.1n-0+deb11u4) ...
#6 6.491 Selecting previously unselected package ca-certificates.
#6 6.492 Preparing to unpack .../ca-certificates_20210119_all.deb ...
#6 6.496 Unpacking ca-certificates (20210119) ...
#6 6.569 Setting up openssl (1.1.1n-0+deb11u4) ...
#6 6.588 Setting up ca-certificates (20210119) ...
#6 7.595 Updating certificates in /etc/ssl/certs...
#6 8.347 129 added, 0 removed; done.
#6 8.395 Processing triggers for ca-certificates (20210119) ...
#6 8.405 Updating certificates in /etc/ssl/certs...
#6 8.966 0 added, 0 removed; done.
#6 8.966 Running hooks in /etc/ca-certificates/update.d...
#6 8.993 done.
#6 DONE 10.1s
#7 [3/8] ADD target/linux_amd64/boot /opt/apache/beam/
#7 DONE 0.3s
#8 [4/8] COPY target/LICENSE /opt/apache/beam/
#8 DONE 0.1s
> Task :sdks:go:container:docker FAILED
#9 [5/8] COPY target/NOTICE /opt/apache/beam/
#9 DONE 0.1s
#10 [6/8] COPY target/LICENSE target/go-licenses/* /opt/apache/beam/third_party_licenses/golang/
#10 ERROR: lstat /var/lib/docker/tmp/buildkit-mount176359347/target/go-licenses: no such file or directory
------
> [6/8] COPY target/LICENSE target/go-licenses/* /opt/apache/beam/third_party_licenses/golang/:
------
ERROR: failed to solve: lstat /var/lib/docker/tmp/buildkit-mount176359347/target/go-licenses: no such file or directory
FAILURE: Build failed with an exception.
* What went wrong:
Execution failed for task ':sdks:go:container:docker'.
> Process 'command 'docker'' finished with non-zero exit value 1
* Try:
> Run with --stacktrace option to get the stack trace.
> Run with --info or --debug option to get more log output.
* Get more help at https://help.gradle.org
16 actionable tasks: 5 executed, 11 up-to-date
BUILD FAILED in 25s
Publishing build scan...
https://gradle.com/s/p4ecnxiimlg44
$ ./gradlew :sdks:go:container:docker -Pdocker-repository-root=us.gcr.io/apache-beam-testing/jenkins -Pdocker-tag=20230409-203455
> Task :goIntegrationTests FAILED
FAILURE: Build failed with an exception.
* What went wrong:
Execution failed for task ':goIntegrationTests'.
> Process 'command 'sh'' finished with non-zero exit value 1
* Try:
> Run with --stacktrace option to get the stack trace.
> Run with --info or --debug option to get more log output.
* Get more help at https://help.gradle.org
Deprecated Gradle features were used in this build, making it incompatible with Gradle 8.0.
You can use '--warning-mode all' to show the individual deprecation warnings and determine if they come from your own scripts or plugins.
See https://docs.gradle.org/7.5.1/userguide/command_line_interface.html#sec:command_line_warnings
BUILD FAILED in 57s
91 actionable tasks: 55 executed, 34 from cache, 2 up-to-date
Publishing build scan...
https://gradle.com/s/4sf7ogqgm4zr2
Build step 'Invoke Gradle script' changed build result to FAILURE
Build step 'Invoke Gradle script' marked build as failure
---------------------------------------------------------------------
To unsubscribe, e-mail: builds-unsubscribe@beam.apache.org
For additional commands, e-mail: builds-help@beam.apache.org
Build failed in Jenkins: beam_PostCommit_Go #11148
Posted by Apache Jenkins Server <je...@builds.apache.org>.
See <https://ci-beam.apache.org/job/beam_PostCommit_Go/11148/display/redirect>
Changes:
------------------------------------------
[...truncated 25.27 KB...]
> Task :sdks:java:expansion-service:processResources NO-SOURCE
> Task :sdks:java:expansion-service:classes UP-TO-DATE
> Task :sdks:java:expansion-service:jar
> Task :sdks:java:extensions:arrow:createCheckerFrameworkManifest
> Task :sdks:java:extensions:arrow:compileJava FROM-CACHE
> Task :sdks:java:extensions:arrow:processResources NO-SOURCE
> Task :sdks:java:extensions:arrow:classes UP-TO-DATE
> Task :sdks:java:extensions:arrow:jar
> Task :sdks:java:extensions:protobuf:createCheckerFrameworkManifest
> Task :sdks:java:extensions:protobuf:extractIncludeProto
> Task :sdks:java:extensions:protobuf:extractProto
> Task :sdks:java:extensions:protobuf:generateProto NO-SOURCE
> Task :sdks:java:extensions:protobuf:compileJava FROM-CACHE
> Task :sdks:java:extensions:protobuf:processResources NO-SOURCE
> Task :sdks:java:extensions:protobuf:classes UP-TO-DATE
> Task :sdks:java:extensions:protobuf:jar
> Task :sdks:java:io:google-cloud-platform:createCheckerFrameworkManifest
> Task :sdks:java:io:google-cloud-platform:compileJava FROM-CACHE
> Task :sdks:java:io:google-cloud-platform:processResources NO-SOURCE
> Task :sdks:java:io:google-cloud-platform:classes UP-TO-DATE
> Task :sdks:java:io:google-cloud-platform:jar
> Task :sdks:java:io:kafka:createCheckerFrameworkManifest
> Task :sdks:java:io:kafka:compileJava FROM-CACHE
> Task :sdks:java:io:kafka:processResources NO-SOURCE
> Task :sdks:java:io:kafka:classes UP-TO-DATE
> Task :sdks:java:io:kafka:jar
> Task :runners:google-cloud-dataflow-java:processResources
> Task :runners:google-cloud-dataflow-java:compileJava FROM-CACHE
> Task :runners:google-cloud-dataflow-java:classes
> Task :runners:google-cloud-dataflow-java:jar
> Task :runners:google-cloud-dataflow-java:worker:createCheckerFrameworkManifest
> Task :runners:google-cloud-dataflow-java:worker:windmill:createCheckerFrameworkManifest
> Task :runners:google-cloud-dataflow-java:worker:windmill:extractIncludeProto
> Task :runners:google-cloud-dataflow-java:worker:windmill:extractProto
> Task :runners:google-cloud-dataflow-java:worker:windmill:generateProto FROM-CACHE
> Task :runners:google-cloud-dataflow-java:worker:windmill:compileJava FROM-CACHE
> Task :runners:google-cloud-dataflow-java:worker:windmill:processResources
> Task :runners:google-cloud-dataflow-java:worker:windmill:classes
> Task :runners:google-cloud-dataflow-java:worker:windmill:shadowJar FROM-CACHE
> Task :runners:google-cloud-dataflow-java:worker:compileJava FROM-CACHE
> Task :runners:google-cloud-dataflow-java:worker:processResources
> Task :runners:google-cloud-dataflow-java:worker:classes
> Task :runners:google-cloud-dataflow-java:worker:shadowJar FROM-CACHE
> Task :sdks:go:test:assemble UP-TO-DATE
> Task :sdks:go:test:test UP-TO-DATE
> Task :sdks:go:test:check UP-TO-DATE
> Task :sdks:go:test:build UP-TO-DATE
> Task :goIntegrationTests
$ CURRENT_DIRECTORY=<https://ci-beam.apache.org/job/beam_PostCommit_Go/ws/src/sdks/go/test>
$ TESTS=./test/integration/... ./test/regression
$ RUNNER=portable
$ TIMEOUT=3h
$ SIMULTANEOUS=3
$ GCS_LOCATION=gs://temp-storage-for-end-to-end-tests
$ GCS_SUBFOLDER=test1122
$ PROJECT=apache-beam-testing
$ DATAFLOW_PROJECT=apache-beam-testing
$ REGION=us-central1
$ trap exit_background_processes SIGINT SIGTERM EXIT
$ key=--runner
$ case --runner in
$ RUNNER=dataflow
$ cd <https://ci-beam.apache.org/job/beam_PostCommit_Go/ws/src>
$ test -d sdks/go/test
$ command -v docker
/usr/bin/docker
$ docker -v
Docker version 20.10.23, build 7155243
$ command -v gcloud
/usr/bin/gcloud
$ gcloud --version
Google Cloud SDK 406.0.0
alpha 2022.10.17
beta 2022.10.17
bq 2.0.79
bundled-python3-unix 3.9.12
core 2022.10.17
gcloud-crc32c 1.0.0
gsutil 5.14
$ TMPDIR=/tmp/tmp.gtblOxvNtg
$ gcloud_ver=406.0.0
$ TAG=20230409-143456
$ CONTAINER=us.gcr.io/apache-beam-testing/jenkins/beam_go_sdk
Using container us.gcr.io/apache-beam-testing/jenkins/beam_go_sdk
$ ./gradlew :sdks:go:container:docker -Pdocker-repository-root=us.gcr.io/apache-beam-testing/jenkins -Pdocker-tag=20230409-143456
To honour the JVM settings for this build a single-use Daemon process will be forked. See https://docs.gradle.org/7.5.1/userguide/gradle_daemon.html#sec:disabling_the_daemon.
Daemon will be stopped at the end of the build
Configuration on demand is an incubating feature.
> Task :buildSrc:compileJava NO-SOURCE
> Task :buildSrc:compileGroovy UP-TO-DATE
> Task :buildSrc:pluginDescriptors UP-TO-DATE
> Task :buildSrc:processResources UP-TO-DATE
> Task :buildSrc:classes UP-TO-DATE
> Task :buildSrc:jar UP-TO-DATE
> Task :buildSrc:assemble UP-TO-DATE
> Task :buildSrc:spotlessGroovy UP-TO-DATE
> Task :buildSrc:spotlessGroovyCheck UP-TO-DATE
> Task :buildSrc:spotlessGroovyGradle UP-TO-DATE
> Task :buildSrc:spotlessGroovyGradleCheck UP-TO-DATE
> Task :buildSrc:spotlessCheck UP-TO-DATE
> Task :buildSrc:pluginUnderTestMetadata UP-TO-DATE
> Task :buildSrc:compileTestJava NO-SOURCE
> Task :buildSrc:compileTestGroovy NO-SOURCE
> Task :buildSrc:processTestResources NO-SOURCE
> Task :buildSrc:testClasses UP-TO-DATE
> Task :buildSrc:test NO-SOURCE
> Task :buildSrc:validatePlugins UP-TO-DATE
> Task :buildSrc:check UP-TO-DATE
> Task :buildSrc:build UP-TO-DATE
System Go installation: /snap/bin/go is go version go1.16.15 linux/amd64; Preparing to use /home/jenkins/go/bin/go1.20.2
GOCMD=/home/jenkins/go/bin/go1.20.2
go1.20.2: already downloaded in /home/jenkins/sdk/go1.20.2
> Task :sdks:go:container:copyLicenses
> Task :sdks:go:container:dockerClean UP-TO-DATE
> Task :sdks:go:container:goPrepare UP-TO-DATE
> Task :sdks:go:container:goBuild
/home/jenkins/go/bin/go1.20.2 build -o ./build/target/linux_amd64/boot boot.go boot_test.go
> Task :sdks:go:container:skipPullLicenses
> Task :sdks:go:container:dockerPrepare
#1 [internal] load build definition from Dockerfile
> Task :sdks:go:container:docker
#1 transferring dockerfile: 1.94kB done
#1 DONE 0.0s
#2 [internal] load .dockerignore
#2 transferring context: 2B done
#2 DONE 0.0s
#3 [internal] load metadata for docker.io/library/debian:bullseye
#3 DONE 0.3s
#4 [1/8] FROM docker.io/library/debian:bullseye@sha256:7b991788987ad860810df60927e1adbaf8e156520177bd4db82409f81dd3b721
#4 CACHED
#5 [internal] load build context
#5 transferring context: 22.20MB 0.2s done
#5 DONE 0.2s
#6 [2/8] RUN apt-get update && DEBIAN_FRONTEND=noninteractive apt-get install -y ca-certificates && rm -rf /var/lib/apt/lists/*
#6 1.381 Get:1 http://deb.debian.org/debian bullseye InRelease [116 kB]
#6 1.437 Get:2 http://deb.debian.org/debian-security bullseye-security InRelease [48.4 kB]
#6 1.466 Get:3 http://deb.debian.org/debian bullseye-updates InRelease [44.1 kB]
#6 2.065 Get:4 http://deb.debian.org/debian bullseye/main amd64 Packages [8183 kB]
#6 2.293 Get:5 http://deb.debian.org/debian-security bullseye-security/main amd64 Packages [236 kB]
#6 2.333 Get:6 http://deb.debian.org/debian bullseye-updates/main amd64 Packages [14.6 kB]
#6 3.632 Fetched 8642 kB in 2s (3689 kB/s)
#6 3.632 Reading package lists...
#6 4.344 Reading package lists...
#6 5.011 Building dependency tree...
#6 5.190 Reading state information...
#6 5.404 The following additional packages will be installed:
#6 5.405 openssl
#6 5.436 The following NEW packages will be installed:
#6 5.438 ca-certificates openssl
#6 5.541 0 upgraded, 2 newly installed, 0 to remove and 1 not upgraded.
#6 5.541 Need to get 1011 kB of archives.
#6 5.541 After this operation, 1892 kB of additional disk space will be used.
#6 5.541 Get:1 http://deb.debian.org/debian-security bullseye-security/main amd64 openssl amd64 1.1.1n-0+deb11u4 [853 kB]
#6 5.744 Get:2 http://deb.debian.org/debian bullseye/main amd64 ca-certificates all 20210119 [158 kB]
#6 6.422 debconf: delaying package configuration, since apt-utils is not installed
#6 6.465 Fetched 1011 kB in 0s (3337 kB/s)
#6 6.575 Selecting previously unselected package openssl.
#6 6.575 (Reading database ... (Reading database ... 5%(Reading database ... 10%(Reading database ... 15%(Reading database ... 20%(Reading database ... 25%(Reading database ... 30%(Reading database ... 35%(Reading database ... 40%(Reading database ... 45%(Reading database ... 50%(Reading database ... 55%(Reading database ... 60%(Reading database ... 65%(Reading database ... 70%(Reading database ... 75%(Reading database ... 80%(Reading database ... 85%(Reading database ... 90%(Reading database ... 95%(Reading database ... 100%(Reading database ... 6661 files and directories currently installed.)
#6 6.683 Preparing to unpack .../openssl_1.1.1n-0+deb11u4_amd64.deb ...
#6 6.688 Unpacking openssl (1.1.1n-0+deb11u4) ...
#6 6.812 Selecting previously unselected package ca-certificates.
#6 6.813 Preparing to unpack .../ca-certificates_20210119_all.deb ...
#6 6.817 Unpacking ca-certificates (20210119) ...
#6 6.892 Setting up openssl (1.1.1n-0+deb11u4) ...
#6 6.910 Setting up ca-certificates (20210119) ...
#6 7.799 Updating certificates in /etc/ssl/certs...
#6 8.692 129 added, 0 removed; done.
#6 8.767 Processing triggers for ca-certificates (20210119) ...
#6 8.777 Updating certificates in /etc/ssl/certs...
#6 9.396 0 added, 0 removed; done.
#6 9.396 Running hooks in /etc/ca-certificates/update.d...
#6 9.399 done.
#6 DONE 10.3s
#7 [3/8] ADD target/linux_amd64/boot /opt/apache/beam/
#7 DONE 0.3s
#8 [4/8] COPY target/LICENSE /opt/apache/beam/
#8 DONE 0.1s
#9 [5/8] COPY target/NOTICE /opt/apache/beam/
#9 DONE 0.1s
#10 [6/8] COPY target/LICENSE target/go-licenses/* /opt/apache/beam/third_party_licenses/golang/
#10 ERROR: lstat /var/lib/docker/tmp/buildkit-mount67086581/target/go-licenses: no such file or directory
------
> [6/8] COPY target/LICENSE target/go-licenses/* /opt/apache/beam/third_party_licenses/golang/:
> Task :sdks:go:container:docker FAILED
------
ERROR: failed to solve: lstat /var/lib/docker/tmp/buildkit-mount67086581/target/go-licenses: no such file or directory
FAILURE: Build failed with an exception.
* What went wrong:
Execution failed for task ':sdks:go:container:docker'.
> Process 'command 'docker'' finished with non-zero exit value 1
* Try:
> Run with --stacktrace option to get the stack trace.
> Run with --info or --debug option to get more log output.
16 actionable tasks: 5 executed, 11 up-to-date
* Get more help at https://help.gradle.org
Publishing build scan...
BUILD FAILED in 30s
https://gradle.com/s/65v2lynuzaiww
$ ./gradlew :sdks:go:container:docker -Pdocker-repository-root=us.gcr.io/apache-beam-testing/jenkins -Pdocker-tag=20230409-143456
> Task :goIntegrationTests FAILED
FAILURE: Build failed with an exception.
* What went wrong:
Execution failed for task ':goIntegrationTests'.
> Process 'command 'sh'' finished with non-zero exit value 1
* Try:
> Run with --stacktrace option to get the stack trace.
> Run with --info or --debug option to get more log output.
* Get more help at https://help.gradle.org
Deprecated Gradle features were used in this build, making it incompatible with Gradle 8.0.
You can use '--warning-mode all' to show the individual deprecation warnings and determine if they come from your own scripts or plugins.
See https://docs.gradle.org/7.5.1/userguide/command_line_interface.html#sec:command_line_warnings
BUILD FAILED in 1m 5s
91 actionable tasks: 55 executed, 34 from cache, 2 up-to-date
Publishing build scan...
https://gradle.com/s/kvwuklqw74e2m
Build step 'Invoke Gradle script' changed build result to FAILURE
Build step 'Invoke Gradle script' marked build as failure
---------------------------------------------------------------------
To unsubscribe, e-mail: builds-unsubscribe@beam.apache.org
For additional commands, e-mail: builds-help@beam.apache.org
Build failed in Jenkins: beam_PostCommit_Go #11147
Posted by Apache Jenkins Server <je...@builds.apache.org>.
See <https://ci-beam.apache.org/job/beam_PostCommit_Go/11147/display/redirect>
Changes:
------------------------------------------
[...truncated 25.27 KB...]
> Task :sdks:java:expansion-service:processResources NO-SOURCE
> Task :sdks:java:expansion-service:classes UP-TO-DATE
> Task :sdks:java:expansion-service:jar
> Task :sdks:java:extensions:arrow:createCheckerFrameworkManifest
> Task :sdks:java:extensions:arrow:compileJava FROM-CACHE
> Task :sdks:java:extensions:arrow:processResources NO-SOURCE
> Task :sdks:java:extensions:arrow:classes UP-TO-DATE
> Task :sdks:java:extensions:arrow:jar
> Task :sdks:java:extensions:protobuf:createCheckerFrameworkManifest
> Task :sdks:java:extensions:protobuf:extractIncludeProto
> Task :sdks:java:extensions:protobuf:extractProto
> Task :sdks:java:extensions:protobuf:generateProto NO-SOURCE
> Task :sdks:java:extensions:protobuf:compileJava FROM-CACHE
> Task :sdks:java:extensions:protobuf:processResources NO-SOURCE
> Task :sdks:java:extensions:protobuf:classes UP-TO-DATE
> Task :sdks:java:extensions:protobuf:jar
> Task :sdks:java:io:google-cloud-platform:createCheckerFrameworkManifest
> Task :sdks:java:io:google-cloud-platform:compileJava FROM-CACHE
> Task :sdks:java:io:google-cloud-platform:processResources NO-SOURCE
> Task :sdks:java:io:google-cloud-platform:classes UP-TO-DATE
> Task :sdks:java:io:google-cloud-platform:jar
> Task :sdks:java:io:kafka:createCheckerFrameworkManifest
> Task :sdks:java:io:kafka:compileJava FROM-CACHE
> Task :sdks:java:io:kafka:processResources NO-SOURCE
> Task :sdks:java:io:kafka:classes UP-TO-DATE
> Task :sdks:java:io:kafka:jar
> Task :runners:google-cloud-dataflow-java:compileJava FROM-CACHE
> Task :runners:google-cloud-dataflow-java:processResources
> Task :runners:google-cloud-dataflow-java:classes
> Task :runners:google-cloud-dataflow-java:jar
> Task :runners:google-cloud-dataflow-java:worker:createCheckerFrameworkManifest
> Task :runners:google-cloud-dataflow-java:worker:windmill:createCheckerFrameworkManifest
> Task :runners:google-cloud-dataflow-java:worker:windmill:extractIncludeProto
> Task :runners:google-cloud-dataflow-java:worker:windmill:extractProto
> Task :runners:google-cloud-dataflow-java:worker:windmill:generateProto FROM-CACHE
> Task :runners:google-cloud-dataflow-java:worker:windmill:compileJava FROM-CACHE
> Task :runners:google-cloud-dataflow-java:worker:windmill:processResources
> Task :runners:google-cloud-dataflow-java:worker:windmill:classes
> Task :runners:google-cloud-dataflow-java:worker:windmill:shadowJar FROM-CACHE
> Task :runners:google-cloud-dataflow-java:worker:compileJava FROM-CACHE
> Task :runners:google-cloud-dataflow-java:worker:processResources
> Task :runners:google-cloud-dataflow-java:worker:classes
> Task :runners:google-cloud-dataflow-java:worker:shadowJar FROM-CACHE
> Task :sdks:go:test:assemble UP-TO-DATE
> Task :sdks:go:test:test UP-TO-DATE
> Task :sdks:go:test:check UP-TO-DATE
> Task :sdks:go:test:build UP-TO-DATE
> Task :goIntegrationTests
$ CURRENT_DIRECTORY=<https://ci-beam.apache.org/job/beam_PostCommit_Go/ws/src/sdks/go/test>
$ TESTS=./test/integration/... ./test/regression
$ RUNNER=portable
$ TIMEOUT=3h
$ SIMULTANEOUS=3
$ GCS_LOCATION=gs://temp-storage-for-end-to-end-tests
$ GCS_SUBFOLDER=test7227
$ PROJECT=apache-beam-testing
$ DATAFLOW_PROJECT=apache-beam-testing
$ REGION=us-central1
$ trap exit_background_processes SIGINT SIGTERM EXIT
$ key=--runner
$ case --runner in
$ RUNNER=dataflow
$ cd <https://ci-beam.apache.org/job/beam_PostCommit_Go/ws/src>
$ test -d sdks/go/test
$ command -v docker
/usr/bin/docker
$ docker -v
Docker version 20.10.23, build 7155243
$ command -v gcloud
/usr/bin/gcloud
$ gcloud --version
Google Cloud SDK 406.0.0
alpha 2022.10.17
beta 2022.10.17
bq 2.0.79
bundled-python3-unix 3.9.12
core 2022.10.17
gcloud-crc32c 1.0.0
gsutil 5.14
$ TMPDIR=/tmp/tmp.O5Yhzm9Qtz
$ gcloud_ver=406.0.0
$ TAG=20230409-083455
$ CONTAINER=us.gcr.io/apache-beam-testing/jenkins/beam_go_sdk
Using container us.gcr.io/apache-beam-testing/jenkins/beam_go_sdk
$ ./gradlew :sdks:go:container:docker -Pdocker-repository-root=us.gcr.io/apache-beam-testing/jenkins -Pdocker-tag=20230409-083455
To honour the JVM settings for this build a single-use Daemon process will be forked. See https://docs.gradle.org/7.5.1/userguide/gradle_daemon.html#sec:disabling_the_daemon.
Daemon will be stopped at the end of the build
Configuration on demand is an incubating feature.
> Task :buildSrc:compileJava NO-SOURCE
> Task :buildSrc:compileGroovy UP-TO-DATE
> Task :buildSrc:pluginDescriptors UP-TO-DATE
> Task :buildSrc:processResources UP-TO-DATE
> Task :buildSrc:classes UP-TO-DATE
> Task :buildSrc:jar UP-TO-DATE
> Task :buildSrc:assemble UP-TO-DATE
> Task :buildSrc:spotlessGroovy UP-TO-DATE
> Task :buildSrc:spotlessGroovyCheck UP-TO-DATE
> Task :buildSrc:spotlessGroovyGradle UP-TO-DATE
> Task :buildSrc:spotlessGroovyGradleCheck UP-TO-DATE
> Task :buildSrc:spotlessCheck UP-TO-DATE
> Task :buildSrc:pluginUnderTestMetadata UP-TO-DATE
> Task :buildSrc:compileTestJava NO-SOURCE
> Task :buildSrc:compileTestGroovy NO-SOURCE
> Task :buildSrc:processTestResources NO-SOURCE
> Task :buildSrc:testClasses UP-TO-DATE
> Task :buildSrc:test NO-SOURCE
> Task :buildSrc:validatePlugins UP-TO-DATE
> Task :buildSrc:check UP-TO-DATE
> Task :buildSrc:build UP-TO-DATE
System Go installation: /snap/bin/go is go version go1.16.15 linux/amd64; Preparing to use /home/jenkins/go/bin/go1.20.2
GOCMD=/home/jenkins/go/bin/go1.20.2
go1.20.2: already downloaded in /home/jenkins/sdk/go1.20.2
> Task :sdks:go:container:copyLicenses
> Task :sdks:go:container:dockerClean UP-TO-DATE
> Task :sdks:go:container:goPrepare UP-TO-DATE
> Task :sdks:go:container:goBuild
/home/jenkins/go/bin/go1.20.2 build -o ./build/target/linux_amd64/boot boot.go boot_test.go
> Task :sdks:go:container:skipPullLicenses
> Task :sdks:go:container:dockerPrepare
#1 [internal] load build definition from Dockerfile
> Task :sdks:go:container:docker
#1 transferring dockerfile: 1.94kB done
#1 DONE 0.0s
#2 [internal] load .dockerignore
#2 transferring context: 2B done
#2 DONE 0.0s
#3 [internal] load metadata for docker.io/library/debian:bullseye
#3 DONE 0.3s
#4 [1/8] FROM docker.io/library/debian:bullseye@sha256:7b991788987ad860810df60927e1adbaf8e156520177bd4db82409f81dd3b721
#4 CACHED
#5 [internal] load build context
#5 transferring context: 22.20MB 0.2s done
#5 DONE 0.2s
#6 [2/8] RUN apt-get update && DEBIAN_FRONTEND=noninteractive apt-get install -y ca-certificates && rm -rf /var/lib/apt/lists/*
#6 1.518 Get:1 http://deb.debian.org/debian bullseye InRelease [116 kB]
#6 1.602 Get:2 http://deb.debian.org/debian-security bullseye-security InRelease [48.4 kB]
#6 1.648 Get:3 http://deb.debian.org/debian bullseye-updates InRelease [44.1 kB]
#6 2.160 Get:4 http://deb.debian.org/debian bullseye/main amd64 Packages [8183 kB]
#6 2.464 Get:5 http://deb.debian.org/debian-security bullseye-security/main amd64 Packages [236 kB]
#6 2.465 Get:6 http://deb.debian.org/debian bullseye-updates/main amd64 Packages [14.6 kB]
#6 3.769 Fetched 8642 kB in 2s (3609 kB/s)
#6 3.769 Reading package lists...
#6 4.442 Reading package lists...
#6 5.091 Building dependency tree...
#6 5.266 Reading state information...
#6 5.468 The following additional packages will be installed:
#6 5.468 openssl
#6 5.498 The following NEW packages will be installed:
#6 5.500 ca-certificates openssl
#6 5.588 0 upgraded, 2 newly installed, 0 to remove and 1 not upgraded.
#6 5.588 Need to get 1011 kB of archives.
#6 5.588 After this operation, 1892 kB of additional disk space will be used.
#6 5.588 Get:1 http://deb.debian.org/debian-security bullseye-security/main amd64 openssl amd64 1.1.1n-0+deb11u4 [853 kB]
#6 5.762 Get:2 http://deb.debian.org/debian bullseye/main amd64 ca-certificates all 20210119 [158 kB]
#6 6.188 debconf: delaying package configuration, since apt-utils is not installed
#6 6.225 Fetched 1011 kB in 0s (3932 kB/s)
#6 6.297 Selecting previously unselected package openssl.
#6 6.297 (Reading database ... (Reading database ... 5%(Reading database ... 10%(Reading database ... 15%(Reading database ... 20%(Reading database ... 25%(Reading database ... 30%(Reading database ... 35%(Reading database ... 40%(Reading database ... 45%(Reading database ... 50%(Reading database ... 55%(Reading database ... 60%(Reading database ... 65%(Reading database ... 70%(Reading database ... 75%(Reading database ... 80%(Reading database ... 85%(Reading database ... 90%(Reading database ... 95%(Reading database ... 100%(Reading database ... 6661 files and directories currently installed.)
#6 6.338 Preparing to unpack .../openssl_1.1.1n-0+deb11u4_amd64.deb ...
#6 6.343 Unpacking openssl (1.1.1n-0+deb11u4) ...
#6 6.465 Selecting previously unselected package ca-certificates.
#6 6.466 Preparing to unpack .../ca-certificates_20210119_all.deb ...
#6 6.470 Unpacking ca-certificates (20210119) ...
#6 6.547 Setting up openssl (1.1.1n-0+deb11u4) ...
#6 6.563 Setting up ca-certificates (20210119) ...
#6 7.321 Updating certificates in /etc/ssl/certs...
#6 8.123 129 added, 0 removed; done.
#6 8.192 Processing triggers for ca-certificates (20210119) ...
#6 8.202 Updating certificates in /etc/ssl/certs...
#6 8.804 0 added, 0 removed; done.
#6 8.804 Running hooks in /etc/ca-certificates/update.d...
#6 8.820 done.
#6 DONE 10.0s
#7 [3/8] ADD target/linux_amd64/boot /opt/apache/beam/
#7 DONE 0.3s
#8 [4/8] COPY target/LICENSE /opt/apache/beam/
#8 DONE 0.0s
#9 [5/8] COPY target/NOTICE /opt/apache/beam/
#9 DONE 0.1s
#10 [6/8] COPY target/LICENSE target/go-licenses/* /opt/apache/beam/third_party_licenses/golang/
> Task :sdks:go:container:docker FAILED
#10 ERROR: lstat /var/lib/docker/tmp/buildkit-mount1237302079/target/go-licenses: no such file or directory
------
> [6/8] COPY target/LICENSE target/go-licenses/* /opt/apache/beam/third_party_licenses/golang/:
------
ERROR: failed to solve: lstat /var/lib/docker/tmp/buildkit-mount1237302079/target/go-licenses: no such file or directory
FAILURE: Build failed with an exception.
* What went wrong:
Execution failed for task ':sdks:go:container:docker'.
> Process 'command 'docker'' finished with non-zero exit value 1
* Try:
> Run with --stacktrace option to get the stack trace.
> Run with --info or --debug option to get more log output.
16 actionable tasks: 5 executed, 11 up-to-date
* Get more help at https://help.gradle.org
Publishing build scan...
BUILD FAILED in 26s
https://gradle.com/s/oqbxww7rhucpu
$ ./gradlew :sdks:go:container:docker -Pdocker-repository-root=us.gcr.io/apache-beam-testing/jenkins -Pdocker-tag=20230409-083455
> Task :goIntegrationTests FAILED
FAILURE: Build failed with an exception.
* What went wrong:
Execution failed for task ':goIntegrationTests'.
> Process 'command 'sh'' finished with non-zero exit value 1
* Try:
> Run with --stacktrace option to get the stack trace.
> Run with --info or --debug option to get more log output.
* Get more help at https://help.gradle.org
Deprecated Gradle features were used in this build, making it incompatible with Gradle 8.0.
You can use '--warning-mode all' to show the individual deprecation warnings and determine if they come from your own scripts or plugins.
See https://docs.gradle.org/7.5.1/userguide/command_line_interface.html#sec:command_line_warnings
BUILD FAILED in 59s
91 actionable tasks: 55 executed, 34 from cache, 2 up-to-date
Publishing build scan...
https://gradle.com/s/paa5kps3rdeni
Build step 'Invoke Gradle script' changed build result to FAILURE
Build step 'Invoke Gradle script' marked build as failure
---------------------------------------------------------------------
To unsubscribe, e-mail: builds-unsubscribe@beam.apache.org
For additional commands, e-mail: builds-help@beam.apache.org
Build failed in Jenkins: beam_PostCommit_Go #11146
Posted by Apache Jenkins Server <je...@builds.apache.org>.
See <https://ci-beam.apache.org/job/beam_PostCommit_Go/11146/display/redirect>
Changes:
------------------------------------------
[...truncated 25.27 KB...]
> Task :sdks:java:expansion-service:processResources NO-SOURCE
> Task :sdks:java:expansion-service:classes UP-TO-DATE
> Task :sdks:java:expansion-service:jar
> Task :sdks:java:extensions:arrow:createCheckerFrameworkManifest
> Task :sdks:java:extensions:arrow:compileJava FROM-CACHE
> Task :sdks:java:extensions:arrow:processResources NO-SOURCE
> Task :sdks:java:extensions:arrow:classes UP-TO-DATE
> Task :sdks:java:extensions:arrow:jar
> Task :sdks:java:extensions:protobuf:createCheckerFrameworkManifest
> Task :sdks:java:extensions:protobuf:extractIncludeProto
> Task :sdks:java:extensions:protobuf:extractProto
> Task :sdks:java:extensions:protobuf:generateProto NO-SOURCE
> Task :sdks:java:extensions:protobuf:compileJava FROM-CACHE
> Task :sdks:java:extensions:protobuf:processResources NO-SOURCE
> Task :sdks:java:extensions:protobuf:classes UP-TO-DATE
> Task :sdks:java:extensions:protobuf:jar
> Task :sdks:java:io:google-cloud-platform:createCheckerFrameworkManifest
> Task :sdks:java:io:google-cloud-platform:compileJava FROM-CACHE
> Task :sdks:java:io:google-cloud-platform:processResources NO-SOURCE
> Task :sdks:java:io:google-cloud-platform:classes UP-TO-DATE
> Task :sdks:java:io:google-cloud-platform:jar
> Task :sdks:java:io:kafka:createCheckerFrameworkManifest
> Task :sdks:java:io:kafka:compileJava FROM-CACHE
> Task :sdks:java:io:kafka:processResources NO-SOURCE
> Task :sdks:java:io:kafka:classes UP-TO-DATE
> Task :sdks:java:io:kafka:jar
> Task :runners:google-cloud-dataflow-java:compileJava FROM-CACHE
> Task :runners:google-cloud-dataflow-java:processResources
> Task :runners:google-cloud-dataflow-java:classes
> Task :runners:google-cloud-dataflow-java:jar
> Task :runners:google-cloud-dataflow-java:worker:createCheckerFrameworkManifest
> Task :runners:google-cloud-dataflow-java:worker:windmill:createCheckerFrameworkManifest
> Task :runners:google-cloud-dataflow-java:worker:windmill:extractIncludeProto
> Task :runners:google-cloud-dataflow-java:worker:windmill:extractProto
> Task :runners:google-cloud-dataflow-java:worker:windmill:generateProto FROM-CACHE
> Task :runners:google-cloud-dataflow-java:worker:windmill:compileJava FROM-CACHE
> Task :runners:google-cloud-dataflow-java:worker:windmill:processResources
> Task :runners:google-cloud-dataflow-java:worker:windmill:classes
> Task :runners:google-cloud-dataflow-java:worker:windmill:shadowJar FROM-CACHE
> Task :runners:google-cloud-dataflow-java:worker:compileJava FROM-CACHE
> Task :runners:google-cloud-dataflow-java:worker:processResources
> Task :runners:google-cloud-dataflow-java:worker:classes
> Task :runners:google-cloud-dataflow-java:worker:shadowJar FROM-CACHE
> Task :sdks:go:test:assemble UP-TO-DATE
> Task :sdks:go:test:test UP-TO-DATE
> Task :sdks:go:test:check UP-TO-DATE
> Task :sdks:go:test:build UP-TO-DATE
> Task :goIntegrationTests
$ CURRENT_DIRECTORY=<https://ci-beam.apache.org/job/beam_PostCommit_Go/ws/src/sdks/go/test>
$ TESTS=./test/integration/... ./test/regression
$ RUNNER=portable
$ TIMEOUT=3h
$ SIMULTANEOUS=3
$ GCS_LOCATION=gs://temp-storage-for-end-to-end-tests
$ GCS_SUBFOLDER=test27938
$ PROJECT=apache-beam-testing
$ DATAFLOW_PROJECT=apache-beam-testing
$ REGION=us-central1
$ trap exit_background_processes SIGINT SIGTERM EXIT
$ key=--runner
$ case --runner in
$ RUNNER=dataflow
$ cd <https://ci-beam.apache.org/job/beam_PostCommit_Go/ws/src>
$ test -d sdks/go/test
$ command -v docker
/usr/bin/docker
$ docker -v
Docker version 20.10.23, build 7155243
$ command -v gcloud
/usr/bin/gcloud
$ gcloud --version
Google Cloud SDK 406.0.0
alpha 2022.10.17
beta 2022.10.17
bq 2.0.79
bundled-python3-unix 3.9.12
core 2022.10.17
gcloud-crc32c 1.0.0
gsutil 5.14
$ TMPDIR=/tmp/tmp.zbLqr48bOi
$ gcloud_ver=406.0.0
$ TAG=20230409-023457
$ CONTAINER=us.gcr.io/apache-beam-testing/jenkins/beam_go_sdk
Using container us.gcr.io/apache-beam-testing/jenkins/beam_go_sdk
$ ./gradlew :sdks:go:container:docker -Pdocker-repository-root=us.gcr.io/apache-beam-testing/jenkins -Pdocker-tag=20230409-023457
To honour the JVM settings for this build a single-use Daemon process will be forked. See https://docs.gradle.org/7.5.1/userguide/gradle_daemon.html#sec:disabling_the_daemon.
Daemon will be stopped at the end of the build
Configuration on demand is an incubating feature.
> Task :buildSrc:compileJava NO-SOURCE
> Task :buildSrc:compileGroovy UP-TO-DATE
> Task :buildSrc:pluginDescriptors UP-TO-DATE
> Task :buildSrc:processResources UP-TO-DATE
> Task :buildSrc:classes UP-TO-DATE
> Task :buildSrc:jar UP-TO-DATE
> Task :buildSrc:assemble UP-TO-DATE
> Task :buildSrc:spotlessGroovy UP-TO-DATE
> Task :buildSrc:spotlessGroovyCheck UP-TO-DATE
> Task :buildSrc:spotlessGroovyGradle UP-TO-DATE
> Task :buildSrc:spotlessGroovyGradleCheck UP-TO-DATE
> Task :buildSrc:spotlessCheck UP-TO-DATE
> Task :buildSrc:pluginUnderTestMetadata UP-TO-DATE
> Task :buildSrc:compileTestJava NO-SOURCE
> Task :buildSrc:compileTestGroovy NO-SOURCE
> Task :buildSrc:processTestResources NO-SOURCE
> Task :buildSrc:testClasses UP-TO-DATE
> Task :buildSrc:test NO-SOURCE
> Task :buildSrc:validatePlugins UP-TO-DATE
> Task :buildSrc:check UP-TO-DATE
> Task :buildSrc:build UP-TO-DATE
System Go installation: /snap/bin/go is go version go1.16.15 linux/amd64; Preparing to use /home/jenkins/go/bin/go1.20.2
GOCMD=/home/jenkins/go/bin/go1.20.2
go1.20.2: already downloaded in /home/jenkins/sdk/go1.20.2
> Task :sdks:go:container:copyLicenses
> Task :sdks:go:container:dockerClean UP-TO-DATE
> Task :sdks:go:container:goPrepare UP-TO-DATE
> Task :sdks:go:container:goBuild
/home/jenkins/go/bin/go1.20.2 build -o ./build/target/linux_amd64/boot boot.go boot_test.go
> Task :sdks:go:container:skipPullLicenses
> Task :sdks:go:container:dockerPrepare
#1 [internal] load build definition from Dockerfile
> Task :sdks:go:container:docker
#1 transferring dockerfile: 1.94kB done
#1 DONE 0.0s
#2 [internal] load .dockerignore
#2 transferring context: 2B done
#2 DONE 0.0s
#3 [internal] load metadata for docker.io/library/debian:bullseye
#3 DONE 0.3s
#4 [1/8] FROM docker.io/library/debian:bullseye@sha256:7b991788987ad860810df60927e1adbaf8e156520177bd4db82409f81dd3b721
#4 CACHED
#5 [internal] load build context
#5 transferring context: 22.20MB 0.2s done
#5 DONE 0.2s
#6 [2/8] RUN apt-get update && DEBIAN_FRONTEND=noninteractive apt-get install -y ca-certificates && rm -rf /var/lib/apt/lists/*
#6 1.678 Get:1 http://deb.debian.org/debian bullseye InRelease [116 kB]
#6 1.739 Get:2 http://deb.debian.org/debian-security bullseye-security InRelease [48.4 kB]
#6 1.764 Get:3 http://deb.debian.org/debian bullseye-updates InRelease [44.1 kB]
#6 2.302 Get:4 http://deb.debian.org/debian bullseye/main amd64 Packages [8183 kB]
#6 2.529 Get:5 http://deb.debian.org/debian-security bullseye-security/main amd64 Packages [236 kB]
#6 2.564 Get:6 http://deb.debian.org/debian bullseye-updates/main amd64 Packages [14.6 kB]
#6 3.877 Fetched 8642 kB in 2s (3793 kB/s)
#6 3.877 Reading package lists...
#6 4.638 Reading package lists...
#6 5.289 Building dependency tree...
#6 5.461 Reading state information...
#6 5.644 The following additional packages will be installed:
#6 5.644 openssl
#6 5.674 The following NEW packages will be installed:
#6 5.675 ca-certificates openssl
#6 5.787 0 upgraded, 2 newly installed, 0 to remove and 1 not upgraded.
#6 5.787 Need to get 1011 kB of archives.
#6 5.787 After this operation, 1892 kB of additional disk space will be used.
#6 5.787 Get:1 http://deb.debian.org/debian-security bullseye-security/main amd64 openssl amd64 1.1.1n-0+deb11u4 [853 kB]
#6 5.990 Get:2 http://deb.debian.org/debian bullseye/main amd64 ca-certificates all 20210119 [158 kB]
#6 6.668 debconf: delaying package configuration, since apt-utils is not installed
#6 6.708 Fetched 1011 kB in 0s (3263 kB/s)
#6 6.815 Selecting previously unselected package openssl.
#6 6.815 (Reading database ... (Reading database ... 5%(Reading database ... 10%(Reading database ... 15%(Reading database ... 20%(Reading database ... 25%(Reading database ... 30%(Reading database ... 35%(Reading database ... 40%(Reading database ... 45%(Reading database ... 50%(Reading database ... 55%(Reading database ... 60%(Reading database ... 65%(Reading database ... 70%(Reading database ... 75%(Reading database ... 80%(Reading database ... 85%(Reading database ... 90%(Reading database ... 95%(Reading database ... 100%(Reading database ... 6661 files and directories currently installed.)
#6 6.887 Preparing to unpack .../openssl_1.1.1n-0+deb11u4_amd64.deb ...
#6 6.891 Unpacking openssl (1.1.1n-0+deb11u4) ...
#6 7.011 Selecting previously unselected package ca-certificates.
#6 7.012 Preparing to unpack .../ca-certificates_20210119_all.deb ...
#6 7.016 Unpacking ca-certificates (20210119) ...
#6 7.089 Setting up openssl (1.1.1n-0+deb11u4) ...
#6 7.108 Setting up ca-certificates (20210119) ...
#6 7.886 Updating certificates in /etc/ssl/certs...
#6 8.684 129 added, 0 removed; done.
#6 8.737 Processing triggers for ca-certificates (20210119) ...
#6 8.746 Updating certificates in /etc/ssl/certs...
#6 9.337 0 added, 0 removed; done.
#6 9.337 Running hooks in /etc/ca-certificates/update.d...
#6 9.340 done.
#6 DONE 10.5s
#7 [3/8] ADD target/linux_amd64/boot /opt/apache/beam/
#7 DONE 0.3s
#8 [4/8] COPY target/LICENSE /opt/apache/beam/
#8 DONE 0.1s
#9 [5/8] COPY target/NOTICE /opt/apache/beam/
#9 DONE 0.1s
#10 [6/8] COPY target/LICENSE target/go-licenses/* /opt/apache/beam/third_party_licenses/golang/
#10 ERROR: lstat /var/lib/docker/tmp/buildkit-mount2967482570/target/go-licenses: no such file or directory
------
> Task :sdks:go:container:docker FAILED > [6/8] COPY target/LICENSE target/go-licenses/* /opt/apache/beam/third_party_licenses/golang/:
------
ERROR: failed to solve: lstat /var/lib/docker/tmp/buildkit-mount2967482570/target/go-licenses: no such file or directory
FAILURE: Build failed with an exception.
* What went wrong:
Execution failed for task ':sdks:go:container:docker'.
> Process 'command 'docker'' finished with non-zero exit value 1
* Try:
> Run with --stacktrace option to get the stack trace.
> Run with --info or --debug option to get more log output.
* Get more help at https://help.gradle.org
BUILD FAILED in 27s
16 actionable tasks: 5 executed, 11 up-to-date
Publishing build scan...
https://gradle.com/s/g43mv6khewfmm
$ ./gradlew :sdks:go:container:docker -Pdocker-repository-root=us.gcr.io/apache-beam-testing/jenkins -Pdocker-tag=20230409-023457
> Task :goIntegrationTests FAILED
FAILURE: Build failed with an exception.
* What went wrong:
Execution failed for task ':goIntegrationTests'.
> Process 'command 'sh'' finished with non-zero exit value 1
* Try:
> Run with --stacktrace option to get the stack trace.
> Run with --info or --debug option to get more log output.
* Get more help at https://help.gradle.org
Deprecated Gradle features were used in this build, making it incompatible with Gradle 8.0.
You can use '--warning-mode all' to show the individual deprecation warnings and determine if they come from your own scripts or plugins.
See https://docs.gradle.org/7.5.1/userguide/command_line_interface.html#sec:command_line_warnings
BUILD FAILED in 1m
91 actionable tasks: 55 executed, 34 from cache, 2 up-to-date
Publishing build scan...
https://gradle.com/s/5ueyi3dveifwe
Build step 'Invoke Gradle script' changed build result to FAILURE
Build step 'Invoke Gradle script' marked build as failure
---------------------------------------------------------------------
To unsubscribe, e-mail: builds-unsubscribe@beam.apache.org
For additional commands, e-mail: builds-help@beam.apache.org
Build failed in Jenkins: beam_PostCommit_Go #11145
Posted by Apache Jenkins Server <je...@builds.apache.org>.
See <https://ci-beam.apache.org/job/beam_PostCommit_Go/11145/display/redirect>
Changes:
------------------------------------------
[...truncated 25.27 KB...]
> Task :sdks:java:expansion-service:processResources NO-SOURCE
> Task :sdks:java:expansion-service:classes UP-TO-DATE
> Task :sdks:java:expansion-service:jar
> Task :sdks:java:extensions:arrow:createCheckerFrameworkManifest
> Task :sdks:java:extensions:arrow:compileJava FROM-CACHE
> Task :sdks:java:extensions:arrow:processResources NO-SOURCE
> Task :sdks:java:extensions:arrow:classes UP-TO-DATE
> Task :sdks:java:extensions:arrow:jar
> Task :sdks:java:extensions:protobuf:createCheckerFrameworkManifest
> Task :sdks:java:extensions:protobuf:extractIncludeProto
> Task :sdks:java:extensions:protobuf:extractProto
> Task :sdks:java:extensions:protobuf:generateProto NO-SOURCE
> Task :sdks:java:extensions:protobuf:compileJava FROM-CACHE
> Task :sdks:java:extensions:protobuf:processResources NO-SOURCE
> Task :sdks:java:extensions:protobuf:classes UP-TO-DATE
> Task :sdks:java:extensions:protobuf:jar
> Task :sdks:java:io:google-cloud-platform:createCheckerFrameworkManifest
> Task :sdks:java:io:google-cloud-platform:compileJava FROM-CACHE
> Task :sdks:java:io:google-cloud-platform:processResources NO-SOURCE
> Task :sdks:java:io:google-cloud-platform:classes UP-TO-DATE
> Task :sdks:java:io:google-cloud-platform:jar
> Task :sdks:java:io:kafka:createCheckerFrameworkManifest
> Task :sdks:java:io:kafka:compileJava FROM-CACHE
> Task :sdks:java:io:kafka:processResources NO-SOURCE
> Task :sdks:java:io:kafka:classes UP-TO-DATE
> Task :sdks:java:io:kafka:jar
> Task :runners:google-cloud-dataflow-java:processResources
> Task :runners:google-cloud-dataflow-java:compileJava FROM-CACHE
> Task :runners:google-cloud-dataflow-java:classes
> Task :runners:google-cloud-dataflow-java:jar
> Task :runners:google-cloud-dataflow-java:worker:createCheckerFrameworkManifest
> Task :runners:google-cloud-dataflow-java:worker:windmill:createCheckerFrameworkManifest
> Task :runners:google-cloud-dataflow-java:worker:windmill:extractIncludeProto
> Task :runners:google-cloud-dataflow-java:worker:windmill:extractProto
> Task :runners:google-cloud-dataflow-java:worker:windmill:generateProto FROM-CACHE
> Task :runners:google-cloud-dataflow-java:worker:windmill:compileJava FROM-CACHE
> Task :runners:google-cloud-dataflow-java:worker:windmill:processResources
> Task :runners:google-cloud-dataflow-java:worker:windmill:classes
> Task :runners:google-cloud-dataflow-java:worker:windmill:shadowJar FROM-CACHE
> Task :runners:google-cloud-dataflow-java:worker:compileJava FROM-CACHE
> Task :runners:google-cloud-dataflow-java:worker:processResources
> Task :runners:google-cloud-dataflow-java:worker:classes
> Task :runners:google-cloud-dataflow-java:worker:shadowJar FROM-CACHE
> Task :sdks:go:test:assemble UP-TO-DATE
> Task :sdks:go:test:test UP-TO-DATE
> Task :sdks:go:test:check UP-TO-DATE
> Task :sdks:go:test:build UP-TO-DATE
> Task :goIntegrationTests
$ CURRENT_DIRECTORY=<https://ci-beam.apache.org/job/beam_PostCommit_Go/ws/src/sdks/go/test>
$ TESTS=./test/integration/... ./test/regression
$ RUNNER=portable
$ TIMEOUT=3h
$ SIMULTANEOUS=3
$ GCS_LOCATION=gs://temp-storage-for-end-to-end-tests
$ GCS_SUBFOLDER=test16163
$ PROJECT=apache-beam-testing
$ DATAFLOW_PROJECT=apache-beam-testing
$ REGION=us-central1
$ trap exit_background_processes SIGINT SIGTERM EXIT
$ key=--runner
$ case --runner in
$ RUNNER=dataflow
$ cd <https://ci-beam.apache.org/job/beam_PostCommit_Go/ws/src>
$ test -d sdks/go/test
$ command -v docker
/usr/bin/docker
$ docker -v
Docker version 20.10.23, build 7155243
$ command -v gcloud
/usr/bin/gcloud
$ gcloud --version
Google Cloud SDK 406.0.0
alpha 2022.10.17
beta 2022.10.17
bq 2.0.79
bundled-python3-unix 3.9.12
core 2022.10.17
gcloud-crc32c 1.0.0
gsutil 5.14
$ TMPDIR=/tmp/tmp.j5sNzxcuY0
$ gcloud_ver=406.0.0
$ TAG=20230408-203500
$ CONTAINER=us.gcr.io/apache-beam-testing/jenkins/beam_go_sdk
Using container us.gcr.io/apache-beam-testing/jenkins/beam_go_sdk
$ ./gradlew :sdks:go:container:docker -Pdocker-repository-root=us.gcr.io/apache-beam-testing/jenkins -Pdocker-tag=20230408-203500
To honour the JVM settings for this build a single-use Daemon process will be forked. See https://docs.gradle.org/7.5.1/userguide/gradle_daemon.html#sec:disabling_the_daemon.
Daemon will be stopped at the end of the build
Configuration on demand is an incubating feature.
> Task :buildSrc:compileJava NO-SOURCE
> Task :buildSrc:compileGroovy UP-TO-DATE
> Task :buildSrc:pluginDescriptors UP-TO-DATE
> Task :buildSrc:processResources UP-TO-DATE
> Task :buildSrc:classes UP-TO-DATE
> Task :buildSrc:jar UP-TO-DATE
> Task :buildSrc:assemble UP-TO-DATE
> Task :buildSrc:spotlessGroovy UP-TO-DATE
> Task :buildSrc:spotlessGroovyCheck UP-TO-DATE
> Task :buildSrc:spotlessGroovyGradle UP-TO-DATE
> Task :buildSrc:spotlessGroovyGradleCheck UP-TO-DATE
> Task :buildSrc:spotlessCheck UP-TO-DATE
> Task :buildSrc:pluginUnderTestMetadata UP-TO-DATE
> Task :buildSrc:compileTestJava NO-SOURCE
> Task :buildSrc:compileTestGroovy NO-SOURCE
> Task :buildSrc:processTestResources NO-SOURCE
> Task :buildSrc:testClasses UP-TO-DATE
> Task :buildSrc:test NO-SOURCE
> Task :buildSrc:validatePlugins UP-TO-DATE
> Task :buildSrc:check UP-TO-DATE
> Task :buildSrc:build UP-TO-DATE
System Go installation: /snap/bin/go is go version go1.16.15 linux/amd64; Preparing to use /home/jenkins/go/bin/go1.20.2
GOCMD=/home/jenkins/go/bin/go1.20.2
go1.20.2: already downloaded in /home/jenkins/sdk/go1.20.2
> Task :sdks:go:container:copyLicenses
> Task :sdks:go:container:dockerClean UP-TO-DATE
> Task :sdks:go:container:goPrepare UP-TO-DATE
> Task :sdks:go:container:goBuild
/home/jenkins/go/bin/go1.20.2 build -o ./build/target/linux_amd64/boot boot.go boot_test.go
> Task :sdks:go:container:skipPullLicenses
> Task :sdks:go:container:dockerPrepare
#1 [internal] load build definition from Dockerfile
> Task :sdks:go:container:docker
#1 transferring dockerfile: 1.94kB done
#1 DONE 0.0s
#2 [internal] load .dockerignore
#2 transferring context: 2B done
#2 DONE 0.0s
#3 [internal] load metadata for docker.io/library/debian:bullseye
#3 DONE 0.3s
#4 [1/8] FROM docker.io/library/debian:bullseye@sha256:7b991788987ad860810df60927e1adbaf8e156520177bd4db82409f81dd3b721
#4 CACHED
#5 [internal] load build context
#5 transferring context: 22.20MB 0.2s done
#5 DONE 0.2s
#6 [2/8] RUN apt-get update && DEBIAN_FRONTEND=noninteractive apt-get install -y ca-certificates && rm -rf /var/lib/apt/lists/*
#6 0.460 Get:1 http://deb.debian.org/debian bullseye InRelease [116 kB]
#6 0.537 Get:2 http://deb.debian.org/debian-security bullseye-security InRelease [48.4 kB]
#6 0.566 Get:3 http://deb.debian.org/debian bullseye-updates InRelease [44.1 kB]
#6 0.700 Get:4 http://deb.debian.org/debian bullseye/main amd64 Packages [8183 kB]
#6 0.899 Get:5 http://deb.debian.org/debian-security bullseye-security/main amd64 Packages [236 kB]
#6 0.964 Get:6 http://deb.debian.org/debian bullseye-updates/main amd64 Packages [14.6 kB]
#6 2.194 Fetched 8642 kB in 2s (4791 kB/s)
#6 2.194 Reading package lists...
#6 2.882 Reading package lists...
#6 3.537 Building dependency tree...
#6 3.704 Reading state information...
#6 3.884 The following additional packages will be installed:
#6 3.884 openssl
#6 3.914 The following NEW packages will be installed:
#6 3.915 ca-certificates openssl
#6 3.990 0 upgraded, 2 newly installed, 0 to remove and 1 not upgraded.
#6 3.990 Need to get 1011 kB of archives.
#6 3.990 After this operation, 1892 kB of additional disk space will be used.
#6 3.990 Get:1 http://deb.debian.org/debian-security bullseye-security/main amd64 openssl amd64 1.1.1n-0+deb11u4 [853 kB]
#6 4.132 Get:2 http://deb.debian.org/debian bullseye/main amd64 ca-certificates all 20210119 [158 kB]
#6 4.293 debconf: delaying package configuration, since apt-utils is not installed
#6 4.330 Fetched 1011 kB in 0s (4777 kB/s)
#6 4.358 Selecting previously unselected package openssl.
#6 4.358 (Reading database ... (Reading database ... 5%(Reading database ... 10%(Reading database ... 15%(Reading database ... 20%(Reading database ... 25%(Reading database ... 30%(Reading database ... 35%(Reading database ... 40%(Reading database ... 45%(Reading database ... 50%(Reading database ... 55%(Reading database ... 60%(Reading database ... 65%(Reading database ... 70%(Reading database ... 75%(Reading database ... 80%(Reading database ... 85%(Reading database ... 90%(Reading database ... 95%(Reading database ... 100%(Reading database ... 6661 files and directories currently installed.)
#6 4.368 Preparing to unpack .../openssl_1.1.1n-0+deb11u4_amd64.deb ...
#6 4.373 Unpacking openssl (1.1.1n-0+deb11u4) ...
#6 4.492 Selecting previously unselected package ca-certificates.
#6 4.494 Preparing to unpack .../ca-certificates_20210119_all.deb ...
#6 4.498 Unpacking ca-certificates (20210119) ...
#6 4.569 Setting up openssl (1.1.1n-0+deb11u4) ...
#6 4.589 Setting up ca-certificates (20210119) ...
#6 5.206 Updating certificates in /etc/ssl/certs...
#6 5.950 129 added, 0 removed; done.
#6 5.998 Processing triggers for ca-certificates (20210119) ...
#6 6.007 Updating certificates in /etc/ssl/certs...
#6 6.607 0 added, 0 removed; done.
#6 6.607 Running hooks in /etc/ca-certificates/update.d...
#6 6.608 done.
#6 DONE 7.8s
#7 [3/8] ADD target/linux_amd64/boot /opt/apache/beam/
#7 DONE 0.3s
#8 [4/8] COPY target/LICENSE /opt/apache/beam/
#8 DONE 0.1s
#9 [5/8] COPY target/NOTICE /opt/apache/beam/
#9 DONE 0.1s
#10 [6/8] COPY target/LICENSE target/go-licenses/* /opt/apache/beam/third_party_licenses/golang/
#10 ERROR: lstat /var/lib/docker/tmp/buildkit-mount276769111/target/go-licenses: no such file or directory
------
> [6/8] COPY target/LICENSE target/go-licenses/* /opt/apache/beam/third_party_licenses/golang/:
------
ERROR: failed to solve: lstat /var/lib/docker/tmp/buildkit-mount276769111/target/go-licenses: no such file or directory
> Task :sdks:go:container:docker FAILED
FAILURE: Build failed with an exception.
16 actionable tasks: 5 executed, 11 up-to-date
* What went wrong:
Execution failed for task ':sdks:go:container:docker'.
> Process 'command 'docker'' finished with non-zero exit value 1
* Try:
> Run with --stacktrace option to get the stack trace.
> Run with --info or --debug option to get more log output.
* Get more help at https://help.gradle.org
BUILD FAILED in 24s
Publishing build scan...
https://gradle.com/s/jtcxidfjyztu2
$ ./gradlew :sdks:go:container:docker -Pdocker-repository-root=us.gcr.io/apache-beam-testing/jenkins -Pdocker-tag=20230408-203500
> Task :goIntegrationTests FAILED
FAILURE: Build failed with an exception.
* What went wrong:
Execution failed for task ':goIntegrationTests'.
> Process 'command 'sh'' finished with non-zero exit value 1
* Try:
> Run with --stacktrace option to get the stack trace.
> Run with --info or --debug option to get more log output.
* Get more help at https://help.gradle.org
Deprecated Gradle features were used in this build, making it incompatible with Gradle 8.0.
You can use '--warning-mode all' to show the individual deprecation warnings and determine if they come from your own scripts or plugins.
See https://docs.gradle.org/7.5.1/userguide/command_line_interface.html#sec:command_line_warnings
BUILD FAILED in 57s
91 actionable tasks: 55 executed, 34 from cache, 2 up-to-date
Publishing build scan...
https://gradle.com/s/qxibydnnujock
Build step 'Invoke Gradle script' changed build result to FAILURE
Build step 'Invoke Gradle script' marked build as failure
---------------------------------------------------------------------
To unsubscribe, e-mail: builds-unsubscribe@beam.apache.org
For additional commands, e-mail: builds-help@beam.apache.org
Build failed in Jenkins: beam_PostCommit_Go #11144
Posted by Apache Jenkins Server <je...@builds.apache.org>.
See <https://ci-beam.apache.org/job/beam_PostCommit_Go/11144/display/redirect?page=changes>
Changes:
[noreply] Merge pull request #26096: Allow to set operator chaining for flink
------------------------------------------
[...truncated 25.27 KB...]
> Task :sdks:java:expansion-service:processResources NO-SOURCE
> Task :sdks:java:expansion-service:classes UP-TO-DATE
> Task :sdks:java:expansion-service:jar
> Task :sdks:java:extensions:arrow:createCheckerFrameworkManifest
> Task :sdks:java:extensions:arrow:compileJava FROM-CACHE
> Task :sdks:java:extensions:arrow:processResources NO-SOURCE
> Task :sdks:java:extensions:arrow:classes UP-TO-DATE
> Task :sdks:java:extensions:arrow:jar
> Task :sdks:java:extensions:protobuf:createCheckerFrameworkManifest
> Task :sdks:java:extensions:protobuf:extractIncludeProto
> Task :sdks:java:extensions:protobuf:extractProto
> Task :sdks:java:extensions:protobuf:generateProto NO-SOURCE
> Task :sdks:java:extensions:protobuf:compileJava FROM-CACHE
> Task :sdks:java:extensions:protobuf:processResources NO-SOURCE
> Task :sdks:java:extensions:protobuf:classes UP-TO-DATE
> Task :sdks:java:extensions:protobuf:jar
> Task :sdks:java:io:google-cloud-platform:createCheckerFrameworkManifest
> Task :sdks:java:io:google-cloud-platform:compileJava FROM-CACHE
> Task :sdks:java:io:google-cloud-platform:processResources NO-SOURCE
> Task :sdks:java:io:google-cloud-platform:classes UP-TO-DATE
> Task :sdks:java:io:google-cloud-platform:jar
> Task :sdks:java:io:kafka:createCheckerFrameworkManifest
> Task :sdks:java:io:kafka:compileJava FROM-CACHE
> Task :sdks:java:io:kafka:processResources NO-SOURCE
> Task :sdks:java:io:kafka:classes UP-TO-DATE
> Task :sdks:java:io:kafka:jar
> Task :runners:google-cloud-dataflow-java:compileJava FROM-CACHE
> Task :runners:google-cloud-dataflow-java:processResources
> Task :runners:google-cloud-dataflow-java:classes
> Task :runners:google-cloud-dataflow-java:jar
> Task :runners:google-cloud-dataflow-java:worker:createCheckerFrameworkManifest
> Task :runners:google-cloud-dataflow-java:worker:windmill:createCheckerFrameworkManifest
> Task :runners:google-cloud-dataflow-java:worker:windmill:extractIncludeProto
> Task :runners:google-cloud-dataflow-java:worker:windmill:extractProto
> Task :runners:google-cloud-dataflow-java:worker:windmill:generateProto FROM-CACHE
> Task :runners:google-cloud-dataflow-java:worker:windmill:compileJava FROM-CACHE
> Task :runners:google-cloud-dataflow-java:worker:windmill:processResources
> Task :runners:google-cloud-dataflow-java:worker:windmill:classes
> Task :runners:google-cloud-dataflow-java:worker:windmill:shadowJar FROM-CACHE
> Task :runners:google-cloud-dataflow-java:worker:compileJava FROM-CACHE
> Task :runners:google-cloud-dataflow-java:worker:processResources
> Task :runners:google-cloud-dataflow-java:worker:classes
> Task :runners:google-cloud-dataflow-java:worker:shadowJar FROM-CACHE
> Task :sdks:go:test:assemble UP-TO-DATE
> Task :sdks:go:test:test UP-TO-DATE
> Task :sdks:go:test:check UP-TO-DATE
> Task :sdks:go:test:build UP-TO-DATE
> Task :goIntegrationTests
$ CURRENT_DIRECTORY=<https://ci-beam.apache.org/job/beam_PostCommit_Go/ws/src/sdks/go/test>
$ TESTS=./test/integration/... ./test/regression
$ RUNNER=portable
$ TIMEOUT=3h
$ SIMULTANEOUS=3
$ GCS_LOCATION=gs://temp-storage-for-end-to-end-tests
$ GCS_SUBFOLDER=test11849
$ PROJECT=apache-beam-testing
$ DATAFLOW_PROJECT=apache-beam-testing
$ REGION=us-central1
$ trap exit_background_processes SIGINT SIGTERM EXIT
$ key=--runner
$ case --runner in
$ RUNNER=dataflow
$ cd <https://ci-beam.apache.org/job/beam_PostCommit_Go/ws/src>
$ test -d sdks/go/test
$ command -v docker
/usr/bin/docker
$ docker -v
Docker version 20.10.23, build 7155243
$ command -v gcloud
/usr/bin/gcloud
$ gcloud --version
Google Cloud SDK 406.0.0
alpha 2022.10.17
beta 2022.10.17
bq 2.0.79
bundled-python3-unix 3.9.12
core 2022.10.17
gcloud-crc32c 1.0.0
gsutil 5.14
$ TMPDIR=/tmp/tmp.JD3RpsS2DK
$ gcloud_ver=406.0.0
$ TAG=20230408-143456
$ CONTAINER=us.gcr.io/apache-beam-testing/jenkins/beam_go_sdk
Using container us.gcr.io/apache-beam-testing/jenkins/beam_go_sdk
$ ./gradlew :sdks:go:container:docker -Pdocker-repository-root=us.gcr.io/apache-beam-testing/jenkins -Pdocker-tag=20230408-143456
To honour the JVM settings for this build a single-use Daemon process will be forked. See https://docs.gradle.org/7.5.1/userguide/gradle_daemon.html#sec:disabling_the_daemon.
Daemon will be stopped at the end of the build
Configuration on demand is an incubating feature.
> Task :buildSrc:compileJava NO-SOURCE
> Task :buildSrc:compileGroovy UP-TO-DATE
> Task :buildSrc:pluginDescriptors UP-TO-DATE
> Task :buildSrc:processResources UP-TO-DATE
> Task :buildSrc:classes UP-TO-DATE
> Task :buildSrc:jar UP-TO-DATE
> Task :buildSrc:assemble UP-TO-DATE
> Task :buildSrc:spotlessGroovy UP-TO-DATE
> Task :buildSrc:spotlessGroovyCheck UP-TO-DATE
> Task :buildSrc:spotlessGroovyGradle UP-TO-DATE
> Task :buildSrc:spotlessGroovyGradleCheck UP-TO-DATE
> Task :buildSrc:spotlessCheck UP-TO-DATE
> Task :buildSrc:pluginUnderTestMetadata UP-TO-DATE
> Task :buildSrc:compileTestJava NO-SOURCE
> Task :buildSrc:compileTestGroovy NO-SOURCE
> Task :buildSrc:processTestResources NO-SOURCE
> Task :buildSrc:testClasses UP-TO-DATE
> Task :buildSrc:test NO-SOURCE
> Task :buildSrc:validatePlugins UP-TO-DATE
> Task :buildSrc:check UP-TO-DATE
> Task :buildSrc:build UP-TO-DATE
System Go installation: /snap/bin/go is go version go1.16.15 linux/amd64; Preparing to use /home/jenkins/go/bin/go1.20.2
GOCMD=/home/jenkins/go/bin/go1.20.2
go1.20.2: already downloaded in /home/jenkins/sdk/go1.20.2
> Task :sdks:go:container:copyLicenses
> Task :sdks:go:container:dockerClean UP-TO-DATE
> Task :sdks:go:container:goPrepare UP-TO-DATE
> Task :sdks:go:container:goBuild
/home/jenkins/go/bin/go1.20.2 build -o ./build/target/linux_amd64/boot boot.go boot_test.go
> Task :sdks:go:container:skipPullLicenses
> Task :sdks:go:container:dockerPrepare
#1 [internal] load build definition from Dockerfile
> Task :sdks:go:container:docker
#1 transferring dockerfile: 1.94kB done
#1 DONE 0.0s
#2 [internal] load .dockerignore
#2 transferring context: 2B done
#2 DONE 0.0s
#3 [internal] load metadata for docker.io/library/debian:bullseye
#3 DONE 0.3s
#4 [1/8] FROM docker.io/library/debian:bullseye@sha256:7b991788987ad860810df60927e1adbaf8e156520177bd4db82409f81dd3b721
#4 CACHED
#5 [internal] load build context
#5 transferring context: 22.20MB 0.2s done
#5 DONE 0.2s
#6 [2/8] RUN apt-get update && DEBIAN_FRONTEND=noninteractive apt-get install -y ca-certificates && rm -rf /var/lib/apt/lists/*
#6 1.309 Get:1 http://deb.debian.org/debian bullseye InRelease [116 kB]
#6 1.362 Get:2 http://deb.debian.org/debian-security bullseye-security InRelease [48.4 kB]
#6 1.369 Get:3 http://deb.debian.org/debian bullseye-updates InRelease [44.1 kB]
#6 1.726 Get:4 http://deb.debian.org/debian bullseye/main amd64 Packages [8183 kB]
#6 1.945 Get:5 http://deb.debian.org/debian-security bullseye-security/main amd64 Packages [236 kB]
#6 1.990 Get:6 http://deb.debian.org/debian bullseye-updates/main amd64 Packages [14.6 kB]
#6 3.247 Fetched 8642 kB in 2s (4219 kB/s)
#6 3.247 Reading package lists...
#6 3.947 Reading package lists...
#6 4.609 Building dependency tree...
#6 4.776 Reading state information...
#6 5.006 The following additional packages will be installed:
#6 5.007 openssl
#6 5.036 The following NEW packages will be installed:
#6 5.037 ca-certificates openssl
#6 5.110 0 upgraded, 2 newly installed, 0 to remove and 1 not upgraded.
#6 5.110 Need to get 1011 kB of archives.
#6 5.110 After this operation, 1892 kB of additional disk space will be used.
#6 5.110 Get:1 http://deb.debian.org/debian-security bullseye-security/main amd64 openssl amd64 1.1.1n-0+deb11u4 [853 kB]
#6 5.249 Get:2 http://deb.debian.org/debian bullseye/main amd64 ca-certificates all 20210119 [158 kB]
#6 5.961 debconf: delaying package configuration, since apt-utils is not installed
#6 6.013 Fetched 1011 kB in 0s (4875 kB/s)
#6 6.119 Selecting previously unselected package openssl.
#6 6.119 (Reading database ... (Reading database ... 5%(Reading database ... 10%(Reading database ... 15%(Reading database ... 20%(Reading database ... 25%(Reading database ... 30%(Reading database ... 35%(Reading database ... 40%(Reading database ... 45%(Reading database ... 50%(Reading database ... 55%(Reading database ... 60%(Reading database ... 65%(Reading database ... 70%(Reading database ... 75%(Reading database ... 80%(Reading database ... 85%(Reading database ... 90%(Reading database ... 95%(Reading database ... 100%(Reading database ... 6661 files and directories currently installed.)
#6 6.291 Preparing to unpack .../openssl_1.1.1n-0+deb11u4_amd64.deb ...
#6 6.296 Unpacking openssl (1.1.1n-0+deb11u4) ...
#6 6.416 Selecting previously unselected package ca-certificates.
#6 6.418 Preparing to unpack .../ca-certificates_20210119_all.deb ...
#6 6.422 Unpacking ca-certificates (20210119) ...
#6 6.496 Setting up openssl (1.1.1n-0+deb11u4) ...
#6 6.518 Setting up ca-certificates (20210119) ...
#6 7.330 Updating certificates in /etc/ssl/certs...
#6 8.161 129 added, 0 removed; done.
#6 8.242 Processing triggers for ca-certificates (20210119) ...
#6 8.252 Updating certificates in /etc/ssl/certs...
#6 8.860 0 added, 0 removed; done.
#6 8.860 Running hooks in /etc/ca-certificates/update.d...
#6 8.879 done.
#6 DONE 10.2s
#7 [3/8] ADD target/linux_amd64/boot /opt/apache/beam/
#7 DONE 0.3s
#8 [4/8] COPY target/LICENSE /opt/apache/beam/
#8 DONE 0.1s
#9 [5/8] COPY target/NOTICE /opt/apache/beam/
#9 DONE 0.1s
#10 [6/8] COPY target/LICENSE target/go-licenses/* /opt/apache/beam/third_party_licenses/golang/
#10 ERROR: lstat /var/lib/docker/tmp/buildkit-mount1321741207/target/go-licenses: no such file or directory
------
> [6/8] COPY target/LICENSE target/go-licenses/* /opt/apache/beam/third_party_licenses/golang/:
------
> Task :sdks:go:container:docker FAILEDERROR: failed to solve: lstat /var/lib/docker/tmp/buildkit-mount1321741207/target/go-licenses: no such file or directory
FAILURE: Build failed with an exception.
* What went wrong:
Execution failed for task ':sdks:go:container:docker'.
> Process 'command 'docker'' finished with non-zero exit value 1
* Try:
> Run with --stacktrace option to get the stack trace.
> Run with --info or --debug option to get more log output.
* Get more help at https://help.gradle.org
16 actionable tasks: 5 executed, 11 up-to-date
BUILD FAILED in 26s
Publishing build scan...
https://gradle.com/s/75f22cxw3iugo
$ ./gradlew :sdks:go:container:docker -Pdocker-repository-root=us.gcr.io/apache-beam-testing/jenkins -Pdocker-tag=20230408-143456
> Task :goIntegrationTests FAILED
FAILURE: Build failed with an exception.
* What went wrong:
Execution failed for task ':goIntegrationTests'.
> Process 'command 'sh'' finished with non-zero exit value 1
* Try:
> Run with --stacktrace option to get the stack trace.
> Run with --info or --debug option to get more log output.
* Get more help at https://help.gradle.org
Deprecated Gradle features were used in this build, making it incompatible with Gradle 8.0.
You can use '--warning-mode all' to show the individual deprecation warnings and determine if they come from your own scripts or plugins.
See https://docs.gradle.org/7.5.1/userguide/command_line_interface.html#sec:command_line_warnings
BUILD FAILED in 1m
91 actionable tasks: 55 executed, 34 from cache, 2 up-to-date
Publishing build scan...
https://gradle.com/s/ue24n3t7il2gk
Build step 'Invoke Gradle script' changed build result to FAILURE
Build step 'Invoke Gradle script' marked build as failure
---------------------------------------------------------------------
To unsubscribe, e-mail: builds-unsubscribe@beam.apache.org
For additional commands, e-mail: builds-help@beam.apache.org
Build failed in Jenkins: beam_PostCommit_Go #11143
Posted by Apache Jenkins Server <je...@builds.apache.org>.
See <https://ci-beam.apache.org/job/beam_PostCommit_Go/11143/display/redirect>
Changes:
------------------------------------------
[...truncated 25.22 KB...]
> Task :sdks:java:expansion-service:processResources NO-SOURCE
> Task :sdks:java:expansion-service:classes UP-TO-DATE
> Task :sdks:java:expansion-service:jar
> Task :sdks:java:extensions:arrow:createCheckerFrameworkManifest
> Task :sdks:java:extensions:arrow:compileJava FROM-CACHE
> Task :sdks:java:extensions:arrow:processResources NO-SOURCE
> Task :sdks:java:extensions:arrow:classes UP-TO-DATE
> Task :sdks:java:extensions:arrow:jar
> Task :sdks:java:extensions:protobuf:createCheckerFrameworkManifest
> Task :sdks:java:extensions:protobuf:extractIncludeProto
> Task :sdks:java:extensions:protobuf:extractProto
> Task :sdks:java:extensions:protobuf:generateProto NO-SOURCE
> Task :sdks:java:extensions:protobuf:compileJava FROM-CACHE
> Task :sdks:java:extensions:protobuf:processResources NO-SOURCE
> Task :sdks:java:extensions:protobuf:classes UP-TO-DATE
> Task :sdks:java:extensions:protobuf:jar
> Task :sdks:java:io:google-cloud-platform:createCheckerFrameworkManifest
> Task :sdks:java:io:google-cloud-platform:compileJava FROM-CACHE
> Task :sdks:java:io:google-cloud-platform:processResources NO-SOURCE
> Task :sdks:java:io:google-cloud-platform:classes UP-TO-DATE
> Task :sdks:java:io:google-cloud-platform:jar
> Task :sdks:java:io:kafka:createCheckerFrameworkManifest
> Task :sdks:java:io:kafka:compileJava FROM-CACHE
> Task :sdks:java:io:kafka:processResources NO-SOURCE
> Task :sdks:java:io:kafka:classes UP-TO-DATE
> Task :sdks:java:io:kafka:jar
> Task :runners:google-cloud-dataflow-java:compileJava FROM-CACHE
> Task :runners:google-cloud-dataflow-java:processResources
> Task :runners:google-cloud-dataflow-java:classes
> Task :runners:google-cloud-dataflow-java:jar
> Task :runners:google-cloud-dataflow-java:worker:createCheckerFrameworkManifest
> Task :runners:google-cloud-dataflow-java:worker:windmill:createCheckerFrameworkManifest
> Task :runners:google-cloud-dataflow-java:worker:windmill:extractIncludeProto
> Task :runners:google-cloud-dataflow-java:worker:windmill:extractProto
> Task :runners:google-cloud-dataflow-java:worker:windmill:generateProto FROM-CACHE
> Task :runners:google-cloud-dataflow-java:worker:windmill:compileJava FROM-CACHE
> Task :runners:google-cloud-dataflow-java:worker:windmill:processResources
> Task :runners:google-cloud-dataflow-java:worker:windmill:classes
> Task :runners:google-cloud-dataflow-java:worker:windmill:shadowJar FROM-CACHE
> Task :runners:google-cloud-dataflow-java:worker:processResources
> Task :runners:google-cloud-dataflow-java:worker:compileJava FROM-CACHE
> Task :runners:google-cloud-dataflow-java:worker:classes
> Task :runners:google-cloud-dataflow-java:worker:shadowJar FROM-CACHE
> Task :sdks:go:test:assemble UP-TO-DATE
> Task :sdks:go:test:test UP-TO-DATE
> Task :sdks:go:test:check UP-TO-DATE
> Task :sdks:go:test:build UP-TO-DATE
> Task :goIntegrationTests
$ CURRENT_DIRECTORY=<https://ci-beam.apache.org/job/beam_PostCommit_Go/ws/src/sdks/go/test>
$ TESTS=./test/integration/... ./test/regression
$ RUNNER=portable
$ TIMEOUT=3h
$ SIMULTANEOUS=3
$ GCS_LOCATION=gs://temp-storage-for-end-to-end-tests
$ GCS_SUBFOLDER=test29960
$ PROJECT=apache-beam-testing
$ DATAFLOW_PROJECT=apache-beam-testing
$ REGION=us-central1
$ trap exit_background_processes SIGINT SIGTERM EXIT
$ key=--runner
$ case --runner in
$ RUNNER=dataflow
$ cd <https://ci-beam.apache.org/job/beam_PostCommit_Go/ws/src>
$ test -d sdks/go/test
$ command -v docker
/usr/bin/docker
$ docker -v
Docker version 20.10.23, build 7155243
$ command -v gcloud
/usr/bin/gcloud
$ gcloud --version
Google Cloud SDK 406.0.0
alpha 2022.10.17
beta 2022.10.17
bq 2.0.79
bundled-python3-unix 3.9.12
core 2022.10.17
gcloud-crc32c 1.0.0
gsutil 5.14
$ TMPDIR=/tmp/tmp.jNOMZAEGk8
$ gcloud_ver=406.0.0
$ TAG=20230408-083453
$ CONTAINER=us.gcr.io/apache-beam-testing/jenkins/beam_go_sdk
Using container us.gcr.io/apache-beam-testing/jenkins/beam_go_sdk
$ ./gradlew :sdks:go:container:docker -Pdocker-repository-root=us.gcr.io/apache-beam-testing/jenkins -Pdocker-tag=20230408-083453
To honour the JVM settings for this build a single-use Daemon process will be forked. See https://docs.gradle.org/7.5.1/userguide/gradle_daemon.html#sec:disabling_the_daemon.
Daemon will be stopped at the end of the build
Configuration on demand is an incubating feature.
> Task :buildSrc:compileJava NO-SOURCE
> Task :buildSrc:compileGroovy UP-TO-DATE
> Task :buildSrc:pluginDescriptors UP-TO-DATE
> Task :buildSrc:processResources UP-TO-DATE
> Task :buildSrc:classes UP-TO-DATE
> Task :buildSrc:jar UP-TO-DATE
> Task :buildSrc:assemble UP-TO-DATE
> Task :buildSrc:spotlessGroovy UP-TO-DATE
> Task :buildSrc:spotlessGroovyCheck UP-TO-DATE
> Task :buildSrc:spotlessGroovyGradle UP-TO-DATE
> Task :buildSrc:spotlessGroovyGradleCheck UP-TO-DATE
> Task :buildSrc:spotlessCheck UP-TO-DATE
> Task :buildSrc:pluginUnderTestMetadata UP-TO-DATE
> Task :buildSrc:compileTestJava NO-SOURCE
> Task :buildSrc:compileTestGroovy NO-SOURCE
> Task :buildSrc:processTestResources NO-SOURCE
> Task :buildSrc:testClasses UP-TO-DATE
> Task :buildSrc:test NO-SOURCE
> Task :buildSrc:validatePlugins UP-TO-DATE
> Task :buildSrc:check UP-TO-DATE
> Task :buildSrc:build UP-TO-DATE
System Go installation: /snap/bin/go is go version go1.16.15 linux/amd64; Preparing to use /home/jenkins/go/bin/go1.20.2
GOCMD=/home/jenkins/go/bin/go1.20.2
go1.20.2: already downloaded in /home/jenkins/sdk/go1.20.2
> Task :sdks:go:container:copyLicenses
> Task :sdks:go:container:dockerClean UP-TO-DATE
> Task :sdks:go:container:goPrepare UP-TO-DATE
> Task :sdks:go:container:goBuild
/home/jenkins/go/bin/go1.20.2 build -o ./build/target/linux_amd64/boot boot.go boot_test.go
> Task :sdks:go:container:skipPullLicenses
> Task :sdks:go:container:dockerPrepare
#1 [internal] load build definition from Dockerfile
> Task :sdks:go:container:docker
#1 transferring dockerfile: 1.94kB done
#1 DONE 0.0s
#2 [internal] load .dockerignore
#2 transferring context: 2B 0.0s done
#2 DONE 0.0s
#3 [internal] load metadata for docker.io/library/debian:bullseye
#3 DONE 0.3s
#4 [1/8] FROM docker.io/library/debian:bullseye@sha256:7b991788987ad860810df60927e1adbaf8e156520177bd4db82409f81dd3b721
#4 CACHED
#5 [internal] load build context
#5 transferring context: 22.20MB 0.2s done
#5 DONE 0.2s
#6 [2/8] RUN apt-get update && DEBIAN_FRONTEND=noninteractive apt-get install -y ca-certificates && rm -rf /var/lib/apt/lists/*
#6 0.430 Get:1 http://deb.debian.org/debian bullseye InRelease [116 kB]
#6 0.510 Get:2 http://deb.debian.org/debian-security bullseye-security InRelease [48.4 kB]
#6 0.540 Get:3 http://deb.debian.org/debian bullseye-updates InRelease [44.1 kB]
#6 0.654 Get:4 http://deb.debian.org/debian bullseye/main amd64 Packages [8183 kB]
#6 0.858 Get:5 http://deb.debian.org/debian-security bullseye-security/main amd64 Packages [236 kB]
#6 0.896 Get:6 http://deb.debian.org/debian bullseye-updates/main amd64 Packages [14.6 kB]
#6 2.153 Fetched 8642 kB in 2s (4827 kB/s)
#6 2.153 Reading package lists...
#6 2.802 Reading package lists...
#6 3.456 Building dependency tree...
#6 3.607 Reading state information...
#6 3.760 The following additional packages will be installed:
#6 3.760 openssl
#6 3.787 The following NEW packages will be installed:
#6 3.787 ca-certificates openssl
#6 3.859 0 upgraded, 2 newly installed, 0 to remove and 1 not upgraded.
#6 3.859 Need to get 1011 kB of archives.
#6 3.859 After this operation, 1892 kB of additional disk space will be used.
#6 3.859 Get:1 http://deb.debian.org/debian-security bullseye-security/main amd64 openssl amd64 1.1.1n-0+deb11u4 [853 kB]
#6 3.996 Get:2 http://deb.debian.org/debian bullseye/main amd64 ca-certificates all 20210119 [158 kB]
#6 4.143 debconf: delaying package configuration, since apt-utils is not installed
#6 4.177 Fetched 1011 kB in 0s (4939 kB/s)
#6 4.202 Selecting previously unselected package openssl.
#6 4.202 (Reading database ... (Reading database ... 5%(Reading database ... 10%(Reading database ... 15%(Reading database ... 20%(Reading database ... 25%(Reading database ... 30%(Reading database ... 35%(Reading database ... 40%(Reading database ... 45%(Reading database ... 50%(Reading database ... 55%(Reading database ... 60%(Reading database ... 65%(Reading database ... 70%(Reading database ... 75%(Reading database ... 80%(Reading database ... 85%(Reading database ... 90%(Reading database ... 95%(Reading database ... 100%(Reading database ... 6661 files and directories currently installed.)
#6 4.210 Preparing to unpack .../openssl_1.1.1n-0+deb11u4_amd64.deb ...
#6 4.214 Unpacking openssl (1.1.1n-0+deb11u4) ...
#6 4.331 Selecting previously unselected package ca-certificates.
#6 4.333 Preparing to unpack .../ca-certificates_20210119_all.deb ...
#6 4.337 Unpacking ca-certificates (20210119) ...
#6 4.407 Setting up openssl (1.1.1n-0+deb11u4) ...
#6 4.423 Setting up ca-certificates (20210119) ...
#6 4.986 Updating certificates in /etc/ssl/certs...
#6 5.674 129 added, 0 removed; done.
#6 5.719 Processing triggers for ca-certificates (20210119) ...
#6 5.728 Updating certificates in /etc/ssl/certs...
#6 6.280 0 added, 0 removed; done.
#6 6.280 Running hooks in /etc/ca-certificates/update.d...
#6 6.281 done.
#6 DONE 7.6s
#7 [3/8] ADD target/linux_amd64/boot /opt/apache/beam/
#7 DONE 0.3s
#8 [4/8] COPY target/LICENSE /opt/apache/beam/
#8 DONE 0.1s
#9 [5/8] COPY target/NOTICE /opt/apache/beam/
#9 DONE 0.1s
> Task :sdks:go:container:docker
FAILED
#10 [6/8] COPY target/LICENSE target/go-licenses/* /opt/apache/beam/third_party_licenses/golang/
#10 ERROR: lstat /var/lib/docker/tmp/buildkit-mount3359025148/target/go-licenses: no such file or directory
------
> [6/8] COPY target/LICENSE target/go-licenses/* /opt/apache/beam/third_party_licenses/golang/:
------
16 actionable tasks: 5 executed, 11 up-to-date
ERROR: failed to solve: lstat /var/lib/docker/tmp/buildkit-mount3359025148/target/go-licenses: no such file or directory
FAILURE: Build failed with an exception.
* What went wrong:
Execution failed for task ':sdks:go:container:docker'.
> Process 'command 'docker'' finished with non-zero exit value 1
* Try:
> Run with --stacktrace option to get the stack trace.
> Run with --info or --debug option to get more log output.
* Get more help at https://help.gradle.org
BUILD FAILED in 24s
Publishing build scan...
https://gradle.com/s/5akuwxf3atgl4
$ ./gradlew :sdks:go:container:docker -Pdocker-repository-root=us.gcr.io/apache-beam-testing/jenkins -Pdocker-tag=20230408-083453
> Task :goIntegrationTests FAILED
FAILURE: Build failed with an exception.
* What went wrong:
Execution failed for task ':goIntegrationTests'.
> Process 'command 'sh'' finished with non-zero exit value 1
* Try:
> Run with --stacktrace option to get the stack trace.
> Run with --info or --debug option to get more log output.
* Get more help at https://help.gradle.org
Deprecated Gradle features were used in this build, making it incompatible with Gradle 8.0.
You can use '--warning-mode all' to show the individual deprecation warnings and determine if they come from your own scripts or plugins.
See https://docs.gradle.org/7.5.1/userguide/command_line_interface.html#sec:command_line_warnings
BUILD FAILED in 56s
91 actionable tasks: 55 executed, 34 from cache, 2 up-to-date
Publishing build scan...
https://gradle.com/s/a6n4snip5gaey
Build step 'Invoke Gradle script' changed build result to FAILURE
Build step 'Invoke Gradle script' marked build as failure
---------------------------------------------------------------------
To unsubscribe, e-mail: builds-unsubscribe@beam.apache.org
For additional commands, e-mail: builds-help@beam.apache.org
Build failed in Jenkins: beam_PostCommit_Go #11142
Posted by Apache Jenkins Server <je...@builds.apache.org>.
See <https://ci-beam.apache.org/job/beam_PostCommit_Go/11142/display/redirect>
Changes:
------------------------------------------
[...truncated 25.26 KB...]
> Task :sdks:java:expansion-service:processResources NO-SOURCE
> Task :sdks:java:expansion-service:classes UP-TO-DATE
> Task :sdks:java:expansion-service:jar
> Task :sdks:java:extensions:arrow:createCheckerFrameworkManifest
> Task :sdks:java:extensions:arrow:compileJava FROM-CACHE
> Task :sdks:java:extensions:arrow:processResources NO-SOURCE
> Task :sdks:java:extensions:arrow:classes UP-TO-DATE
> Task :sdks:java:extensions:arrow:jar
> Task :sdks:java:extensions:protobuf:createCheckerFrameworkManifest
> Task :sdks:java:extensions:protobuf:extractIncludeProto
> Task :sdks:java:extensions:protobuf:extractProto
> Task :sdks:java:extensions:protobuf:generateProto NO-SOURCE
> Task :sdks:java:extensions:protobuf:compileJava FROM-CACHE
> Task :sdks:java:extensions:protobuf:processResources NO-SOURCE
> Task :sdks:java:extensions:protobuf:classes UP-TO-DATE
> Task :sdks:java:extensions:protobuf:jar
> Task :sdks:java:io:google-cloud-platform:createCheckerFrameworkManifest
> Task :sdks:java:io:google-cloud-platform:compileJava FROM-CACHE
> Task :sdks:java:io:google-cloud-platform:processResources NO-SOURCE
> Task :sdks:java:io:google-cloud-platform:classes UP-TO-DATE
> Task :sdks:java:io:google-cloud-platform:jar
> Task :sdks:java:io:kafka:createCheckerFrameworkManifest
> Task :sdks:java:io:kafka:compileJava FROM-CACHE
> Task :sdks:java:io:kafka:processResources NO-SOURCE
> Task :sdks:java:io:kafka:classes UP-TO-DATE
> Task :sdks:java:io:kafka:jar
> Task :runners:google-cloud-dataflow-java:compileJava FROM-CACHE
> Task :runners:google-cloud-dataflow-java:processResources
> Task :runners:google-cloud-dataflow-java:classes
> Task :runners:google-cloud-dataflow-java:jar
> Task :runners:google-cloud-dataflow-java:worker:createCheckerFrameworkManifest
> Task :runners:google-cloud-dataflow-java:worker:windmill:createCheckerFrameworkManifest
> Task :runners:google-cloud-dataflow-java:worker:windmill:extractIncludeProto
> Task :runners:google-cloud-dataflow-java:worker:windmill:extractProto
> Task :runners:google-cloud-dataflow-java:worker:windmill:generateProto FROM-CACHE
> Task :runners:google-cloud-dataflow-java:worker:windmill:compileJava FROM-CACHE
> Task :runners:google-cloud-dataflow-java:worker:windmill:processResources
> Task :runners:google-cloud-dataflow-java:worker:windmill:classes
> Task :runners:google-cloud-dataflow-java:worker:windmill:shadowJar FROM-CACHE
> Task :runners:google-cloud-dataflow-java:worker:compileJava FROM-CACHE
> Task :runners:google-cloud-dataflow-java:worker:processResources
> Task :runners:google-cloud-dataflow-java:worker:classes
> Task :runners:google-cloud-dataflow-java:worker:shadowJar FROM-CACHE
> Task :sdks:go:test:assemble UP-TO-DATE
> Task :sdks:go:test:test UP-TO-DATE
> Task :sdks:go:test:check UP-TO-DATE
> Task :sdks:go:test:build UP-TO-DATE
> Task :goIntegrationTests
$ CURRENT_DIRECTORY=<https://ci-beam.apache.org/job/beam_PostCommit_Go/ws/src/sdks/go/test>
$ TESTS=./test/integration/... ./test/regression
$ RUNNER=portable
$ TIMEOUT=3h
$ SIMULTANEOUS=3
$ GCS_LOCATION=gs://temp-storage-for-end-to-end-tests
$ GCS_SUBFOLDER=test13853
$ PROJECT=apache-beam-testing
$ DATAFLOW_PROJECT=apache-beam-testing
$ REGION=us-central1
$ trap exit_background_processes SIGINT SIGTERM EXIT
$ key=--runner
$ case --runner in
$ RUNNER=dataflow
$ cd <https://ci-beam.apache.org/job/beam_PostCommit_Go/ws/src>
$ test -d sdks/go/test
$ command -v docker
/usr/bin/docker
$ docker -v
Docker version 20.10.23, build 7155243
$ command -v gcloud
/usr/bin/gcloud
$ gcloud --version
Google Cloud SDK 406.0.0
alpha 2022.10.17
beta 2022.10.17
bq 2.0.79
bundled-python3-unix 3.9.12
core 2022.10.17
gcloud-crc32c 1.0.0
gsutil 5.14
$ TMPDIR=/tmp/tmp.eUo48Z68mD
$ gcloud_ver=406.0.0
$ TAG=20230408-023502
$ CONTAINER=us.gcr.io/apache-beam-testing/jenkins/beam_go_sdk
Using container us.gcr.io/apache-beam-testing/jenkins/beam_go_sdk
$ ./gradlew :sdks:go:container:docker -Pdocker-repository-root=us.gcr.io/apache-beam-testing/jenkins -Pdocker-tag=20230408-023502
To honour the JVM settings for this build a single-use Daemon process will be forked. See https://docs.gradle.org/7.5.1/userguide/gradle_daemon.html#sec:disabling_the_daemon.
Daemon will be stopped at the end of the build
Configuration on demand is an incubating feature.
> Task :buildSrc:compileJava NO-SOURCE
> Task :buildSrc:compileGroovy UP-TO-DATE
> Task :buildSrc:pluginDescriptors UP-TO-DATE
> Task :buildSrc:processResources UP-TO-DATE
> Task :buildSrc:classes UP-TO-DATE
> Task :buildSrc:jar UP-TO-DATE
> Task :buildSrc:assemble UP-TO-DATE
> Task :buildSrc:spotlessGroovy UP-TO-DATE
> Task :buildSrc:spotlessGroovyCheck UP-TO-DATE
> Task :buildSrc:spotlessGroovyGradle UP-TO-DATE
> Task :buildSrc:spotlessGroovyGradleCheck UP-TO-DATE
> Task :buildSrc:spotlessCheck UP-TO-DATE
> Task :buildSrc:pluginUnderTestMetadata UP-TO-DATE
> Task :buildSrc:compileTestJava NO-SOURCE
> Task :buildSrc:compileTestGroovy NO-SOURCE
> Task :buildSrc:processTestResources NO-SOURCE
> Task :buildSrc:testClasses UP-TO-DATE
> Task :buildSrc:test NO-SOURCE
> Task :buildSrc:validatePlugins UP-TO-DATE
> Task :buildSrc:check UP-TO-DATE
> Task :buildSrc:build UP-TO-DATE
System Go installation: /snap/bin/go is go version go1.16.15 linux/amd64; Preparing to use /home/jenkins/go/bin/go1.20.2
GOCMD=/home/jenkins/go/bin/go1.20.2
go1.20.2: already downloaded in /home/jenkins/sdk/go1.20.2
> Task :sdks:go:container:copyLicenses
> Task :sdks:go:container:dockerClean UP-TO-DATE
> Task :sdks:go:container:goPrepare UP-TO-DATE
> Task :sdks:go:container:goBuild
/home/jenkins/go/bin/go1.20.2 build -o ./build/target/linux_amd64/boot boot.go boot_test.go
> Task :sdks:go:container:skipPullLicenses
> Task :sdks:go:container:dockerPrepare
#1 [internal] load build definition from Dockerfile
> Task :sdks:go:container:docker
#1 transferring dockerfile: 1.94kB done
#1 DONE 0.0s
#2 [internal] load .dockerignore
#2 transferring context: 2B done
#2 DONE 0.0s
#3 [internal] load metadata for docker.io/library/debian:bullseye
#3 DONE 0.3s
#4 [1/8] FROM docker.io/library/debian:bullseye@sha256:7b991788987ad860810df60927e1adbaf8e156520177bd4db82409f81dd3b721
#4 CACHED
#5 [internal] load build context
#5 transferring context: 22.20MB 0.2s done
#5 DONE 0.2s
#6 [2/8] RUN apt-get update && DEBIAN_FRONTEND=noninteractive apt-get install -y ca-certificates && rm -rf /var/lib/apt/lists/*
#6 0.446 Get:1 http://deb.debian.org/debian bullseye InRelease [116 kB]
#6 0.544 Get:2 http://deb.debian.org/debian-security bullseye-security InRelease [48.4 kB]
#6 0.582 Get:3 http://deb.debian.org/debian bullseye-updates InRelease [44.1 kB]
#6 0.688 Get:4 http://deb.debian.org/debian bullseye/main amd64 Packages [8183 kB]
#6 0.938 Get:5 http://deb.debian.org/debian-security bullseye-security/main amd64 Packages [236 kB]
#6 0.973 Get:6 http://deb.debian.org/debian bullseye-updates/main amd64 Packages [14.6 kB]
#6 2.230 Fetched 8642 kB in 2s (4665 kB/s)
#6 2.230 Reading package lists...
#6 2.939 Reading package lists...
#6 3.610 Building dependency tree...
#6 3.773 Reading state information...
#6 3.982 The following additional packages will be installed:
#6 3.982 openssl
#6 4.013 The following NEW packages will be installed:
#6 4.014 ca-certificates openssl
#6 4.090 0 upgraded, 2 newly installed, 0 to remove and 1 not upgraded.
#6 4.090 Need to get 1011 kB of archives.
#6 4.090 After this operation, 1892 kB of additional disk space will be used.
#6 4.090 Get:1 http://deb.debian.org/debian-security bullseye-security/main amd64 openssl amd64 1.1.1n-0+deb11u4 [853 kB]
#6 4.228 Get:2 http://deb.debian.org/debian bullseye/main amd64 ca-certificates all 20210119 [158 kB]
#6 4.528 debconf: delaying package configuration, since apt-utils is not installed
#6 4.562 Fetched 1011 kB in 0s (4854 kB/s)
#6 4.587 Selecting previously unselected package openssl.
#6 4.587 (Reading database ... (Reading database ... 5%(Reading database ... 10%(Reading database ... 15%(Reading database ... 20%(Reading database ... 25%(Reading database ... 30%(Reading database ... 35%(Reading database ... 40%(Reading database ... 45%(Reading database ... 50%(Reading database ... 55%(Reading database ... 60%(Reading database ... 65%(Reading database ... 70%(Reading database ... 75%(Reading database ... 80%(Reading database ... 85%(Reading database ... 90%(Reading database ... 95%(Reading database ... 100%(Reading database ... 6661 files and directories currently installed.)
#6 4.596 Preparing to unpack .../openssl_1.1.1n-0+deb11u4_amd64.deb ...
#6 4.600 Unpacking openssl (1.1.1n-0+deb11u4) ...
#6 4.718 Selecting previously unselected package ca-certificates.
#6 4.720 Preparing to unpack .../ca-certificates_20210119_all.deb ...
#6 4.724 Unpacking ca-certificates (20210119) ...
#6 4.796 Setting up openssl (1.1.1n-0+deb11u4) ...
#6 4.813 Setting up ca-certificates (20210119) ...
#6 5.741 Updating certificates in /etc/ssl/certs...
#6 6.515 129 added, 0 removed; done.
#6 6.559 Processing triggers for ca-certificates (20210119) ...
#6 6.568 Updating certificates in /etc/ssl/certs...
#6 7.138 0 added, 0 removed; done.
#6 7.138 Running hooks in /etc/ca-certificates/update.d...
#6 7.163 done.
#6 DONE 8.4s
#7 [3/8] ADD target/linux_amd64/boot /opt/apache/beam/
#7 DONE 0.2s
#8 [4/8] COPY target/LICENSE /opt/apache/beam/
#8 DONE 0.1s
#9 [5/8] COPY target/NOTICE /opt/apache/beam/
#9 DONE 0.1s
> Task :sdks:go:container:docker FAILED
#10 [6/8] COPY target/LICENSE target/go-licenses/* /opt/apache/beam/third_party_licenses/golang/
16 actionable tasks: 5 executed, 11 up-to-date
#10 ERROR: lstat /var/lib/docker/tmp/buildkit-mount3592816400/target/go-licenses: no such file or directory
------
> [6/8] COPY target/LICENSE target/go-licenses/* /opt/apache/beam/third_party_licenses/golang/:
------
ERROR: failed to solve: lstat /var/lib/docker/tmp/buildkit-mount3592816400/target/go-licenses: no such file or directory
FAILURE: Build failed with an exception.
* What went wrong:
Execution failed for task ':sdks:go:container:docker'.
> Process 'command 'docker'' finished with non-zero exit value 1
* Try:
> Run with --stacktrace option to get the stack trace.
> Run with --info or --debug option to get more log output.
* Get more help at https://help.gradle.org
BUILD FAILED in 27s
Publishing build scan...
https://gradle.com/s/xy3nj6exhopte
$ ./gradlew :sdks:go:container:docker -Pdocker-repository-root=us.gcr.io/apache-beam-testing/jenkins -Pdocker-tag=20230408-023502
> Task :goIntegrationTests FAILED
FAILURE: Build failed with an exception.
* What went wrong:
Execution failed for task ':goIntegrationTests'.
> Process 'command 'sh'' finished with non-zero exit value 1
* Try:
> Run with --stacktrace option to get the stack trace.
> Run with --info or --debug option to get more log output.
* Get more help at https://help.gradle.org
Deprecated Gradle features were used in this build, making it incompatible with Gradle 8.0.
You can use '--warning-mode all' to show the individual deprecation warnings and determine if they come from your own scripts or plugins.
See https://docs.gradle.org/7.5.1/userguide/command_line_interface.html#sec:command_line_warnings
BUILD FAILED in 1m 6s
91 actionable tasks: 55 executed, 34 from cache, 2 up-to-date
Publishing build scan...
https://gradle.com/s/w67fau3i5nhq2
Build step 'Invoke Gradle script' changed build result to FAILURE
Build step 'Invoke Gradle script' marked build as failure
---------------------------------------------------------------------
To unsubscribe, e-mail: builds-unsubscribe@beam.apache.org
For additional commands, e-mail: builds-help@beam.apache.org
Build failed in Jenkins: beam_PostCommit_Go #11141
Posted by Apache Jenkins Server <je...@builds.apache.org>.
See <https://ci-beam.apache.org/job/beam_PostCommit_Go/11141/display/redirect>
Changes:
------------------------------------------
[...truncated 25.29 KB...]
> Task :sdks:java:expansion-service:processResources NO-SOURCE
> Task :sdks:java:expansion-service:classes UP-TO-DATE
> Task :sdks:java:expansion-service:jar
> Task :sdks:java:extensions:arrow:createCheckerFrameworkManifest
> Task :sdks:java:extensions:arrow:compileJava FROM-CACHE
> Task :sdks:java:extensions:arrow:processResources NO-SOURCE
> Task :sdks:java:extensions:arrow:classes UP-TO-DATE
> Task :sdks:java:extensions:arrow:jar
> Task :sdks:java:extensions:protobuf:createCheckerFrameworkManifest
> Task :sdks:java:extensions:protobuf:extractIncludeProto
> Task :sdks:java:extensions:protobuf:extractProto
> Task :sdks:java:extensions:protobuf:generateProto NO-SOURCE
> Task :sdks:java:extensions:protobuf:compileJava FROM-CACHE
> Task :sdks:java:extensions:protobuf:processResources NO-SOURCE
> Task :sdks:java:extensions:protobuf:classes UP-TO-DATE
> Task :sdks:java:extensions:protobuf:jar
> Task :sdks:java:io:google-cloud-platform:createCheckerFrameworkManifest
> Task :sdks:java:io:google-cloud-platform:compileJava FROM-CACHE
> Task :sdks:java:io:google-cloud-platform:processResources NO-SOURCE
> Task :sdks:java:io:google-cloud-platform:classes UP-TO-DATE
> Task :sdks:java:io:google-cloud-platform:jar
> Task :sdks:java:io:kafka:createCheckerFrameworkManifest
> Task :sdks:java:io:kafka:compileJava FROM-CACHE
> Task :sdks:java:io:kafka:processResources NO-SOURCE
> Task :sdks:java:io:kafka:classes UP-TO-DATE
> Task :sdks:java:io:kafka:jar
> Task :runners:google-cloud-dataflow-java:compileJava FROM-CACHE
> Task :runners:google-cloud-dataflow-java:processResources
> Task :runners:google-cloud-dataflow-java:classes
> Task :runners:google-cloud-dataflow-java:jar
> Task :runners:google-cloud-dataflow-java:worker:createCheckerFrameworkManifest
> Task :runners:google-cloud-dataflow-java:worker:windmill:createCheckerFrameworkManifest
> Task :runners:google-cloud-dataflow-java:worker:windmill:extractIncludeProto
> Task :runners:google-cloud-dataflow-java:worker:windmill:extractProto
> Task :runners:google-cloud-dataflow-java:worker:windmill:generateProto FROM-CACHE
> Task :runners:google-cloud-dataflow-java:worker:windmill:compileJava FROM-CACHE
> Task :runners:google-cloud-dataflow-java:worker:windmill:processResources
> Task :runners:google-cloud-dataflow-java:worker:windmill:classes
> Task :runners:google-cloud-dataflow-java:worker:windmill:shadowJar FROM-CACHE
> Task :runners:google-cloud-dataflow-java:worker:compileJava FROM-CACHE
> Task :runners:google-cloud-dataflow-java:worker:processResources
> Task :runners:google-cloud-dataflow-java:worker:classes
> Task :runners:google-cloud-dataflow-java:worker:shadowJar FROM-CACHE
> Task :sdks:go:test:assemble UP-TO-DATE
> Task :sdks:go:test:test UP-TO-DATE
> Task :sdks:go:test:check UP-TO-DATE
> Task :sdks:go:test:build UP-TO-DATE
> Task :goIntegrationTests
$ CURRENT_DIRECTORY=<https://ci-beam.apache.org/job/beam_PostCommit_Go/ws/src/sdks/go/test>
$ TESTS=./test/integration/... ./test/regression
$ RUNNER=portable
$ TIMEOUT=3h
$ SIMULTANEOUS=3
$ GCS_LOCATION=gs://temp-storage-for-end-to-end-tests
$ GCS_SUBFOLDER=test18127
$ PROJECT=apache-beam-testing
$ DATAFLOW_PROJECT=apache-beam-testing
$ REGION=us-central1
$ trap exit_background_processes SIGINT SIGTERM EXIT
$ key=--runner
$ case --runner in
$ RUNNER=dataflow
$ cd <https://ci-beam.apache.org/job/beam_PostCommit_Go/ws/src>
$ test -d sdks/go/test
$ command -v docker
/usr/bin/docker
$ docker -v
Docker version 20.10.23, build 7155243
$ command -v gcloud
/usr/bin/gcloud
$ gcloud --version
Google Cloud SDK 406.0.0
alpha 2022.10.17
beta 2022.10.17
bq 2.0.79
bundled-python3-unix 3.9.12
core 2022.10.17
gcloud-crc32c 1.0.0
gsutil 5.14
$ TMPDIR=/tmp/tmp.wqVccS4L2i
$ gcloud_ver=406.0.0
$ TAG=20230407-203457
$ CONTAINER=us.gcr.io/apache-beam-testing/jenkins/beam_go_sdk
Using container us.gcr.io/apache-beam-testing/jenkins/beam_go_sdk
$ ./gradlew :sdks:go:container:docker -Pdocker-repository-root=us.gcr.io/apache-beam-testing/jenkins -Pdocker-tag=20230407-203457
To honour the JVM settings for this build a single-use Daemon process will be forked. See https://docs.gradle.org/7.5.1/userguide/gradle_daemon.html#sec:disabling_the_daemon.
Daemon will be stopped at the end of the build
Configuration on demand is an incubating feature.
> Task :buildSrc:compileJava NO-SOURCE
> Task :buildSrc:compileGroovy UP-TO-DATE
> Task :buildSrc:pluginDescriptors UP-TO-DATE
> Task :buildSrc:processResources UP-TO-DATE
> Task :buildSrc:classes UP-TO-DATE
> Task :buildSrc:jar UP-TO-DATE
> Task :buildSrc:assemble UP-TO-DATE
> Task :buildSrc:spotlessGroovy UP-TO-DATE
> Task :buildSrc:spotlessGroovyCheck UP-TO-DATE
> Task :buildSrc:spotlessGroovyGradle UP-TO-DATE
> Task :buildSrc:spotlessGroovyGradleCheck UP-TO-DATE
> Task :buildSrc:spotlessCheck UP-TO-DATE
> Task :buildSrc:pluginUnderTestMetadata UP-TO-DATE
> Task :buildSrc:compileTestJava NO-SOURCE
> Task :buildSrc:compileTestGroovy NO-SOURCE
> Task :buildSrc:processTestResources NO-SOURCE
> Task :buildSrc:testClasses UP-TO-DATE
> Task :buildSrc:test NO-SOURCE
> Task :buildSrc:validatePlugins UP-TO-DATE
> Task :buildSrc:check UP-TO-DATE
> Task :buildSrc:build UP-TO-DATE
System Go installation: /snap/bin/go is go version go1.16.15 linux/amd64; Preparing to use /home/jenkins/go/bin/go1.20.2
GOCMD=/home/jenkins/go/bin/go1.20.2
go1.20.2: already downloaded in /home/jenkins/sdk/go1.20.2
> Task :sdks:go:container:copyLicenses
> Task :sdks:go:container:dockerClean UP-TO-DATE
> Task :sdks:go:container:goPrepare UP-TO-DATE
> Task :sdks:go:container:goBuild
/home/jenkins/go/bin/go1.20.2 build -o ./build/target/linux_amd64/boot boot.go boot_test.go
> Task :sdks:go:container:skipPullLicenses
> Task :sdks:go:container:dockerPrepare
#1 [internal] load build definition from Dockerfile
> Task :sdks:go:container:docker
#1 transferring dockerfile: 1.94kB done
#1 DONE 0.0s
#2 [internal] load .dockerignore
#2 transferring context: 2B done
#2 DONE 0.0s
#3 [internal] load metadata for docker.io/library/debian:bullseye
#3 DONE 0.6s
#4 [1/8] FROM docker.io/library/debian:bullseye@sha256:7b991788987ad860810df60927e1adbaf8e156520177bd4db82409f81dd3b721
#4 CACHED
#5 [internal] load build context
#5 transferring context: 22.20MB 0.2s done
#5 DONE 0.2s
#6 [2/8] RUN apt-get update && DEBIAN_FRONTEND=noninteractive apt-get install -y ca-certificates && rm -rf /var/lib/apt/lists/*
#6 1.659 Get:1 http://deb.debian.org/debian bullseye InRelease [116 kB]
#6 1.726 Get:2 http://deb.debian.org/debian-security bullseye-security InRelease [48.4 kB]
#6 1.726 Get:3 http://deb.debian.org/debian bullseye-updates InRelease [44.1 kB]
#6 2.114 Get:4 http://deb.debian.org/debian bullseye/main amd64 Packages [8183 kB]
#6 2.274 Get:5 http://deb.debian.org/debian-security bullseye-security/main amd64 Packages [236 kB]
#6 2.401 Get:6 http://deb.debian.org/debian bullseye-updates/main amd64 Packages [14.6 kB]
#6 3.623 Fetched 8642 kB in 2s (4231 kB/s)
#6 3.623 Reading package lists...
#6 4.342 Reading package lists...
#6 5.024 Building dependency tree...
#6 5.203 Reading state information...
#6 5.411 The following additional packages will be installed:
#6 5.411 openssl
#6 5.443 The following NEW packages will be installed:
#6 5.444 ca-certificates openssl
#6 5.490 0 upgraded, 2 newly installed, 0 to remove and 1 not upgraded.
#6 5.490 Need to get 1011 kB of archives.
#6 5.490 After this operation, 1892 kB of additional disk space will be used.
#6 5.490 Get:1 http://deb.debian.org/debian-security bullseye-security/main amd64 openssl amd64 1.1.1n-0+deb11u4 [853 kB]
#6 5.546 Get:2 http://deb.debian.org/debian bullseye/main amd64 ca-certificates all 20210119 [158 kB]
#6 5.954 debconf: delaying package configuration, since apt-utils is not installed
#6 5.994 Fetched 1011 kB in 0s (10.5 MB/s)
#6 6.107 Selecting previously unselected package openssl.
#6 6.107 (Reading database ... (Reading database ... 5%(Reading database ... 10%(Reading database ... 15%(Reading database ... 20%(Reading database ... 25%(Reading database ... 30%(Reading database ... 35%(Reading database ... 40%(Reading database ... 45%(Reading database ... 50%(Reading database ... 55%(Reading database ... 60%(Reading database ... 65%(Reading database ... 70%(Reading database ... 75%(Reading database ... 80%(Reading database ... 85%(Reading database ... 90%(Reading database ... 95%(Reading database ... 100%(Reading database ... 6661 files and directories currently installed.)
#6 6.156 Preparing to unpack .../openssl_1.1.1n-0+deb11u4_amd64.deb ...
#6 6.160 Unpacking openssl (1.1.1n-0+deb11u4) ...
#6 6.276 Selecting previously unselected package ca-certificates.
#6 6.278 Preparing to unpack .../ca-certificates_20210119_all.deb ...
#6 6.282 Unpacking ca-certificates (20210119) ...
#6 6.349 Setting up openssl (1.1.1n-0+deb11u4) ...
#6 6.366 Setting up ca-certificates (20210119) ...
#6 7.150 Updating certificates in /etc/ssl/certs...
#6 8.161 129 added, 0 removed; done.
#6 8.228 Processing triggers for ca-certificates (20210119) ...
#6 8.237 Updating certificates in /etc/ssl/certs...
#6 8.838 0 added, 0 removed; done.
#6 8.838 Running hooks in /etc/ca-certificates/update.d...
#6 8.859 done.
#6 DONE 9.1s
#7 [3/8] ADD target/linux_amd64/boot /opt/apache/beam/
#7 DONE 0.3s
#8 [4/8] COPY target/LICENSE /opt/apache/beam/
#8 DONE 0.1s
#9 [5/8] COPY target/NOTICE /opt/apache/beam/
#9 DONE 0.1s
#10 [6/8] COPY target/LICENSE target/go-licenses/* /opt/apache/beam/third_party_licenses/golang/
#10 ERROR: lstat /var/lib/docker/tmp/buildkit-mount232082155/target/go-licenses: no such file or directory
------
> Task :sdks:go:container:docker FAILED
> [6/8] COPY target/LICENSE target/go-licenses/* /opt/apache/beam/third_party_licenses/golang/:
------
ERROR: failed to solve: lstat /var/lib/docker/tmp/buildkit-mount232082155/target/go-licenses: no such file or directory
FAILURE: Build failed with an exception.
* What went wrong:
Execution failed for task ':sdks:go:container:docker'.
> Process 'command 'docker'' finished with non-zero exit value 1
16 actionable tasks: 5 executed, 11 up-to-date
* Try:
> Run with --stacktrace option to get the stack trace.
> Run with --info or --debug option to get more log output.
* Get more help at https://help.gradle.org
BUILD FAILED in 26s
Publishing build scan...
https://gradle.com/s/7qnh2tqvkyjpe
$ ./gradlew :sdks:go:container:docker -Pdocker-repository-root=us.gcr.io/apache-beam-testing/jenkins -Pdocker-tag=20230407-203457
> Task :goIntegrationTests FAILED
FAILURE: Build failed with an exception.
* What went wrong:
Execution failed for task ':goIntegrationTests'.
> Process 'command 'sh'' finished with non-zero exit value 1
* Try:
> Run with --stacktrace option to get the stack trace.
> Run with --info or --debug option to get more log output.
* Get more help at https://help.gradle.org
Deprecated Gradle features were used in this build, making it incompatible with Gradle 8.0.
You can use '--warning-mode all' to show the individual deprecation warnings and determine if they come from your own scripts or plugins.
See https://docs.gradle.org/7.5.1/userguide/command_line_interface.html#sec:command_line_warnings
BUILD FAILED in 1m 1s
91 actionable tasks: 55 executed, 34 from cache, 2 up-to-date
Publishing build scan...
https://gradle.com/s/uc55ocouyccio
Build step 'Invoke Gradle script' changed build result to FAILURE
Build step 'Invoke Gradle script' marked build as failure
---------------------------------------------------------------------
To unsubscribe, e-mail: builds-unsubscribe@beam.apache.org
For additional commands, e-mail: builds-help@beam.apache.org
Build failed in Jenkins: beam_PostCommit_Go #11140
Posted by Apache Jenkins Server <je...@builds.apache.org>.
See <https://ci-beam.apache.org/job/beam_PostCommit_Go/11140/display/redirect?page=changes>
Changes:
[noreply] Fix Jacoco not working for a few modules (#26125)
------------------------------------------
[...truncated 25.24 KB...]
> Task :sdks:java:expansion-service:processResources NO-SOURCE
> Task :sdks:java:expansion-service:classes UP-TO-DATE
> Task :sdks:java:expansion-service:jar
> Task :sdks:java:extensions:arrow:createCheckerFrameworkManifest
> Task :sdks:java:extensions:arrow:compileJava FROM-CACHE
> Task :sdks:java:extensions:arrow:processResources NO-SOURCE
> Task :sdks:java:extensions:arrow:classes UP-TO-DATE
> Task :sdks:java:extensions:arrow:jar
> Task :sdks:java:extensions:protobuf:createCheckerFrameworkManifest
> Task :sdks:java:extensions:protobuf:extractIncludeProto
> Task :sdks:java:extensions:protobuf:extractProto
> Task :sdks:java:extensions:protobuf:generateProto NO-SOURCE
> Task :sdks:java:extensions:protobuf:compileJava FROM-CACHE
> Task :sdks:java:extensions:protobuf:processResources NO-SOURCE
> Task :sdks:java:extensions:protobuf:classes UP-TO-DATE
> Task :sdks:java:extensions:protobuf:jar
> Task :sdks:java:io:google-cloud-platform:createCheckerFrameworkManifest
> Task :sdks:java:io:google-cloud-platform:compileJava FROM-CACHE
> Task :sdks:java:io:google-cloud-platform:processResources NO-SOURCE
> Task :sdks:java:io:google-cloud-platform:classes UP-TO-DATE
> Task :sdks:java:io:google-cloud-platform:jar
> Task :sdks:java:io:kafka:createCheckerFrameworkManifest
> Task :sdks:java:io:kafka:compileJava FROM-CACHE
> Task :sdks:java:io:kafka:processResources NO-SOURCE
> Task :sdks:java:io:kafka:classes UP-TO-DATE
> Task :sdks:java:io:kafka:jar
> Task :runners:google-cloud-dataflow-java:compileJava FROM-CACHE
> Task :runners:google-cloud-dataflow-java:processResources
> Task :runners:google-cloud-dataflow-java:classes
> Task :runners:google-cloud-dataflow-java:jar
> Task :runners:google-cloud-dataflow-java:worker:createCheckerFrameworkManifest
> Task :runners:google-cloud-dataflow-java:worker:windmill:createCheckerFrameworkManifest
> Task :runners:google-cloud-dataflow-java:worker:windmill:extractIncludeProto
> Task :runners:google-cloud-dataflow-java:worker:windmill:extractProto
> Task :runners:google-cloud-dataflow-java:worker:windmill:generateProto FROM-CACHE
> Task :runners:google-cloud-dataflow-java:worker:windmill:compileJava FROM-CACHE
> Task :runners:google-cloud-dataflow-java:worker:windmill:processResources
> Task :runners:google-cloud-dataflow-java:worker:windmill:classes
> Task :runners:google-cloud-dataflow-java:worker:windmill:shadowJar FROM-CACHE
> Task :runners:google-cloud-dataflow-java:worker:compileJava FROM-CACHE
> Task :runners:google-cloud-dataflow-java:worker:processResources
> Task :runners:google-cloud-dataflow-java:worker:classes
> Task :runners:google-cloud-dataflow-java:worker:shadowJar FROM-CACHE
> Task :sdks:go:test:assemble UP-TO-DATE
> Task :sdks:go:test:test UP-TO-DATE
> Task :sdks:go:test:check UP-TO-DATE
> Task :sdks:go:test:build UP-TO-DATE
> Task :goIntegrationTests
$ CURRENT_DIRECTORY=<https://ci-beam.apache.org/job/beam_PostCommit_Go/ws/src/sdks/go/test>
$ TESTS=./test/integration/... ./test/regression
$ RUNNER=portable
$ TIMEOUT=3h
$ SIMULTANEOUS=3
$ GCS_LOCATION=gs://temp-storage-for-end-to-end-tests
$ GCS_SUBFOLDER=test9454
$ PROJECT=apache-beam-testing
$ DATAFLOW_PROJECT=apache-beam-testing
$ REGION=us-central1
$ trap exit_background_processes SIGINT SIGTERM EXIT
$ key=--runner
$ case --runner in
$ RUNNER=dataflow
$ cd <https://ci-beam.apache.org/job/beam_PostCommit_Go/ws/src>
$ test -d sdks/go/test
$ command -v docker
/usr/bin/docker
$ docker -v
Docker version 20.10.23, build 7155243
$ command -v gcloud
/usr/bin/gcloud
$ gcloud --version
Google Cloud SDK 406.0.0
alpha 2022.10.17
beta 2022.10.17
bq 2.0.79
bundled-python3-unix 3.9.12
core 2022.10.17
gcloud-crc32c 1.0.0
gsutil 5.14
$ TMPDIR=/tmp/tmp.WopRANjDD0
$ gcloud_ver=406.0.0
$ TAG=20230407-143540
$ CONTAINER=us.gcr.io/apache-beam-testing/jenkins/beam_go_sdk
Using container us.gcr.io/apache-beam-testing/jenkins/beam_go_sdk
$ ./gradlew :sdks:go:container:docker -Pdocker-repository-root=us.gcr.io/apache-beam-testing/jenkins -Pdocker-tag=20230407-143540
To honour the JVM settings for this build a single-use Daemon process will be forked. See https://docs.gradle.org/7.5.1/userguide/gradle_daemon.html#sec:disabling_the_daemon.
Daemon will be stopped at the end of the build
Configuration on demand is an incubating feature.
> Task :buildSrc:compileJava NO-SOURCE
> Task :buildSrc:compileGroovy UP-TO-DATE
> Task :buildSrc:pluginDescriptors UP-TO-DATE
> Task :buildSrc:processResources UP-TO-DATE
> Task :buildSrc:classes UP-TO-DATE
> Task :buildSrc:jar UP-TO-DATE
> Task :buildSrc:assemble UP-TO-DATE
> Task :buildSrc:spotlessGroovy UP-TO-DATE
> Task :buildSrc:spotlessGroovyCheck UP-TO-DATE
> Task :buildSrc:spotlessGroovyGradle UP-TO-DATE
> Task :buildSrc:spotlessGroovyGradleCheck UP-TO-DATE
> Task :buildSrc:spotlessCheck UP-TO-DATE
> Task :buildSrc:pluginUnderTestMetadata UP-TO-DATE
> Task :buildSrc:compileTestJava NO-SOURCE
> Task :buildSrc:compileTestGroovy NO-SOURCE
> Task :buildSrc:processTestResources NO-SOURCE
> Task :buildSrc:testClasses UP-TO-DATE
> Task :buildSrc:test NO-SOURCE
> Task :buildSrc:validatePlugins UP-TO-DATE
> Task :buildSrc:check UP-TO-DATE
> Task :buildSrc:build UP-TO-DATE
System Go installation: /snap/bin/go is go version go1.16.15 linux/amd64; Preparing to use /home/jenkins/go/bin/go1.20.2
GOCMD=/home/jenkins/go/bin/go1.20.2
go1.20.2: already downloaded in /home/jenkins/sdk/go1.20.2
> Task :sdks:go:container:copyLicenses
> Task :sdks:go:container:dockerClean UP-TO-DATE
> Task :sdks:go:container:goPrepare UP-TO-DATE
> Task :sdks:go:container:goBuild
/home/jenkins/go/bin/go1.20.2 build -o ./build/target/linux_amd64/boot boot.go boot_test.go
> Task :sdks:go:container:skipPullLicenses
> Task :sdks:go:container:dockerPrepare
#1 [internal] load build definition from Dockerfile
#1 transferring dockerfile: 1.94kB done
#1 DONE 0.0s
#2 [internal] load .dockerignore
#2 transferring context: 2B done
#2 DONE 0.0s
#3 [internal] load metadata for docker.io/library/debian:bullseye
> Task :sdks:go:container:docker
#3 DONE 0.3s
#4 [1/8] FROM docker.io/library/debian:bullseye@sha256:7b991788987ad860810df60927e1adbaf8e156520177bd4db82409f81dd3b721
#4 CACHED
#5 [internal] load build context
#5 transferring context: 22.20MB 0.5s done
#5 DONE 0.5s
#6 [2/8] RUN apt-get update && DEBIAN_FRONTEND=noninteractive apt-get install -y ca-certificates && rm -rf /var/lib/apt/lists/*
#6 0.762 Get:1 http://deb.debian.org/debian bullseye InRelease [116 kB]
#6 0.867 Get:2 http://deb.debian.org/debian-security bullseye-security InRelease [48.4 kB]
#6 0.907 Get:3 http://deb.debian.org/debian bullseye-updates InRelease [44.1 kB]
#6 1.443 Get:4 http://deb.debian.org/debian bullseye/main amd64 Packages [8183 kB]
#6 1.995 Get:5 http://deb.debian.org/debian-security bullseye-security/main amd64 Packages [236 kB]
#6 2.443 Get:6 http://deb.debian.org/debian bullseye-updates/main amd64 Packages [14.6 kB]
#6 3.526 Fetched 8642 kB in 3s (3045 kB/s)
#6 3.526 Reading package lists...
#6 4.371 Reading package lists...
#6 5.157 Building dependency tree...
#6 5.392 Reading state information...
#6 5.612 The following additional packages will be installed:
#6 5.612 openssl
#6 5.638 The following NEW packages will be installed:
#6 5.639 ca-certificates openssl
#6 5.744 0 upgraded, 2 newly installed, 0 to remove and 1 not upgraded.
#6 5.744 Need to get 1011 kB of archives.
#6 5.744 After this operation, 1892 kB of additional disk space will be used.
#6 5.744 Get:1 http://deb.debian.org/debian-security bullseye-security/main amd64 openssl amd64 1.1.1n-0+deb11u4 [853 kB]
#6 5.918 Get:2 http://deb.debian.org/debian bullseye/main amd64 ca-certificates all 20210119 [158 kB]
#6 6.119 debconf: delaying package configuration, since apt-utils is not installed
#6 6.168 Fetched 1011 kB in 0s (3666 kB/s)
#6 6.211 Selecting previously unselected package openssl.
#6 6.212 (Reading database ... (Reading database ... 5%(Reading database ... 10%(Reading database ... 15%(Reading database ... 20%(Reading database ... 25%(Reading database ... 30%(Reading database ... 35%(Reading database ... 40%(Reading database ... 45%(Reading database ... 50%(Reading database ... 55%(Reading database ... 60%(Reading database ... 65%(Reading database ... 70%(Reading database ... 75%(Reading database ... 80%(Reading database ... 85%(Reading database ... 90%(Reading database ... 95%(Reading database ... 100%(Reading database ... 6661 files and directories currently installed.)
#6 6.225 Preparing to unpack .../openssl_1.1.1n-0+deb11u4_amd64.deb ...
#6 6.230 Unpacking openssl (1.1.1n-0+deb11u4) ...
#6 6.469 Selecting previously unselected package ca-certificates.
#6 6.471 Preparing to unpack .../ca-certificates_20210119_all.deb ...
#6 6.487 Unpacking ca-certificates (20210119) ...
#6 6.625 Setting up openssl (1.1.1n-0+deb11u4) ...
#6 6.661 Setting up ca-certificates (20210119) ...
#6 10.27 Updating certificates in /etc/ssl/certs...
#6 13.16 129 added, 0 removed; done.
#6 13.26 Processing triggers for ca-certificates (20210119) ...
#6 13.29 Updating certificates in /etc/ssl/certs...
#6 17.24 0 added, 0 removed; done.
#6 17.24 Running hooks in /etc/ca-certificates/update.d...
#6 17.25 done.
#6 DONE 18.2s
#7 [3/8] ADD target/linux_amd64/boot /opt/apache/beam/
#7 DONE 0.3s
#8 [4/8] COPY target/LICENSE /opt/apache/beam/
#8 DONE 0.1s
#9 [5/8] COPY target/NOTICE /opt/apache/beam/
#9 DONE 0.0s
#10 [6/8] COPY target/LICENSE target/go-licenses/* /opt/apache/beam/third_party_licenses/golang/
#10 ERROR: lstat /var/lib/docker/tmp/buildkit-mount1325951018/target/go-licenses: no such file or directory
------
> [6/8] COPY target/LICENSE target/go-licenses/* /opt/apache/beam/third_party_licenses/golang/:
------
ERROR: failed to solve: lstat /var/lib/docker/tmp/buildkit-mount1325951018/target/go-licenses: no such file or directory
> Task :sdks:go:container:docker FAILED
16 actionable tasks: 5 executed, 11 up-to-date
FAILURE: Build failed with an exception.
* What went wrong:
Execution failed for task ':sdks:go:container:docker'.
> Process 'command 'docker'' finished with non-zero exit value 1
* Try:
> Run with --stacktrace option to get the stack trace.
> Run with --info or --debug option to get more log output.
* Get more help at https://help.gradle.org
BUILD FAILED in 51s
Publishing build scan...
https://gradle.com/s/bvnixx5qbbjzi
$ ./gradlew :sdks:go:container:docker -Pdocker-repository-root=us.gcr.io/apache-beam-testing/jenkins -Pdocker-tag=20230407-143540
> Task :goIntegrationTests FAILED
FAILURE: Build failed with an exception.
* What went wrong:
Execution failed for task ':goIntegrationTests'.
> Process 'command 'sh'' finished with non-zero exit value 1
* Try:
> Run with --stacktrace option to get the stack trace.
> Run with --info or --debug option to get more log output.
* Get more help at https://help.gradle.org
Deprecated Gradle features were used in this build, making it incompatible with Gradle 8.0.
You can use '--warning-mode all' to show the individual deprecation warnings and determine if they come from your own scripts or plugins.
See https://docs.gradle.org/7.5.1/userguide/command_line_interface.html#sec:command_line_warnings
BUILD FAILED in 2m 3s
91 actionable tasks: 55 executed, 34 from cache, 2 up-to-date
Publishing build scan...
https://gradle.com/s/nur6ssyn5tgsa
Build step 'Invoke Gradle script' changed build result to FAILURE
Build step 'Invoke Gradle script' marked build as failure
---------------------------------------------------------------------
To unsubscribe, e-mail: builds-unsubscribe@beam.apache.org
For additional commands, e-mail: builds-help@beam.apache.org
Build failed in Jenkins: beam_PostCommit_Go #11139
Posted by Apache Jenkins Server <je...@builds.apache.org>.
See <https://ci-beam.apache.org/job/beam_PostCommit_Go/11139/display/redirect>
Changes:
------------------------------------------
[...truncated 36.24 KB...]
> Task :sdks:java:expansion-service:processResources NO-SOURCE
> Task :sdks:java:expansion-service:classes UP-TO-DATE
> Task :sdks:java:expansion-service:jar
> Task :sdks:java:extensions:arrow:createCheckerFrameworkManifest
> Task :sdks:java:extensions:arrow:compileJava FROM-CACHE
> Task :sdks:java:extensions:arrow:processResources NO-SOURCE
> Task :sdks:java:extensions:arrow:classes UP-TO-DATE
> Task :sdks:java:extensions:arrow:jar
> Task :sdks:java:extensions:protobuf:createCheckerFrameworkManifest
> Task :sdks:java:extensions:protobuf:extractIncludeProto
> Task :sdks:java:extensions:protobuf:extractProto
> Task :sdks:java:extensions:protobuf:generateProto NO-SOURCE
> Task :sdks:java:extensions:protobuf:compileJava FROM-CACHE
> Task :sdks:java:extensions:protobuf:processResources NO-SOURCE
> Task :sdks:java:extensions:protobuf:classes UP-TO-DATE
> Task :sdks:java:extensions:protobuf:jar
> Task :sdks:java:io:google-cloud-platform:createCheckerFrameworkManifest
> Task :sdks:java:io:google-cloud-platform:compileJava FROM-CACHE
> Task :sdks:java:io:google-cloud-platform:processResources NO-SOURCE
> Task :sdks:java:io:google-cloud-platform:classes UP-TO-DATE
> Task :sdks:java:io:google-cloud-platform:jar
> Task :sdks:java:io:kafka:createCheckerFrameworkManifest
> Task :sdks:java:io:kafka:compileJava FROM-CACHE
> Task :sdks:java:io:kafka:processResources NO-SOURCE
> Task :sdks:java:io:kafka:classes UP-TO-DATE
> Task :sdks:java:io:kafka:jar
> Task :runners:google-cloud-dataflow-java:compileJava FROM-CACHE
> Task :runners:google-cloud-dataflow-java:processResources
> Task :runners:google-cloud-dataflow-java:classes
> Task :runners:google-cloud-dataflow-java:jar
> Task :runners:google-cloud-dataflow-java:worker:createCheckerFrameworkManifest
> Task :runners:google-cloud-dataflow-java:worker:windmill:createCheckerFrameworkManifest
> Task :runners:google-cloud-dataflow-java:worker:windmill:extractIncludeProto
> Task :runners:google-cloud-dataflow-java:worker:windmill:extractProto
> Task :runners:google-cloud-dataflow-java:worker:windmill:generateProto FROM-CACHE
> Task :runners:google-cloud-dataflow-java:worker:windmill:compileJava FROM-CACHE
> Task :runners:google-cloud-dataflow-java:worker:windmill:processResources
> Task :runners:google-cloud-dataflow-java:worker:windmill:classes
> Task :runners:google-cloud-dataflow-java:worker:windmill:shadowJar FROM-CACHE
> Task :runners:google-cloud-dataflow-java:worker:compileJava FROM-CACHE
> Task :runners:google-cloud-dataflow-java:worker:processResources
> Task :runners:google-cloud-dataflow-java:worker:classes
> Task :runners:google-cloud-dataflow-java:worker:shadowJar FROM-CACHE
> Task :sdks:go:test:assemble UP-TO-DATE
> Task :sdks:go:test:test UP-TO-DATE
> Task :sdks:go:test:check UP-TO-DATE
> Task :sdks:go:test:build UP-TO-DATE
> Task :goIntegrationTests
$ CURRENT_DIRECTORY=<https://ci-beam.apache.org/job/beam_PostCommit_Go/ws/src/sdks/go/test>
$ TESTS=./test/integration/... ./test/regression
$ RUNNER=portable
$ TIMEOUT=3h
$ SIMULTANEOUS=3
$ GCS_LOCATION=gs://temp-storage-for-end-to-end-tests
$ GCS_SUBFOLDER=test10459
$ PROJECT=apache-beam-testing
$ DATAFLOW_PROJECT=apache-beam-testing
$ REGION=us-central1
$ trap exit_background_processes SIGINT SIGTERM EXIT
$ key=--runner
$ case --runner in
$ RUNNER=dataflow
$ cd <https://ci-beam.apache.org/job/beam_PostCommit_Go/ws/src>
$ test -d sdks/go/test
$ command -v docker
/usr/bin/docker
$ docker -v
Docker version 20.10.23, build 7155243
$ command -v gcloud
/usr/bin/gcloud
$ gcloud --version
Google Cloud SDK 406.0.0
alpha 2022.10.17
beta 2022.10.17
bq 2.0.79
bundled-python3-unix 3.9.12
core 2022.10.17
gcloud-crc32c 1.0.0
gsutil 5.14
$ TMPDIR=/tmp/tmp.DVgMP7hyUY
$ gcloud_ver=406.0.0
$ TAG=20230407-083500
$ CONTAINER=us.gcr.io/apache-beam-testing/jenkins/beam_go_sdk
Using container us.gcr.io/apache-beam-testing/jenkins/beam_go_sdk
$ ./gradlew :sdks:go:container:docker -Pdocker-repository-root=us.gcr.io/apache-beam-testing/jenkins -Pdocker-tag=20230407-083500
To honour the JVM settings for this build a single-use Daemon process will be forked. See https://docs.gradle.org/7.5.1/userguide/gradle_daemon.html#sec:disabling_the_daemon.
Daemon will be stopped at the end of the build
Configuration on demand is an incubating feature.
> Task :buildSrc:compileJava NO-SOURCE
> Task :buildSrc:compileGroovy UP-TO-DATE
> Task :buildSrc:pluginDescriptors UP-TO-DATE
> Task :buildSrc:processResources UP-TO-DATE
> Task :buildSrc:classes UP-TO-DATE
> Task :buildSrc:jar UP-TO-DATE
> Task :buildSrc:assemble UP-TO-DATE
> Task :buildSrc:spotlessGroovy UP-TO-DATE
> Task :buildSrc:spotlessGroovyCheck UP-TO-DATE
> Task :buildSrc:spotlessGroovyGradle UP-TO-DATE
> Task :buildSrc:spotlessGroovyGradleCheck UP-TO-DATE
> Task :buildSrc:spotlessCheck UP-TO-DATE
> Task :buildSrc:pluginUnderTestMetadata UP-TO-DATE
> Task :buildSrc:compileTestJava NO-SOURCE
> Task :buildSrc:compileTestGroovy NO-SOURCE
> Task :buildSrc:processTestResources NO-SOURCE
> Task :buildSrc:testClasses UP-TO-DATE
> Task :buildSrc:test NO-SOURCE
> Task :buildSrc:validatePlugins UP-TO-DATE
> Task :buildSrc:check UP-TO-DATE
> Task :buildSrc:build UP-TO-DATE
System Go installation: /snap/bin/go is go version go1.16.15 linux/amd64; Preparing to use /home/jenkins/go/bin/go1.20.2
go1.20.2: already downloaded in /home/jenkins/sdk/go1.20.2
GOCMD=/home/jenkins/go/bin/go1.20.2
> Task :sdks:go:container:copyLicenses
> Task :sdks:go:container:dockerClean UP-TO-DATE
> Task :sdks:go:container:goPrepare UP-TO-DATE
> Task :sdks:go:container:goBuild
/home/jenkins/go/bin/go1.20.2 build -o ./build/target/linux_amd64/boot boot.go boot_test.go
> Task :sdks:go:container:skipPullLicenses
> Task :sdks:go:container:dockerPrepare
#1 [internal] load build definition from Dockerfile
> Task :sdks:go:container:docker
#1 transferring dockerfile: 1.94kB done
#1 DONE 0.0s
#2 [internal] load .dockerignore
#2 transferring context: 2B done
#2 DONE 0.0s
#3 [internal] load metadata for docker.io/library/debian:bullseye
#3 DONE 0.3s
#4 [1/8] FROM docker.io/library/debian:bullseye@sha256:7b991788987ad860810df60927e1adbaf8e156520177bd4db82409f81dd3b721
#4 CACHED
#5 [internal] load build context
#5 transferring context: 22.20MB 0.2s done
#5 DONE 0.2s
#6 [2/8] RUN apt-get update && DEBIAN_FRONTEND=noninteractive apt-get install -y ca-certificates && rm -rf /var/lib/apt/lists/*
#6 1.711 Get:1 http://deb.debian.org/debian bullseye InRelease [116 kB]
#6 1.788 Get:2 http://deb.debian.org/debian-security bullseye-security InRelease [48.4 kB]
#6 1.832 Get:3 http://deb.debian.org/debian bullseye-updates InRelease [44.1 kB]
#6 2.260 Get:4 http://deb.debian.org/debian bullseye/main amd64 Packages [8183 kB]
#6 2.555 Get:5 http://deb.debian.org/debian-security bullseye-security/main amd64 Packages [236 kB]
#6 2.557 Get:6 http://deb.debian.org/debian bullseye-updates/main amd64 Packages [14.6 kB]
#6 4.004 Fetched 8642 kB in 3s (3427 kB/s)
#6 4.004 Reading package lists...
#6 4.676 Reading package lists...
#6 5.319 Building dependency tree...
#6 5.484 Reading state information...
#6 5.690 The following additional packages will be installed:
#6 5.691 openssl
#6 5.715 The following NEW packages will be installed:
#6 5.716 ca-certificates openssl
#6 5.811 0 upgraded, 2 newly installed, 0 to remove and 1 not upgraded.
#6 5.811 Need to get 1011 kB of archives.
#6 5.811 After this operation, 1892 kB of additional disk space will be used.
#6 5.811 Get:1 http://deb.debian.org/debian-security bullseye-security/main amd64 openssl amd64 1.1.1n-0+deb11u4 [853 kB]
#6 6.012 Get:2 http://deb.debian.org/debian bullseye/main amd64 ca-certificates all 20210119 [158 kB]
#6 6.860 debconf: delaying package configuration, since apt-utils is not installed
#6 6.917 Fetched 1011 kB in 0s (3448 kB/s)
#6 7.112 Selecting previously unselected package openssl.
#6 7.112 (Reading database ... (Reading database ... 5%(Reading database ... 10%(Reading database ... 15%(Reading database ... 20%(Reading database ... 25%(Reading database ... 30%(Reading database ... 35%(Reading database ... 40%(Reading database ... 45%(Reading database ... 50%(Reading database ... 55%(Reading database ... 60%(Reading database ... 65%(Reading database ... 70%(Reading database ... 75%(Reading database ... 80%(Reading database ... 85%(Reading database ... 90%(Reading database ... 95%(Reading database ... 100%(Reading database ... 6661 files and directories currently installed.)
#6 7.293 Preparing to unpack .../openssl_1.1.1n-0+deb11u4_amd64.deb ...
#6 7.298 Unpacking openssl (1.1.1n-0+deb11u4) ...
#6 7.517 Selecting previously unselected package ca-certificates.
#6 7.519 Preparing to unpack .../ca-certificates_20210119_all.deb ...
#6 7.523 Unpacking ca-certificates (20210119) ...
#6 7.616 Setting up openssl (1.1.1n-0+deb11u4) ...
#6 7.632 Setting up ca-certificates (20210119) ...
#6 8.547 Updating certificates in /etc/ssl/certs...
#6 9.363 129 added, 0 removed; done.
#6 9.430 Processing triggers for ca-certificates (20210119) ...
#6 9.439 Updating certificates in /etc/ssl/certs...
#6 9.999 0 added, 0 removed; done.
#6 9.999 Running hooks in /etc/ca-certificates/update.d...
#6 10.00 done.
#6 DONE 10.6s
#7 [3/8] ADD target/linux_amd64/boot /opt/apache/beam/
#7 DONE 0.3s
#8 [4/8] COPY target/LICENSE /opt/apache/beam/
#8 DONE 0.1s
#9 [5/8] COPY target/NOTICE /opt/apache/beam/
#9 DONE 0.1s
#10 [6/8] COPY target/LICENSE target/go-licenses/* /opt/apache/beam/third_party_licenses/golang/
#10 ERROR: lstat /var/lib/docker/tmp/buildkit-mount3684419008/target/go-licenses: no such file or directory
------
> [6/8] COPY target/LICENSE target/go-licenses/* /opt/apache/beam/third_party_licenses/golang/:
------
ERROR: failed to solve: lstat /var/lib/docker/tmp/buildkit-mount3684419008/target/go-licenses: no such file or directory
> Task :sdks:go:container:docker FAILED
FAILURE: Build failed with an exception.
* What went wrong:
Execution failed for task ':sdks:go:container:docker'.
> Process 'command 'docker'' finished with non-zero exit value 1
* Try:
> Run with --stacktrace option to get the stack trace.
16 actionable tasks: 5 executed, 11 up-to-date
> Run with --info or --debug option to get more log output.
* Get more help at https://help.gradle.org
BUILD FAILED in 31s
Publishing build scan...
https://gradle.com/s/z5fy3yjdsybay
$ ./gradlew :sdks:go:container:docker -Pdocker-repository-root=us.gcr.io/apache-beam-testing/jenkins -Pdocker-tag=20230407-083500
> Task :goIntegrationTests FAILED
FAILURE: Build failed with an exception.
* What went wrong:
Execution failed for task ':goIntegrationTests'.
> Process 'command 'sh'' finished with non-zero exit value 1
* Try:
> Run with --stacktrace option to get the stack trace.
> Run with --info or --debug option to get more log output.
* Get more help at https://help.gradle.org
Deprecated Gradle features were used in this build, making it incompatible with Gradle 8.0.
You can use '--warning-mode all' to show the individual deprecation warnings and determine if they come from your own scripts or plugins.
See https://docs.gradle.org/7.5.1/userguide/command_line_interface.html#sec:command_line_warnings
BUILD FAILED in 1m 7s
91 actionable tasks: 55 executed, 34 from cache, 2 up-to-date
Publishing build scan...
https://gradle.com/s/dfouks4y7o2be
Build step 'Invoke Gradle script' changed build result to FAILURE
Build step 'Invoke Gradle script' marked build as failure
---------------------------------------------------------------------
To unsubscribe, e-mail: builds-unsubscribe@beam.apache.org
For additional commands, e-mail: builds-help@beam.apache.org
Build failed in Jenkins: beam_PostCommit_Go #11138
Posted by Apache Jenkins Server <je...@builds.apache.org>.
See <https://ci-beam.apache.org/job/beam_PostCommit_Go/11138/display/redirect>
Changes:
------------------------------------------
[...truncated 36.27 KB...]
> Task :sdks:java:expansion-service:processResources NO-SOURCE
> Task :sdks:java:expansion-service:classes UP-TO-DATE
> Task :sdks:java:expansion-service:jar
> Task :sdks:java:extensions:arrow:createCheckerFrameworkManifest
> Task :sdks:java:extensions:arrow:compileJava FROM-CACHE
> Task :sdks:java:extensions:arrow:processResources NO-SOURCE
> Task :sdks:java:extensions:arrow:classes UP-TO-DATE
> Task :sdks:java:extensions:arrow:jar
> Task :sdks:java:extensions:protobuf:createCheckerFrameworkManifest
> Task :sdks:java:extensions:protobuf:extractIncludeProto
> Task :sdks:java:extensions:protobuf:extractProto
> Task :sdks:java:extensions:protobuf:generateProto NO-SOURCE
> Task :sdks:java:extensions:protobuf:compileJava FROM-CACHE
> Task :sdks:java:extensions:protobuf:processResources NO-SOURCE
> Task :sdks:java:extensions:protobuf:classes UP-TO-DATE
> Task :sdks:java:extensions:protobuf:jar
> Task :sdks:java:io:google-cloud-platform:createCheckerFrameworkManifest
> Task :sdks:java:io:google-cloud-platform:compileJava FROM-CACHE
> Task :sdks:java:io:google-cloud-platform:processResources NO-SOURCE
> Task :sdks:java:io:google-cloud-platform:classes UP-TO-DATE
> Task :sdks:java:io:google-cloud-platform:jar
> Task :sdks:java:io:kafka:createCheckerFrameworkManifest
> Task :sdks:java:io:kafka:compileJava FROM-CACHE
> Task :sdks:java:io:kafka:processResources NO-SOURCE
> Task :sdks:java:io:kafka:classes UP-TO-DATE
> Task :sdks:java:io:kafka:jar
> Task :runners:google-cloud-dataflow-java:compileJava FROM-CACHE
> Task :runners:google-cloud-dataflow-java:processResources
> Task :runners:google-cloud-dataflow-java:classes
> Task :runners:google-cloud-dataflow-java:jar
> Task :runners:google-cloud-dataflow-java:worker:createCheckerFrameworkManifest
> Task :runners:google-cloud-dataflow-java:worker:windmill:createCheckerFrameworkManifest
> Task :runners:google-cloud-dataflow-java:worker:windmill:extractIncludeProto
> Task :runners:google-cloud-dataflow-java:worker:windmill:extractProto
> Task :runners:google-cloud-dataflow-java:worker:windmill:generateProto FROM-CACHE
> Task :runners:google-cloud-dataflow-java:worker:windmill:compileJava FROM-CACHE
> Task :runners:google-cloud-dataflow-java:worker:windmill:processResources
> Task :runners:google-cloud-dataflow-java:worker:windmill:classes
> Task :runners:google-cloud-dataflow-java:worker:windmill:shadowJar FROM-CACHE
> Task :runners:google-cloud-dataflow-java:worker:compileJava FROM-CACHE
> Task :runners:google-cloud-dataflow-java:worker:processResources
> Task :runners:google-cloud-dataflow-java:worker:classes
> Task :runners:google-cloud-dataflow-java:worker:shadowJar FROM-CACHE
> Task :sdks:go:test:assemble UP-TO-DATE
> Task :sdks:go:test:test UP-TO-DATE
> Task :sdks:go:test:check UP-TO-DATE
> Task :sdks:go:test:build UP-TO-DATE
> Task :goIntegrationTests
$ CURRENT_DIRECTORY=<https://ci-beam.apache.org/job/beam_PostCommit_Go/ws/src/sdks/go/test>
$ TESTS=./test/integration/... ./test/regression
$ RUNNER=portable
$ TIMEOUT=3h
$ SIMULTANEOUS=3
$ GCS_LOCATION=gs://temp-storage-for-end-to-end-tests
$ GCS_SUBFOLDER=test22986
$ PROJECT=apache-beam-testing
$ DATAFLOW_PROJECT=apache-beam-testing
$ REGION=us-central1
$ trap exit_background_processes SIGINT SIGTERM EXIT
$ key=--runner
$ case --runner in
$ RUNNER=dataflow
$ cd <https://ci-beam.apache.org/job/beam_PostCommit_Go/ws/src>
$ test -d sdks/go/test
$ command -v docker
/usr/bin/docker
$ docker -v
Docker version 20.10.23, build 7155243
$ command -v gcloud
/usr/bin/gcloud
$ gcloud --version
Google Cloud SDK 406.0.0
alpha 2022.10.17
beta 2022.10.17
bq 2.0.79
bundled-python3-unix 3.9.12
core 2022.10.17
gcloud-crc32c 1.0.0
gsutil 5.14
$ TMPDIR=/tmp/tmp.Qv13Emvu7Q
$ gcloud_ver=406.0.0
$ TAG=20230407-023459
$ CONTAINER=us.gcr.io/apache-beam-testing/jenkins/beam_go_sdk
Using container us.gcr.io/apache-beam-testing/jenkins/beam_go_sdk
$ ./gradlew :sdks:go:container:docker -Pdocker-repository-root=us.gcr.io/apache-beam-testing/jenkins -Pdocker-tag=20230407-023459
To honour the JVM settings for this build a single-use Daemon process will be forked. See https://docs.gradle.org/7.5.1/userguide/gradle_daemon.html#sec:disabling_the_daemon.
Daemon will be stopped at the end of the build
Configuration on demand is an incubating feature.
> Task :buildSrc:compileJava NO-SOURCE
> Task :buildSrc:compileGroovy UP-TO-DATE
> Task :buildSrc:pluginDescriptors UP-TO-DATE
> Task :buildSrc:processResources UP-TO-DATE
> Task :buildSrc:classes UP-TO-DATE
> Task :buildSrc:jar UP-TO-DATE
> Task :buildSrc:assemble UP-TO-DATE
> Task :buildSrc:spotlessGroovy UP-TO-DATE
> Task :buildSrc:spotlessGroovyCheck UP-TO-DATE
> Task :buildSrc:spotlessGroovyGradle UP-TO-DATE
> Task :buildSrc:spotlessGroovyGradleCheck UP-TO-DATE
> Task :buildSrc:spotlessCheck UP-TO-DATE
> Task :buildSrc:pluginUnderTestMetadata UP-TO-DATE
> Task :buildSrc:compileTestJava NO-SOURCE
> Task :buildSrc:compileTestGroovy NO-SOURCE
> Task :buildSrc:processTestResources NO-SOURCE
> Task :buildSrc:testClasses UP-TO-DATE
> Task :buildSrc:test NO-SOURCE
> Task :buildSrc:validatePlugins UP-TO-DATE
> Task :buildSrc:check UP-TO-DATE
> Task :buildSrc:build UP-TO-DATE
System Go installation: /snap/bin/go is go version go1.16.15 linux/amd64; Preparing to use /home/jenkins/go/bin/go1.20.2
GOCMD=/home/jenkins/go/bin/go1.20.2
go1.20.2: already downloaded in /home/jenkins/sdk/go1.20.2
> Task :sdks:go:container:copyLicenses
> Task :sdks:go:container:dockerClean UP-TO-DATE
> Task :sdks:go:container:goPrepare UP-TO-DATE
> Task :sdks:go:container:goBuild
/home/jenkins/go/bin/go1.20.2 build -o ./build/target/linux_amd64/boot boot.go boot_test.go
> Task :sdks:go:container:skipPullLicenses
> Task :sdks:go:container:dockerPrepare
#1 [internal] load build definition from Dockerfile
> Task :sdks:go:container:docker
#1 transferring dockerfile: 1.94kB done
#1 DONE 0.0s
#2 [internal] load .dockerignore
#2 transferring context: 2B done
#2 DONE 0.0s
#3 [internal] load metadata for docker.io/library/debian:bullseye
#3 DONE 0.3s
#4 [1/8] FROM docker.io/library/debian:bullseye@sha256:7b991788987ad860810df60927e1adbaf8e156520177bd4db82409f81dd3b721
#4 CACHED
#5 [internal] load build context
#5 transferring context: 22.20MB 0.2s done
#5 DONE 0.2s
#6 [2/8] RUN apt-get update && DEBIAN_FRONTEND=noninteractive apt-get install -y ca-certificates && rm -rf /var/lib/apt/lists/*
#6 1.547 Get:1 http://deb.debian.org/debian bullseye InRelease [116 kB]
#6 1.621 Get:2 http://deb.debian.org/debian-security bullseye-security InRelease [48.4 kB]
#6 1.655 Get:3 http://deb.debian.org/debian bullseye-updates InRelease [44.1 kB]
#6 2.205 Get:4 http://deb.debian.org/debian bullseye/main amd64 Packages [8183 kB]
#6 2.481 Get:5 http://deb.debian.org/debian-security bullseye-security/main amd64 Packages [236 kB]
#6 2.515 Get:6 http://deb.debian.org/debian bullseye-updates/main amd64 Packages [14.6 kB]
#6 3.796 Fetched 8642 kB in 2s (3553 kB/s)
#6 3.796 Reading package lists...
#6 4.542 Reading package lists...
#6 5.235 Building dependency tree...
#6 5.427 Reading state information...
#6 5.675 The following additional packages will be installed:
#6 5.675 openssl
#6 5.708 The following NEW packages will be installed:
#6 5.710 ca-certificates openssl
#6 5.802 0 upgraded, 2 newly installed, 0 to remove and 1 not upgraded.
#6 5.802 Need to get 1011 kB of archives.
#6 5.802 After this operation, 1892 kB of additional disk space will be used.
#6 5.802 Get:1 http://deb.debian.org/debian-security bullseye-security/main amd64 openssl amd64 1.1.1n-0+deb11u4 [853 kB]
#6 5.940 Get:2 http://deb.debian.org/debian bullseye/main amd64 ca-certificates all 20210119 [158 kB]
#6 6.763 debconf: delaying package configuration, since apt-utils is not installed
#6 6.808 Fetched 1011 kB in 0s (4484 kB/s)
#6 6.960 Selecting previously unselected package openssl.
#6 6.960 (Reading database ... (Reading database ... 5%(Reading database ... 10%(Reading database ... 15%(Reading database ... 20%(Reading database ... 25%(Reading database ... 30%(Reading database ... 35%(Reading database ... 40%(Reading database ... 45%(Reading database ... 50%(Reading database ... 55%(Reading database ... 60%(Reading database ... 65%(Reading database ... 70%(Reading database ... 75%(Reading database ... 80%(Reading database ... 85%(Reading database ... 90%(Reading database ... 95%(Reading database ... 100%(Reading database ... 6661 files and directories currently installed.)
#6 7.090 Preparing to unpack .../openssl_1.1.1n-0+deb11u4_amd64.deb ...
#6 7.095 Unpacking openssl (1.1.1n-0+deb11u4) ...
#6 7.237 Selecting previously unselected package ca-certificates.
#6 7.238 Preparing to unpack .../ca-certificates_20210119_all.deb ...
#6 7.243 Unpacking ca-certificates (20210119) ...
#6 7.319 Setting up openssl (1.1.1n-0+deb11u4) ...
#6 7.338 Setting up ca-certificates (20210119) ...
#6 8.215 Updating certificates in /etc/ssl/certs...
#6 9.069 129 added, 0 removed; done.
#6 9.135 Processing triggers for ca-certificates (20210119) ...
#6 9.146 Updating certificates in /etc/ssl/certs...
#6 9.761 0 added, 0 removed; done.
#6 9.761 Running hooks in /etc/ca-certificates/update.d...
#6 9.840 done.
#6 DONE 10.8s
#7 [3/8] ADD target/linux_amd64/boot /opt/apache/beam/
#7 DONE 0.3s
#8 [4/8] COPY target/LICENSE /opt/apache/beam/
#8 DONE 0.1s
#9 [5/8] COPY target/NOTICE /opt/apache/beam/
#9 DONE 0.0s
#10 [6/8] COPY target/LICENSE target/go-licenses/* /opt/apache/beam/third_party_licenses/golang/
> Task :sdks:go:container:docker FAILED
#10 ERROR: lstat /var/lib/docker/tmp/buildkit-mount2197828200/target/go-licenses: no such file or directory
------
> [6/8] COPY target/LICENSE target/go-licenses/* /opt/apache/beam/third_party_licenses/golang/:
------
ERROR: failed to solve: lstat /var/lib/docker/tmp/buildkit-mount2197828200/target/go-licenses: no such file or directory
FAILURE: Build failed with an exception.
* What went wrong:
Execution failed for task ':sdks:go:container:docker'.
16 actionable tasks: 5 executed, 11 up-to-date
> Process 'command 'docker'' finished with non-zero exit value 1
* Try:
> Run with --stacktrace option to get the stack trace.
> Run with --info or --debug option to get more log output.
* Get more help at https://help.gradle.org
BUILD FAILED in 29s
Publishing build scan...
https://gradle.com/s/y54tlekcve6vg
$ ./gradlew :sdks:go:container:docker -Pdocker-repository-root=us.gcr.io/apache-beam-testing/jenkins -Pdocker-tag=20230407-023459
> Task :goIntegrationTests FAILED
FAILURE: Build failed with an exception.
* What went wrong:
Execution failed for task ':goIntegrationTests'.
> Process 'command 'sh'' finished with non-zero exit value 1
* Try:
> Run with --stacktrace option to get the stack trace.
> Run with --info or --debug option to get more log output.
* Get more help at https://help.gradle.org
Deprecated Gradle features were used in this build, making it incompatible with Gradle 8.0.
You can use '--warning-mode all' to show the individual deprecation warnings and determine if they come from your own scripts or plugins.
See https://docs.gradle.org/7.5.1/userguide/command_line_interface.html#sec:command_line_warnings
BUILD FAILED in 1m 5s
91 actionable tasks: 55 executed, 34 from cache, 2 up-to-date
Publishing build scan...
https://gradle.com/s/eaombutfkm7ve
Build step 'Invoke Gradle script' changed build result to FAILURE
Build step 'Invoke Gradle script' marked build as failure
---------------------------------------------------------------------
To unsubscribe, e-mail: builds-unsubscribe@beam.apache.org
For additional commands, e-mail: builds-help@beam.apache.org
Build failed in Jenkins: beam_PostCommit_Go #11137
Posted by Apache Jenkins Server <je...@builds.apache.org>.
See <https://ci-beam.apache.org/job/beam_PostCommit_Go/11137/display/redirect>
Changes:
------------------------------------------
[...truncated 36.53 KB...]
> Task :sdks:java:expansion-service:classes UP-TO-DATE
> Task :sdks:java:expansion-service:jar
> Task :sdks:java:extensions:arrow:createCheckerFrameworkManifest
> Task :sdks:java:extensions:arrow:compileJava FROM-CACHE
> Task :sdks:java:extensions:arrow:processResources NO-SOURCE
> Task :sdks:java:extensions:arrow:classes UP-TO-DATE
> Task :sdks:java:extensions:arrow:jar
> Task :sdks:java:extensions:protobuf:createCheckerFrameworkManifest
> Task :sdks:java:extensions:protobuf:extractIncludeProto
> Task :sdks:java:extensions:protobuf:extractProto
> Task :sdks:java:extensions:protobuf:generateProto NO-SOURCE
> Task :sdks:java:extensions:protobuf:compileJava FROM-CACHE
> Task :sdks:java:extensions:protobuf:processResources NO-SOURCE
> Task :sdks:java:extensions:protobuf:classes UP-TO-DATE
> Task :sdks:java:extensions:protobuf:jar
> Task :sdks:java:io:google-cloud-platform:createCheckerFrameworkManifest
> Task :sdks:java:io:google-cloud-platform:compileJava FROM-CACHE
> Task :sdks:java:io:google-cloud-platform:processResources NO-SOURCE
> Task :sdks:java:io:google-cloud-platform:classes UP-TO-DATE
> Task :sdks:java:io:google-cloud-platform:jar
> Task :sdks:java:io:kafka:createCheckerFrameworkManifest
> Task :sdks:java:io:kafka:compileJava FROM-CACHE
> Task :sdks:java:io:kafka:processResources NO-SOURCE
> Task :sdks:java:io:kafka:classes UP-TO-DATE
> Task :sdks:java:io:kafka:jar
> Task :runners:google-cloud-dataflow-java:compileJava FROM-CACHE
> Task :runners:google-cloud-dataflow-java:processResources
> Task :runners:google-cloud-dataflow-java:classes
> Task :runners:google-cloud-dataflow-java:jar
> Task :runners:google-cloud-dataflow-java:worker:createCheckerFrameworkManifest
> Task :runners:google-cloud-dataflow-java:worker:windmill:createCheckerFrameworkManifest
> Task :runners:google-cloud-dataflow-java:worker:windmill:extractIncludeProto
> Task :runners:google-cloud-dataflow-java:worker:windmill:extractProto
> Task :runners:google-cloud-dataflow-java:worker:windmill:generateProto FROM-CACHE
> Task :runners:google-cloud-dataflow-java:worker:windmill:compileJava FROM-CACHE
> Task :runners:google-cloud-dataflow-java:worker:windmill:processResources
> Task :runners:google-cloud-dataflow-java:worker:windmill:classes
> Task :runners:google-cloud-dataflow-java:worker:windmill:shadowJar FROM-CACHE
> Task :runners:google-cloud-dataflow-java:worker:compileJava FROM-CACHE
> Task :runners:google-cloud-dataflow-java:worker:processResources
> Task :runners:google-cloud-dataflow-java:worker:classes
> Task :runners:google-cloud-dataflow-java:worker:shadowJar FROM-CACHE
> Task :sdks:go:test:assemble UP-TO-DATE
> Task :sdks:go:test:test UP-TO-DATE
> Task :sdks:go:test:check UP-TO-DATE
> Task :sdks:go:test:build UP-TO-DATE
> Task :goIntegrationTests
$ CURRENT_DIRECTORY=<https://ci-beam.apache.org/job/beam_PostCommit_Go/ws/src/sdks/go/test>
$ TESTS=./test/integration/... ./test/regression
$ RUNNER=portable
$ TIMEOUT=3h
$ SIMULTANEOUS=3
$ GCS_LOCATION=gs://temp-storage-for-end-to-end-tests
$ GCS_SUBFOLDER=test10225
$ PROJECT=apache-beam-testing
$ DATAFLOW_PROJECT=apache-beam-testing
$ REGION=us-central1
$ trap exit_background_processes SIGINT SIGTERM EXIT
$ key=--runner
$ case --runner in
$ RUNNER=dataflow
$ cd <https://ci-beam.apache.org/job/beam_PostCommit_Go/ws/src>
$ test -d sdks/go/test
$ command -v docker
/usr/bin/docker
$ docker -v
Docker version 20.10.23, build 7155243
$ command -v gcloud
/usr/bin/gcloud
$ gcloud --version
Google Cloud SDK 406.0.0
alpha 2022.10.17
beta 2022.10.17
bq 2.0.79
bundled-python3-unix 3.9.12
core 2022.10.17
gcloud-crc32c 1.0.0
gsutil 5.14
$ TMPDIR=/tmp/tmp.UfBPhLYcYT
$ gcloud_ver=406.0.0
$ TAG=20230406-204834
$ CONTAINER=us.gcr.io/apache-beam-testing/jenkins/beam_go_sdk
Using container us.gcr.io/apache-beam-testing/jenkins/beam_go_sdk
$ ./gradlew :sdks:go:container:docker -Pdocker-repository-root=us.gcr.io/apache-beam-testing/jenkins -Pdocker-tag=20230406-204834
To honour the JVM settings for this build a single-use Daemon process will be forked. See https://docs.gradle.org/7.5.1/userguide/gradle_daemon.html#sec:disabling_the_daemon.
Daemon will be stopped at the end of the build
Configuration on demand is an incubating feature.
> Task :buildSrc:compileJava NO-SOURCE
> Task :buildSrc:compileGroovy UP-TO-DATE
> Task :buildSrc:pluginDescriptors UP-TO-DATE
> Task :buildSrc:processResources UP-TO-DATE
> Task :buildSrc:classes UP-TO-DATE
> Task :buildSrc:jar UP-TO-DATE
> Task :buildSrc:assemble UP-TO-DATE
> Task :buildSrc:spotlessGroovy UP-TO-DATE
> Task :buildSrc:spotlessGroovyCheck UP-TO-DATE
> Task :buildSrc:spotlessGroovyGradle UP-TO-DATE
> Task :buildSrc:spotlessGroovyGradleCheck UP-TO-DATE
> Task :buildSrc:spotlessCheck UP-TO-DATE
> Task :buildSrc:pluginUnderTestMetadata UP-TO-DATE
> Task :buildSrc:compileTestJava NO-SOURCE
> Task :buildSrc:compileTestGroovy NO-SOURCE
> Task :buildSrc:processTestResources NO-SOURCE
> Task :buildSrc:testClasses UP-TO-DATE
> Task :buildSrc:test NO-SOURCE
> Task :buildSrc:validatePlugins UP-TO-DATE
> Task :buildSrc:check UP-TO-DATE
> Task :buildSrc:build UP-TO-DATE
System Go installation: /snap/bin/go is go version go1.16.15 linux/amd64; Preparing to use /home/jenkins/go/bin/go1.20.2
go1.20.2: already downloaded in /home/jenkins/sdk/go1.20.2
GOCMD=/home/jenkins/go/bin/go1.20.2
> Task :sdks:go:container:copyLicenses
> Task :sdks:go:container:dockerClean UP-TO-DATE
> Task :sdks:go:container:goPrepare UP-TO-DATE
> Task :sdks:go:container:goBuild
/home/jenkins/go/bin/go1.20.2 build -o ./build/target/linux_amd64/boot boot.go boot_test.go
> Task :sdks:go:container:skipPullLicenses
> Task :sdks:go:container:dockerPrepare
#1 [internal] load build definition from Dockerfile
> Task :sdks:go:container:docker#1 transferring dockerfile: 1.94kB done
#1 DONE 0.0s
#2 [internal] load .dockerignore
#2 transferring context: 2B done
#2 DONE 0.0s
#3 [internal] load metadata for docker.io/library/debian:bullseye
#3 DONE 0.7s
#4 [1/8] FROM docker.io/library/debian:bullseye@sha256:7b991788987ad860810df60927e1adbaf8e156520177bd4db82409f81dd3b721
#4 resolve docker.io/library/debian:bullseye@sha256:7b991788987ad860810df60927e1adbaf8e156520177bd4db82409f81dd3b721 0.0s done
#4 CACHED
#5 [internal] load build context
#5 transferring context: 22.20MB 0.2s done
#5 DONE 0.2s
#6 [2/8] RUN apt-get update && DEBIAN_FRONTEND=noninteractive apt-get install -y ca-certificates && rm -rf /var/lib/apt/lists/*
#6 0.996 Get:1 http://deb.debian.org/debian bullseye InRelease [116 kB]
#6 1.083 Get:2 http://deb.debian.org/debian-security bullseye-security InRelease [48.4 kB]
#6 1.103 Get:3 http://deb.debian.org/debian bullseye-updates InRelease [44.1 kB]
#6 1.500 Get:4 http://deb.debian.org/debian bullseye/main amd64 Packages [8183 kB]
#6 1.751 Get:5 http://deb.debian.org/debian-security bullseye-security/main amd64 Packages [236 kB]
#6 1.786 Get:6 http://deb.debian.org/debian bullseye-updates/main amd64 Packages [14.6 kB]
#6 3.069 Fetched 8642 kB in 2s (3953 kB/s)
#6 3.069 Reading package lists...
#6 3.792 Reading package lists...
#6 4.420 Building dependency tree...
#6 4.570 Reading state information...
#6 4.789 The following additional packages will be installed:
#6 4.789 openssl
#6 4.817 The following NEW packages will be installed:
#6 4.818 ca-certificates openssl
#6 4.901 0 upgraded, 2 newly installed, 0 to remove and 1 not upgraded.
#6 4.901 Need to get 1011 kB of archives.
#6 4.901 After this operation, 1892 kB of additional disk space will be used.
#6 4.901 Get:1 http://deb.debian.org/debian-security bullseye-security/main amd64 openssl amd64 1.1.1n-0+deb11u4 [853 kB]
#6 5.074 Get:2 http://deb.debian.org/debian bullseye/main amd64 ca-certificates all 20210119 [158 kB]
#6 5.531 debconf: delaying package configuration, since apt-utils is not installed
#6 5.562 Fetched 1011 kB in 0s (3998 kB/s)
#6 5.626 Selecting previously unselected package openssl.
#6 5.626 (Reading database ... (Reading database ... 5%(Reading database ... 10%(Reading database ... 15%(Reading database ... 20%(Reading database ... 25%(Reading database ... 30%(Reading database ... 35%(Reading database ... 40%(Reading database ... 45%(Reading database ... 50%(Reading database ... 55%(Reading database ... 60%(Reading database ... 65%(Reading database ... 70%(Reading database ... 75%(Reading database ... 80%(Reading database ... 85%(Reading database ... 90%(Reading database ... 95%(Reading database ... 100%(Reading database ... 6661 files and directories currently installed.)
#6 5.644 Preparing to unpack .../openssl_1.1.1n-0+deb11u4_amd64.deb ...
#6 5.649 Unpacking openssl (1.1.1n-0+deb11u4) ...
#6 5.769 Selecting previously unselected package ca-certificates.
#6 5.770 Preparing to unpack .../ca-certificates_20210119_all.deb ...
#6 5.775 Unpacking ca-certificates (20210119) ...
#6 5.847 Setting up openssl (1.1.1n-0+deb11u4) ...
#6 5.864 Setting up ca-certificates (20210119) ...
#6 6.707 Updating certificates in /etc/ssl/certs...
#6 7.508 129 added, 0 removed; done.
#6 7.557 Processing triggers for ca-certificates (20210119) ...
#6 7.567 Updating certificates in /etc/ssl/certs...
#6 8.164 0 added, 0 removed; done.
#6 8.164 Running hooks in /etc/ca-certificates/update.d...
#6 8.180 done.
#6 DONE 9.1s
#7 [3/8] ADD target/linux_amd64/boot /opt/apache/beam/
#7 DONE 0.3s
#8 [4/8] COPY target/LICENSE /opt/apache/beam/
#8 DONE 0.1s
#9 [5/8] COPY target/NOTICE /opt/apache/beam/
#9 DONE 0.1s
#10 [6/8] COPY target/LICENSE target/go-licenses/* /opt/apache/beam/third_party_licenses/golang/
#10 ERROR: lstat /var/lib/docker/tmp/buildkit-mount4294148071/target/go-licenses: no such file or directory
------
> [6/8] COPY target/LICENSE target/go-licenses/* /opt/apache/beam/third_party_licenses/golang/:
------
ERROR: failed to solve: lstat /var/lib/docker/tmp/buildkit-mount4294148071/target/go-licenses: no such file or directory
FAILURE: Build failed with an exception.
> Task :sdks:go:container:docker FAILED
* What went wrong:
Execution failed for task ':sdks:go:container:docker'.
> Process 'command 'docker'' finished with non-zero exit value 1
* Try:
> Run with --stacktrace option to get the stack trace.
16 actionable tasks: 5 executed, 11 up-to-date
> Run with --info or --debug option to get more log output.
* Get more help at https://help.gradle.org
BUILD FAILED in 30s
Publishing build scan...
https://gradle.com/s/xrrbn55foqtcu
$ ./gradlew :sdks:go:container:docker -Pdocker-repository-root=us.gcr.io/apache-beam-testing/jenkins -Pdocker-tag=20230406-204834
> Task :goIntegrationTests FAILED
FAILURE: Build failed with an exception.
* What went wrong:
Execution failed for task ':goIntegrationTests'.
> Process 'command 'sh'' finished with non-zero exit value 1
* Try:
> Run with --stacktrace option to get the stack trace.
> Run with --info or --debug option to get more log output.
* Get more help at https://help.gradle.org
Deprecated Gradle features were used in this build, making it incompatible with Gradle 8.0.
You can use '--warning-mode all' to show the individual deprecation warnings and determine if they come from your own scripts or plugins.
See https://docs.gradle.org/7.5.1/userguide/command_line_interface.html#sec:command_line_warnings
BUILD FAILED in 1m 29s
91 actionable tasks: 55 executed, 34 from cache, 2 up-to-date
Publishing build scan...
https://gradle.com/s/ahibghe76ws2e
Build step 'Invoke Gradle script' changed build result to FAILURE
Build step 'Invoke Gradle script' marked build as failure
---------------------------------------------------------------------
To unsubscribe, e-mail: builds-unsubscribe@beam.apache.org
For additional commands, e-mail: builds-help@beam.apache.org
Build failed in Jenkins: beam_PostCommit_Go #11136
Posted by Apache Jenkins Server <je...@builds.apache.org>.
See <https://ci-beam.apache.org/job/beam_PostCommit_Go/11136/display/redirect>
Changes:
------------------------------------------
[...truncated 36.52 KB...]
> Task :sdks:java:expansion-service:classes UP-TO-DATE
> Task :sdks:java:expansion-service:jar
> Task :sdks:java:extensions:arrow:createCheckerFrameworkManifest
> Task :sdks:java:extensions:arrow:compileJava FROM-CACHE
> Task :sdks:java:extensions:arrow:processResources NO-SOURCE
> Task :sdks:java:extensions:arrow:classes UP-TO-DATE
> Task :sdks:java:extensions:arrow:jar
> Task :sdks:java:extensions:protobuf:createCheckerFrameworkManifest
> Task :sdks:java:extensions:protobuf:extractIncludeProto
> Task :sdks:java:extensions:protobuf:extractProto
> Task :sdks:java:extensions:protobuf:generateProto NO-SOURCE
> Task :sdks:java:extensions:protobuf:compileJava FROM-CACHE
> Task :sdks:java:extensions:protobuf:processResources NO-SOURCE
> Task :sdks:java:extensions:protobuf:classes UP-TO-DATE
> Task :sdks:java:extensions:protobuf:jar
> Task :sdks:java:io:google-cloud-platform:createCheckerFrameworkManifest
> Task :sdks:java:io:google-cloud-platform:compileJava FROM-CACHE
> Task :sdks:java:io:google-cloud-platform:processResources NO-SOURCE
> Task :sdks:java:io:google-cloud-platform:classes UP-TO-DATE
> Task :sdks:java:io:google-cloud-platform:jar
> Task :sdks:java:io:kafka:createCheckerFrameworkManifest
> Task :sdks:java:io:kafka:compileJava FROM-CACHE
> Task :sdks:java:io:kafka:processResources NO-SOURCE
> Task :sdks:java:io:kafka:classes UP-TO-DATE
> Task :sdks:java:io:kafka:jar
> Task :runners:google-cloud-dataflow-java:compileJava FROM-CACHE
> Task :runners:google-cloud-dataflow-java:processResources
> Task :runners:google-cloud-dataflow-java:classes
> Task :runners:google-cloud-dataflow-java:jar
> Task :runners:google-cloud-dataflow-java:worker:createCheckerFrameworkManifest
> Task :runners:google-cloud-dataflow-java:worker:windmill:createCheckerFrameworkManifest
> Task :runners:google-cloud-dataflow-java:worker:windmill:extractIncludeProto
> Task :runners:google-cloud-dataflow-java:worker:windmill:extractProto
> Task :runners:google-cloud-dataflow-java:worker:windmill:generateProto FROM-CACHE
> Task :runners:google-cloud-dataflow-java:worker:windmill:compileJava FROM-CACHE
> Task :runners:google-cloud-dataflow-java:worker:windmill:processResources
> Task :runners:google-cloud-dataflow-java:worker:windmill:classes
> Task :runners:google-cloud-dataflow-java:worker:windmill:shadowJar FROM-CACHE
> Task :runners:google-cloud-dataflow-java:worker:processResources
> Task :runners:google-cloud-dataflow-java:worker:compileJava FROM-CACHE
> Task :runners:google-cloud-dataflow-java:worker:classes
> Task :runners:google-cloud-dataflow-java:worker:shadowJar FROM-CACHE
> Task :sdks:go:test:assemble UP-TO-DATE
> Task :sdks:go:test:test UP-TO-DATE
> Task :sdks:go:test:check UP-TO-DATE
> Task :sdks:go:test:build UP-TO-DATE
> Task :goIntegrationTests
$ CURRENT_DIRECTORY=<https://ci-beam.apache.org/job/beam_PostCommit_Go/ws/src/sdks/go/test>
$ TESTS=./test/integration/... ./test/regression
$ RUNNER=portable
$ TIMEOUT=3h
$ SIMULTANEOUS=3
$ GCS_LOCATION=gs://temp-storage-for-end-to-end-tests
$ GCS_SUBFOLDER=test6868
$ PROJECT=apache-beam-testing
$ DATAFLOW_PROJECT=apache-beam-testing
$ REGION=us-central1
$ trap exit_background_processes SIGINT SIGTERM EXIT
$ key=--runner
$ case --runner in
$ RUNNER=dataflow
$ cd <https://ci-beam.apache.org/job/beam_PostCommit_Go/ws/src>
$ test -d sdks/go/test
$ command -v docker
/usr/bin/docker
$ docker -v
Docker version 20.10.23, build 7155243
$ command -v gcloud
/usr/bin/gcloud
$ gcloud --version
Google Cloud SDK 406.0.0
alpha 2022.10.17
beta 2022.10.17
bq 2.0.79
bundled-python3-unix 3.9.12
core 2022.10.17
gcloud-crc32c 1.0.0
gsutil 5.14
$ TMPDIR=/tmp/tmp.Q9d1X30hRB
$ gcloud_ver=406.0.0
$ TAG=20230406-143501
$ CONTAINER=us.gcr.io/apache-beam-testing/jenkins/beam_go_sdk
Using container us.gcr.io/apache-beam-testing/jenkins/beam_go_sdk
$ ./gradlew :sdks:go:container:docker -Pdocker-repository-root=us.gcr.io/apache-beam-testing/jenkins -Pdocker-tag=20230406-143501
To honour the JVM settings for this build a single-use Daemon process will be forked. See https://docs.gradle.org/7.5.1/userguide/gradle_daemon.html#sec:disabling_the_daemon.
Daemon will be stopped at the end of the build
Configuration on demand is an incubating feature.
> Task :buildSrc:compileJava NO-SOURCE
> Task :buildSrc:compileGroovy UP-TO-DATE
> Task :buildSrc:pluginDescriptors UP-TO-DATE
> Task :buildSrc:processResources UP-TO-DATE
> Task :buildSrc:classes UP-TO-DATE
> Task :buildSrc:jar UP-TO-DATE
> Task :buildSrc:assemble UP-TO-DATE
> Task :buildSrc:spotlessGroovy UP-TO-DATE
> Task :buildSrc:spotlessGroovyCheck UP-TO-DATE
> Task :buildSrc:spotlessGroovyGradle UP-TO-DATE
> Task :buildSrc:spotlessGroovyGradleCheck UP-TO-DATE
> Task :buildSrc:spotlessCheck UP-TO-DATE
> Task :buildSrc:pluginUnderTestMetadata UP-TO-DATE
> Task :buildSrc:compileTestJava NO-SOURCE
> Task :buildSrc:compileTestGroovy NO-SOURCE
> Task :buildSrc:processTestResources NO-SOURCE
> Task :buildSrc:testClasses UP-TO-DATE
> Task :buildSrc:test NO-SOURCE
> Task :buildSrc:validatePlugins UP-TO-DATE
> Task :buildSrc:check UP-TO-DATE
> Task :buildSrc:build UP-TO-DATE
System Go installation: /snap/bin/go is go version go1.16.15 linux/amd64; Preparing to use /home/jenkins/go/bin/go1.20.2
GOCMD=/home/jenkins/go/bin/go1.20.2
go1.20.2: already downloaded in /home/jenkins/sdk/go1.20.2
> Task :sdks:go:container:copyLicenses
> Task :sdks:go:container:dockerClean UP-TO-DATE
> Task :sdks:go:container:goPrepare UP-TO-DATE
> Task :sdks:go:container:goBuild
/home/jenkins/go/bin/go1.20.2 build -o ./build/target/linux_amd64/boot boot.go boot_test.go
> Task :sdks:go:container:skipPullLicenses
> Task :sdks:go:container:dockerPrepare
#1 [internal] load build definition from Dockerfile
> Task :sdks:go:container:docker
#1 transferring dockerfile: 1.94kB done
#1 DONE 0.0s
#2 [internal] load .dockerignore
#2 transferring context:
#2 transferring context: 2B done
#2 DONE 0.0s
#3 [internal] load metadata for docker.io/library/debian:bullseye
#3 DONE 0.6s
#4 [1/8] FROM docker.io/library/debian:bullseye@sha256:7b991788987ad860810df60927e1adbaf8e156520177bd4db82409f81dd3b721
#4 CACHED
#5 [internal] load build context
#5 transferring context: 22.20MB 0.2s done
#5 DONE 0.2s
#6 [2/8] RUN apt-get update && DEBIAN_FRONTEND=noninteractive apt-get install -y ca-certificates && rm -rf /var/lib/apt/lists/*
#6 1.290 Get:1 http://deb.debian.org/debian bullseye InRelease [116 kB]
#6 1.334 Get:2 http://deb.debian.org/debian-security bullseye-security InRelease [48.4 kB]
#6 1.342 Get:3 http://deb.debian.org/debian bullseye-updates InRelease [44.1 kB]
#6 1.702 Get:4 http://deb.debian.org/debian bullseye/main amd64 Packages [8183 kB]
#6 1.821 Get:5 http://deb.debian.org/debian-security bullseye-security/main amd64 Packages [236 kB]
#6 1.919 Get:6 http://deb.debian.org/debian bullseye-updates/main amd64 Packages [14.6 kB]
#6 3.213 Fetched 8642 kB in 2s (4503 kB/s)
#6 3.213 Reading package lists...
#6 3.934 Reading package lists...
#6 4.614 Building dependency tree...
#6 4.789 Reading state information...
#6 4.984 The following additional packages will be installed:
#6 4.984 openssl
#6 5.022 The following NEW packages will be installed:
#6 5.023 ca-certificates openssl
#6 5.067 0 upgraded, 2 newly installed, 0 to remove and 1 not upgraded.
#6 5.067 Need to get 1011 kB of archives.
#6 5.067 After this operation, 1892 kB of additional disk space will be used.
#6 5.067 Get:1 http://deb.debian.org/debian-security bullseye-security/main amd64 openssl amd64 1.1.1n-0+deb11u4 [853 kB]
#6 5.125 Get:2 http://deb.debian.org/debian bullseye/main amd64 ca-certificates all 20210119 [158 kB]
#6 5.808 debconf: delaying package configuration, since apt-utils is not installed
#6 5.845 Fetched 1011 kB in 0s (10.5 MB/s)
#6 5.892 Selecting previously unselected package openssl.
#6 5.892 (Reading database ... (Reading database ... 5%(Reading database ... 10%(Reading database ... 15%(Reading database ... 20%(Reading database ... 25%(Reading database ... 30%(Reading database ... 35%(Reading database ... 40%(Reading database ... 45%(Reading database ... 50%(Reading database ... 55%(Reading database ... 60%(Reading database ... 65%(Reading database ... 70%(Reading database ... 75%(Reading database ... 80%(Reading database ... 85%(Reading database ... 90%(Reading database ... 95%(Reading database ... 100%(Reading database ... 6661 files and directories currently installed.)
#6 6.045 Preparing to unpack .../openssl_1.1.1n-0+deb11u4_amd64.deb ...
#6 6.051 Unpacking openssl (1.1.1n-0+deb11u4) ...
#6 6.179 Selecting previously unselected package ca-certificates.
#6 6.180 Preparing to unpack .../ca-certificates_20210119_all.deb ...
#6 6.184 Unpacking ca-certificates (20210119) ...
#6 6.257 Setting up openssl (1.1.1n-0+deb11u4) ...
#6 6.276 Setting up ca-certificates (20210119) ...
#6 7.013 Updating certificates in /etc/ssl/certs...
#6 7.890 129 added, 0 removed; done.
#6 7.939 Processing triggers for ca-certificates (20210119) ...
#6 7.950 Updating certificates in /etc/ssl/certs...
#6 8.562 0 added, 0 removed; done.
#6 8.562 Running hooks in /etc/ca-certificates/update.d...
#6 8.580 done.
#6 DONE 9.6s
#7 [3/8] ADD target/linux_amd64/boot /opt/apache/beam/
#7 DONE 0.3s
#8 [4/8] COPY target/LICENSE /opt/apache/beam/
#8 DONE 0.1s
#9 [5/8] COPY target/NOTICE /opt/apache/beam/
#9 DONE 0.1s
> Task :sdks:go:container:docker FAILED
#10 [6/8] COPY target/LICENSE target/go-licenses/* /opt/apache/beam/third_party_licenses/golang/
#10 ERROR: lstat /var/lib/docker/tmp/buildkit-mount1593584055/target/go-licenses: no such file or directory
------
> [6/8] COPY target/LICENSE target/go-licenses/* /opt/apache/beam/third_party_licenses/golang/:
------
ERROR: failed to solve: lstat /var/lib/docker/tmp/buildkit-mount1593584055/target/go-licenses: no such file or directory
FAILURE: Build failed with an exception.
* What went wrong:
Execution failed for task ':sdks:go:container:docker'.
> Process 'command 'docker'' finished with non-zero exit value 116 actionable tasks: 5 executed, 11 up-to-date
* Try:
> Run with --stacktrace option to get the stack trace.
> Run with --info or --debug option to get more log output.
* Get more help at https://help.gradle.org
BUILD FAILED in 28s
Publishing build scan...
https://gradle.com/s/4wpakeh37idm4
$ ./gradlew :sdks:go:container:docker -Pdocker-repository-root=us.gcr.io/apache-beam-testing/jenkins -Pdocker-tag=20230406-143501
> Task :goIntegrationTests FAILED
FAILURE: Build failed with an exception.
* What went wrong:
Execution failed for task ':goIntegrationTests'.
> Process 'command 'sh'' finished with non-zero exit value 1
* Try:
> Run with --stacktrace option to get the stack trace.
> Run with --info or --debug option to get more log output.
* Get more help at https://help.gradle.org
Deprecated Gradle features were used in this build, making it incompatible with Gradle 8.0.
You can use '--warning-mode all' to show the individual deprecation warnings and determine if they come from your own scripts or plugins.
See https://docs.gradle.org/7.5.1/userguide/command_line_interface.html#sec:command_line_warnings
BUILD FAILED in 1m 2s
91 actionable tasks: 55 executed, 34 from cache, 2 up-to-date
Publishing build scan...
https://gradle.com/s/datvftwjmvkji
Build step 'Invoke Gradle script' changed build result to FAILURE
Build step 'Invoke Gradle script' marked build as failure
---------------------------------------------------------------------
To unsubscribe, e-mail: builds-unsubscribe@beam.apache.org
For additional commands, e-mail: builds-help@beam.apache.org
Build failed in Jenkins: beam_PostCommit_Go #11135
Posted by Apache Jenkins Server <je...@builds.apache.org>.
See <https://ci-beam.apache.org/job/beam_PostCommit_Go/11135/display/redirect>
Changes:
------------------------------------------
[...truncated 37.30 KB...]
> Task :sdks:java:extensions:arrow:compileJava FROM-CACHE
> Task :sdks:java:extensions:arrow:processResources NO-SOURCE
> Task :sdks:java:extensions:arrow:classes UP-TO-DATE
> Task :sdks:java:extensions:arrow:jar
> Task :sdks:java:extensions:protobuf:createCheckerFrameworkManifest
> Task :sdks:java:extensions:protobuf:extractIncludeProto
> Task :sdks:java:extensions:protobuf:extractProto
> Task :sdks:java:extensions:protobuf:generateProto NO-SOURCE
> Task :sdks:java:extensions:protobuf:compileJava FROM-CACHE
> Task :sdks:java:extensions:protobuf:processResources NO-SOURCE
> Task :sdks:java:extensions:protobuf:classes UP-TO-DATE
> Task :sdks:java:extensions:protobuf:jar
> Task :sdks:java:io:google-cloud-platform:createCheckerFrameworkManifest
> Task :sdks:java:io:google-cloud-platform:compileJava FROM-CACHE
> Task :sdks:java:io:google-cloud-platform:processResources NO-SOURCE
> Task :sdks:java:io:google-cloud-platform:classes UP-TO-DATE
> Task :sdks:java:io:google-cloud-platform:jar
> Task :sdks:java:io:kafka:createCheckerFrameworkManifest
> Task :sdks:java:io:kafka:compileJava FROM-CACHE
> Task :sdks:java:io:kafka:processResources NO-SOURCE
> Task :sdks:java:io:kafka:classes UP-TO-DATE
> Task :sdks:java:io:kafka:jar
> Task :runners:google-cloud-dataflow-java:compileJava FROM-CACHE
> Task :runners:google-cloud-dataflow-java:processResources
> Task :runners:google-cloud-dataflow-java:classes
> Task :runners:google-cloud-dataflow-java:jar
> Task :runners:google-cloud-dataflow-java:worker:createCheckerFrameworkManifest
> Task :runners:google-cloud-dataflow-java:worker:windmill:createCheckerFrameworkManifest
> Task :runners:google-cloud-dataflow-java:worker:windmill:extractIncludeProto
> Task :runners:google-cloud-dataflow-java:worker:windmill:extractProto
> Task :runners:google-cloud-dataflow-java:worker:windmill:generateProto FROM-CACHE
> Task :runners:google-cloud-dataflow-java:worker:windmill:compileJava FROM-CACHE
> Task :runners:google-cloud-dataflow-java:worker:windmill:processResources
> Task :runners:google-cloud-dataflow-java:worker:windmill:classes
> Task :runners:google-cloud-dataflow-java:worker:windmill:shadowJar FROM-CACHE
> Task :runners:google-cloud-dataflow-java:worker:compileJava FROM-CACHE
> Task :runners:google-cloud-dataflow-java:worker:processResources
> Task :runners:google-cloud-dataflow-java:worker:classes
> Task :runners:google-cloud-dataflow-java:worker:shadowJar FROM-CACHE
> Task :sdks:go:test:assemble UP-TO-DATE
> Task :sdks:go:test:test UP-TO-DATE
> Task :sdks:go:test:check UP-TO-DATE
> Task :sdks:go:test:build UP-TO-DATE
> Task :goIntegrationTests
$ CURRENT_DIRECTORY=<https://ci-beam.apache.org/job/beam_PostCommit_Go/ws/src/sdks/go/test>
$ TESTS=./test/integration/... ./test/regression
$ RUNNER=portable
$ TIMEOUT=3h
$ SIMULTANEOUS=3
$ GCS_LOCATION=gs://temp-storage-for-end-to-end-tests
$ GCS_SUBFOLDER=test5002
$ PROJECT=apache-beam-testing
$ DATAFLOW_PROJECT=apache-beam-testing
$ REGION=us-central1
$ trap exit_background_processes SIGINT SIGTERM EXIT
$ key=--runner
$ case --runner in
$ RUNNER=dataflow
$ cd <https://ci-beam.apache.org/job/beam_PostCommit_Go/ws/src>
$ test -d sdks/go/test
$ command -v docker
/usr/bin/docker
$ docker -v
Docker version 20.10.23, build 7155243
$ command -v gcloud
/usr/bin/gcloud
$ gcloud --version
Google Cloud SDK 406.0.0
alpha 2022.10.17
beta 2022.10.17
bq 2.0.79
bundled-python3-unix 3.9.12
core 2022.10.17
gcloud-crc32c 1.0.0
gsutil 5.14
$ TMPDIR=/tmp/tmp.RecruivyZk
$ gcloud_ver=406.0.0
$ TAG=20230406-083508
$ CONTAINER=us.gcr.io/apache-beam-testing/jenkins/beam_go_sdk
Using container us.gcr.io/apache-beam-testing/jenkins/beam_go_sdk
$ ./gradlew :sdks:go:container:docker -Pdocker-repository-root=us.gcr.io/apache-beam-testing/jenkins -Pdocker-tag=20230406-083508
To honour the JVM settings for this build a single-use Daemon process will be forked. See https://docs.gradle.org/7.5.1/userguide/gradle_daemon.html#sec:disabling_the_daemon.
Daemon will be stopped at the end of the build
Configuration on demand is an incubating feature.
> Task :buildSrc:compileJava NO-SOURCE
> Task :buildSrc:compileGroovy UP-TO-DATE
> Task :buildSrc:pluginDescriptors UP-TO-DATE
> Task :buildSrc:processResources UP-TO-DATE
> Task :buildSrc:classes UP-TO-DATE
> Task :buildSrc:jar UP-TO-DATE
> Task :buildSrc:assemble UP-TO-DATE
> Task :buildSrc:spotlessGroovy UP-TO-DATE
> Task :buildSrc:spotlessGroovyCheck UP-TO-DATE
> Task :buildSrc:spotlessGroovyGradle UP-TO-DATE
> Task :buildSrc:spotlessGroovyGradleCheck UP-TO-DATE
> Task :buildSrc:spotlessCheck UP-TO-DATE
> Task :buildSrc:pluginUnderTestMetadata UP-TO-DATE
> Task :buildSrc:compileTestJava NO-SOURCE
> Task :buildSrc:compileTestGroovy NO-SOURCE
> Task :buildSrc:processTestResources NO-SOURCE
> Task :buildSrc:testClasses UP-TO-DATE
> Task :buildSrc:test NO-SOURCE
> Task :buildSrc:validatePlugins UP-TO-DATE
> Task :buildSrc:check UP-TO-DATE
> Task :buildSrc:build UP-TO-DATE
System Go installation: /snap/bin/go is go version go1.16.15 linux/amd64; Preparing to use /home/jenkins/go/bin/go1.20.2
GOCMD=/home/jenkins/go/bin/go1.20.2
go1.20.2: already downloaded in /home/jenkins/sdk/go1.20.2
> Task :sdks:go:container:copyLicenses
> Task :sdks:go:container:dockerClean UP-TO-DATE
> Task :sdks:go:container:goPrepare UP-TO-DATE
> Task :sdks:go:container:goBuild
/home/jenkins/go/bin/go1.20.2 build -o ./build/target/linux_amd64/boot boot.go boot_test.go
> Task :sdks:go:container:skipPullLicenses
> Task :sdks:go:container:dockerPrepare
#1 [internal] load build definition from Dockerfile
#1 transferring dockerfile: 1.94kB done
#1 DONE 0.0s
#2 [internal] load .dockerignore
#2 transferring context: 2B done
#2 DONE 0.0s
> Task :sdks:go:container:docker
#3 [internal] load metadata for docker.io/library/debian:bullseye
#3 DONE 0.4s
#4 [1/8] FROM docker.io/library/debian:bullseye@sha256:7b991788987ad860810df60927e1adbaf8e156520177bd4db82409f81dd3b721
#4 resolve docker.io/library/debian:bullseye@sha256:7b991788987ad860810df60927e1adbaf8e156520177bd4db82409f81dd3b721 0.0s done
#4 sha256:7b991788987ad860810df60927e1adbaf8e156520177bd4db82409f81dd3b721 1.85kB / 1.85kB done
#4 sha256:d0bf7d85ad1e61ab3520b1d22d1e2a136799defd4e0d1e3f998d3b9045f38551 529B / 529B done
#4 sha256:f5b06fd9004027f9b29e91c94c8566c45c513469fa37d3549a99845d2c72a274 1.46kB / 1.46kB done
#4 DONE 0.1s
#5 [internal] load build context
#5 transferring context: 22.20MB 0.3s done
#5 DONE 0.3s
#6 [2/8] RUN apt-get update && DEBIAN_FRONTEND=noninteractive apt-get install -y ca-certificates && rm -rf /var/lib/apt/lists/*
#6 1.150 Get:1 http://deb.debian.org/debian bullseye InRelease [116 kB]
#6 1.244 Get:2 http://deb.debian.org/debian-security bullseye-security InRelease [48.4 kB]
#6 1.259 Get:3 http://deb.debian.org/debian bullseye-updates InRelease [44.1 kB]
#6 1.611 Get:4 http://deb.debian.org/debian bullseye/main amd64 Packages [8183 kB]
#6 1.835 Get:5 http://deb.debian.org/debian-security bullseye-security/main amd64 Packages [236 kB]
#6 1.975 Get:6 http://deb.debian.org/debian bullseye-updates/main amd64 Packages [14.6 kB]
#6 3.380 Fetched 8642 kB in 2s (3731 kB/s)
#6 3.380 Reading package lists...
#6 4.221 Reading package lists...
#6 4.994 Building dependency tree...
#6 5.172 Reading state information...
#6 5.514 The following additional packages will be installed:
#6 5.515 openssl
#6 5.561 The following NEW packages will be installed:
#6 5.563 ca-certificates openssl
#6 5.640 0 upgraded, 2 newly installed, 0 to remove and 1 not upgraded.
#6 5.640 Need to get 1011 kB of archives.
#6 5.640 After this operation, 1892 kB of additional disk space will be used.
#6 5.640 Get:1 http://deb.debian.org/debian-security bullseye-security/main amd64 openssl amd64 1.1.1n-0+deb11u4 [853 kB]
#6 5.778 Get:2 http://deb.debian.org/debian bullseye/main amd64 ca-certificates all 20210119 [158 kB]
#6 6.458 debconf: delaying package configuration, since apt-utils is not installed
#6 6.512 Fetched 1011 kB in 0s (4890 kB/s)
#6 6.598 Selecting previously unselected package openssl.
#6 6.598 (Reading database ... (Reading database ... 5%(Reading database ... 10%(Reading database ... 15%(Reading database ... 20%(Reading database ... 25%(Reading database ... 30%(Reading database ... 35%(Reading database ... 40%(Reading database ... 45%(Reading database ... 50%(Reading database ... 55%(Reading database ... 60%(Reading database ... 65%(Reading database ... 70%(Reading database ... 75%(Reading database ... 80%(Reading database ... 85%(Reading database ... 90%(Reading database ... 95%(Reading database ... 100%(Reading database ... 6661 files and directories currently installed.)
#6 6.618 Preparing to unpack .../openssl_1.1.1n-0+deb11u4_amd64.deb ...
#6 6.623 Unpacking openssl (1.1.1n-0+deb11u4) ...
#6 6.821 Selecting previously unselected package ca-certificates.
#6 6.823 Preparing to unpack .../ca-certificates_20210119_all.deb ...
#6 6.827 Unpacking ca-certificates (20210119) ...
#6 6.918 Setting up openssl (1.1.1n-0+deb11u4) ...
#6 6.935 Setting up ca-certificates (20210119) ...
#6 7.886 Updating certificates in /etc/ssl/certs...
#6 8.708 129 added, 0 removed; done.
#6 8.766 Processing triggers for ca-certificates (20210119) ...
#6 8.775 Updating certificates in /etc/ssl/certs...
#6 9.383 0 added, 0 removed; done.
#6 9.383 Running hooks in /etc/ca-certificates/update.d...
#6 9.387 done.
#6 DONE 10.4s
#7 [3/8] ADD target/linux_amd64/boot /opt/apache/beam/
#7 DONE 0.2s
#8 [4/8] COPY target/LICENSE /opt/apache/beam/
#8 DONE 0.1s
#9 [5/8] COPY target/NOTICE /opt/apache/beam/
#9 DONE 0.1s
#10 [6/8] COPY target/LICENSE target/go-licenses/* /opt/apache/beam/third_party_licenses/golang/
#10 ERROR: lstat /var/lib/docker/tmp/buildkit-mount2503124262/target/go-licenses: no such file or directory
> Task :sdks:go:container:docker FAILED
------
> [6/8] COPY target/LICENSE target/go-licenses/* /opt/apache/beam/third_party_licenses/golang/:
------
ERROR: failed to solve: lstat /var/lib/docker/tmp/buildkit-mount2503124262/target/go-licenses: no such file or directory
FAILURE: Build failed with an exception.
* What went wrong:
Execution failed for task ':sdks:go:container:docker'.
> Process 'command 'docker'' finished with non-zero exit value 1
16 actionable tasks: 5 executed, 11 up-to-date
* Try:
> Run with --stacktrace option to get the stack trace.
> Run with --info or --debug option to get more log output.
* Get more help at https://help.gradle.org
BUILD FAILED in 33s
Publishing build scan...
https://gradle.com/s/4m4q5kv6tmdbq
$ ./gradlew :sdks:go:container:docker -Pdocker-repository-root=us.gcr.io/apache-beam-testing/jenkins -Pdocker-tag=20230406-083508
> Task :goIntegrationTests FAILED
FAILURE: Build failed with an exception.
* What went wrong:
Execution failed for task ':goIntegrationTests'.
> Process 'command 'sh'' finished with non-zero exit value 1
* Try:
> Run with --stacktrace option to get the stack trace.
> Run with --info or --debug option to get more log output.
* Get more help at https://help.gradle.org
Deprecated Gradle features were used in this build, making it incompatible with Gradle 8.0.
You can use '--warning-mode all' to show the individual deprecation warnings and determine if they come from your own scripts or plugins.
See https://docs.gradle.org/7.5.1/userguide/command_line_interface.html#sec:command_line_warnings
BUILD FAILED in 1m 18s
91 actionable tasks: 55 executed, 34 from cache, 2 up-to-date
Publishing build scan...
https://gradle.com/s/lj65ykhfvay52
Build step 'Invoke Gradle script' changed build result to FAILURE
Build step 'Invoke Gradle script' marked build as failure
---------------------------------------------------------------------
To unsubscribe, e-mail: builds-unsubscribe@beam.apache.org
For additional commands, e-mail: builds-help@beam.apache.org
Build failed in Jenkins: beam_PostCommit_Go #11134
Posted by Apache Jenkins Server <je...@builds.apache.org>.
See <https://ci-beam.apache.org/job/beam_PostCommit_Go/11134/display/redirect>
Changes:
------------------------------------------
[...truncated 36.56 KB...]
> Task :sdks:java:expansion-service:classes UP-TO-DATE
> Task :sdks:java:expansion-service:jar
> Task :sdks:java:extensions:arrow:createCheckerFrameworkManifest
> Task :sdks:java:extensions:arrow:compileJava FROM-CACHE
> Task :sdks:java:extensions:arrow:processResources NO-SOURCE
> Task :sdks:java:extensions:arrow:classes UP-TO-DATE
> Task :sdks:java:extensions:arrow:jar
> Task :sdks:java:extensions:protobuf:createCheckerFrameworkManifest
> Task :sdks:java:extensions:protobuf:extractIncludeProto
> Task :sdks:java:extensions:protobuf:extractProto
> Task :sdks:java:extensions:protobuf:generateProto NO-SOURCE
> Task :sdks:java:extensions:protobuf:compileJava FROM-CACHE
> Task :sdks:java:extensions:protobuf:processResources NO-SOURCE
> Task :sdks:java:extensions:protobuf:classes UP-TO-DATE
> Task :sdks:java:extensions:protobuf:jar
> Task :sdks:java:io:google-cloud-platform:createCheckerFrameworkManifest
> Task :sdks:java:io:google-cloud-platform:compileJava FROM-CACHE
> Task :sdks:java:io:google-cloud-platform:processResources NO-SOURCE
> Task :sdks:java:io:google-cloud-platform:classes UP-TO-DATE
> Task :sdks:java:io:google-cloud-platform:jar
> Task :sdks:java:io:kafka:createCheckerFrameworkManifest
> Task :sdks:java:io:kafka:compileJava FROM-CACHE
> Task :sdks:java:io:kafka:processResources NO-SOURCE
> Task :sdks:java:io:kafka:classes UP-TO-DATE
> Task :sdks:java:io:kafka:jar
> Task :runners:google-cloud-dataflow-java:compileJava FROM-CACHE
> Task :runners:google-cloud-dataflow-java:processResources
> Task :runners:google-cloud-dataflow-java:classes
> Task :runners:google-cloud-dataflow-java:jar
> Task :runners:google-cloud-dataflow-java:worker:createCheckerFrameworkManifest
> Task :runners:google-cloud-dataflow-java:worker:windmill:createCheckerFrameworkManifest
> Task :runners:google-cloud-dataflow-java:worker:windmill:extractIncludeProto
> Task :runners:google-cloud-dataflow-java:worker:windmill:extractProto
> Task :runners:google-cloud-dataflow-java:worker:windmill:generateProto FROM-CACHE
> Task :runners:google-cloud-dataflow-java:worker:windmill:compileJava FROM-CACHE
> Task :runners:google-cloud-dataflow-java:worker:windmill:processResources
> Task :runners:google-cloud-dataflow-java:worker:windmill:classes
> Task :runners:google-cloud-dataflow-java:worker:windmill:shadowJar FROM-CACHE
> Task :runners:google-cloud-dataflow-java:worker:compileJava FROM-CACHE
> Task :runners:google-cloud-dataflow-java:worker:processResources
> Task :runners:google-cloud-dataflow-java:worker:classes
> Task :runners:google-cloud-dataflow-java:worker:shadowJar FROM-CACHE
> Task :sdks:go:test:assemble UP-TO-DATE
> Task :sdks:go:test:test UP-TO-DATE
> Task :sdks:go:test:check UP-TO-DATE
> Task :sdks:go:test:build UP-TO-DATE
> Task :goIntegrationTests
$ CURRENT_DIRECTORY=<https://ci-beam.apache.org/job/beam_PostCommit_Go/ws/src/sdks/go/test>
$ TESTS=./test/integration/... ./test/regression
$ RUNNER=portable
$ TIMEOUT=3h
$ SIMULTANEOUS=3
$ GCS_LOCATION=gs://temp-storage-for-end-to-end-tests
$ GCS_SUBFOLDER=test32360
$ PROJECT=apache-beam-testing
$ DATAFLOW_PROJECT=apache-beam-testing
$ REGION=us-central1
$ trap exit_background_processes SIGINT SIGTERM EXIT
$ key=--runner
$ case --runner in
$ RUNNER=dataflow
$ cd <https://ci-beam.apache.org/job/beam_PostCommit_Go/ws/src>
$ test -d sdks/go/test
$ command -v docker
/usr/bin/docker
$ docker -v
Docker version 20.10.23, build 7155243
$ command -v gcloud
/usr/bin/gcloud
$ gcloud --version
Google Cloud SDK 406.0.0
alpha 2022.10.17
beta 2022.10.17
bq 2.0.79
bundled-python3-unix 3.9.12
core 2022.10.17
gcloud-crc32c 1.0.0
gsutil 5.14
$ TMPDIR=/tmp/tmp.H7ORfBQPax
$ gcloud_ver=406.0.0
$ TAG=20230406-023500
$ CONTAINER=us.gcr.io/apache-beam-testing/jenkins/beam_go_sdk
Using container us.gcr.io/apache-beam-testing/jenkins/beam_go_sdk
$ ./gradlew :sdks:go:container:docker -Pdocker-repository-root=us.gcr.io/apache-beam-testing/jenkins -Pdocker-tag=20230406-023500
To honour the JVM settings for this build a single-use Daemon process will be forked. See https://docs.gradle.org/7.5.1/userguide/gradle_daemon.html#sec:disabling_the_daemon.
Daemon will be stopped at the end of the build
Configuration on demand is an incubating feature.
> Task :buildSrc:compileJava NO-SOURCE
> Task :buildSrc:compileGroovy UP-TO-DATE
> Task :buildSrc:pluginDescriptors UP-TO-DATE
> Task :buildSrc:processResources UP-TO-DATE
> Task :buildSrc:classes UP-TO-DATE
> Task :buildSrc:jar UP-TO-DATE
> Task :buildSrc:assemble UP-TO-DATE
> Task :buildSrc:spotlessGroovy UP-TO-DATE
> Task :buildSrc:spotlessGroovyCheck UP-TO-DATE
> Task :buildSrc:spotlessGroovyGradle UP-TO-DATE
> Task :buildSrc:spotlessGroovyGradleCheck UP-TO-DATE
> Task :buildSrc:spotlessCheck UP-TO-DATE
> Task :buildSrc:pluginUnderTestMetadata UP-TO-DATE
> Task :buildSrc:compileTestJava NO-SOURCE
> Task :buildSrc:compileTestGroovy NO-SOURCE
> Task :buildSrc:processTestResources NO-SOURCE
> Task :buildSrc:testClasses UP-TO-DATE
> Task :buildSrc:test NO-SOURCE
> Task :buildSrc:validatePlugins UP-TO-DATE
> Task :buildSrc:check UP-TO-DATE
> Task :buildSrc:build UP-TO-DATE
System Go installation: /snap/bin/go is go version go1.16.15 linux/amd64; Preparing to use /home/jenkins/go/bin/go1.20.2
GOCMD=/home/jenkins/go/bin/go1.20.2
go1.20.2: already downloaded in /home/jenkins/sdk/go1.20.2
> Task :sdks:go:container:copyLicenses
> Task :sdks:go:container:dockerClean UP-TO-DATE
> Task :sdks:go:container:goPrepare UP-TO-DATE
> Task :sdks:go:container:goBuild
/home/jenkins/go/bin/go1.20.2 build -o ./build/target/linux_amd64/boot boot.go boot_test.go
> Task :sdks:go:container:skipPullLicenses
> Task :sdks:go:container:dockerPrepare
#1 [internal] load build definition from Dockerfile
> Task :sdks:go:container:docker
#1 transferring dockerfile: 30B
#1 transferring dockerfile: 1.94kB done
#1 DONE 0.0s
#2 [internal] load .dockerignore
#2 transferring context: 2B done
#2 DONE 0.0s
#3 [internal] load metadata for docker.io/library/debian:bullseye
#3 DONE 0.8s
#4 [1/8] FROM docker.io/library/debian:bullseye@sha256:7b991788987ad860810df60927e1adbaf8e156520177bd4db82409f81dd3b721
#4 CACHED
#5 [internal] load build context
#5 transferring context: 22.20MB 0.2s done
#5 DONE 0.2s
#6 [2/8] RUN apt-get update && DEBIAN_FRONTEND=noninteractive apt-get install -y ca-certificates && rm -rf /var/lib/apt/lists/*
#6 1.006 Get:1 http://deb.debian.org/debian bullseye InRelease [116 kB]
#6 1.079 Get:2 http://deb.debian.org/debian-security bullseye-security InRelease [48.4 kB]
#6 1.104 Get:3 http://deb.debian.org/debian bullseye-updates InRelease [44.1 kB]
#6 1.394 Get:4 http://deb.debian.org/debian bullseye/main amd64 Packages [8183 kB]
#6 1.595 Get:5 http://deb.debian.org/debian-security bullseye-security/main amd64 Packages [236 kB]
#6 1.640 Get:6 http://deb.debian.org/debian bullseye-updates/main amd64 Packages [14.6 kB]
#6 2.946 Fetched 8642 kB in 2s (4283 kB/s)
#6 2.946 Reading package lists...
#6 3.665 Reading package lists...
#6 4.323 Building dependency tree...
#6 4.483 Reading state information...
#6 4.690 The following additional packages will be installed:
#6 4.690 openssl
#6 4.718 The following NEW packages will be installed:
#6 4.719 ca-certificates openssl
#6 4.792 0 upgraded, 2 newly installed, 0 to remove and 1 not upgraded.
#6 4.792 Need to get 1011 kB of archives.
#6 4.792 After this operation, 1892 kB of additional disk space will be used.
#6 4.792 Get:1 http://deb.debian.org/debian-security bullseye-security/main amd64 openssl amd64 1.1.1n-0+deb11u4 [853 kB]
#6 4.932 Get:2 http://deb.debian.org/debian bullseye/main amd64 ca-certificates all 20210119 [158 kB]
#6 5.505 debconf: delaying package configuration, since apt-utils is not installed
#6 5.542 Fetched 1011 kB in 0s (4854 kB/s)
#6 5.578 Selecting previously unselected package openssl.
#6 5.578 (Reading database ... (Reading database ... 5%(Reading database ... 10%(Reading database ... 15%(Reading database ... 20%(Reading database ... 25%(Reading database ... 30%(Reading database ... 35%(Reading database ... 40%(Reading database ... 45%(Reading database ... 50%(Reading database ... 55%(Reading database ... 60%(Reading database ... 65%(Reading database ... 70%(Reading database ... 75%(Reading database ... 80%(Reading database ... 85%(Reading database ... 90%(Reading database ... 95%(Reading database ... 100%(Reading database ... 6661 files and directories currently installed.)
#6 5.678 Preparing to unpack .../openssl_1.1.1n-0+deb11u4_amd64.deb ...
#6 5.682 Unpacking openssl (1.1.1n-0+deb11u4) ...
#6 5.810 Selecting previously unselected package ca-certificates.
#6 5.812 Preparing to unpack .../ca-certificates_20210119_all.deb ...
#6 5.817 Unpacking ca-certificates (20210119) ...
#6 5.893 Setting up openssl (1.1.1n-0+deb11u4) ...
#6 5.912 Setting up ca-certificates (20210119) ...
#6 6.557 Updating certificates in /etc/ssl/certs...
#6 7.309 129 added, 0 removed; done.
#6 7.353 Processing triggers for ca-certificates (20210119) ...
#6 7.363 Updating certificates in /etc/ssl/certs...
#6 7.956 0 added, 0 removed; done.
#6 7.956 Running hooks in /etc/ca-certificates/update.d...
#6 7.976 done.
#6 DONE 8.9s
#7 [3/8] ADD target/linux_amd64/boot /opt/apache/beam/
#7 DONE 0.3s
#8 [4/8] COPY target/LICENSE /opt/apache/beam/
#8 DONE 0.1s
#9 [5/8] COPY target/NOTICE /opt/apache/beam/
#9 DONE 0.1s
#10 [6/8] COPY target/LICENSE target/go-licenses/* /opt/apache/beam/third_party_licenses/golang/
#10 ERROR: lstat /var/lib/docker/tmp/buildkit-mount3059448713/target/go-licenses: no such file or directory
------
> [6/8] COPY target/LICENSE target/go-licenses/* /opt/apache/beam/third_party_licenses/golang/:
------
ERROR: failed to solve: lstat /var/lib/docker/tmp/buildkit-mount3059448713/target/go-licenses: no such file or directory
> Task :sdks:go:container:docker FAILED
FAILURE: Build failed with an exception.
* What went wrong:
Execution failed for task ':sdks:go:container:docker'.
> Process 'command 'docker'' finished with non-zero exit value 1
* Try:
> Run with --stacktrace option to get the stack trace.
16 actionable tasks: 5 executed, 11 up-to-date
> Run with --info or --debug option to get more log output.
* Get more help at https://help.gradle.org
BUILD FAILED in 36s
Publishing build scan...
https://gradle.com/s/ek7npzj5pqcky
$ ./gradlew :sdks:go:container:docker -Pdocker-repository-root=us.gcr.io/apache-beam-testing/jenkins -Pdocker-tag=20230406-023500
> Task :goIntegrationTests FAILED
FAILURE: Build failed with an exception.
* What went wrong:
Execution failed for task ':goIntegrationTests'.
> Process 'command 'sh'' finished with non-zero exit value 1
* Try:
> Run with --stacktrace option to get the stack trace.
> Run with --info or --debug option to get more log output.
* Get more help at https://help.gradle.org
Deprecated Gradle features were used in this build, making it incompatible with Gradle 8.0.
You can use '--warning-mode all' to show the individual deprecation warnings and determine if they come from your own scripts or plugins.
See https://docs.gradle.org/7.5.1/userguide/command_line_interface.html#sec:command_line_warnings
BUILD FAILED in 1m 9s
91 actionable tasks: 55 executed, 34 from cache, 2 up-to-date
Publishing build scan...
https://gradle.com/s/ex4odo72kweu2
Build step 'Invoke Gradle script' changed build result to FAILURE
Build step 'Invoke Gradle script' marked build as failure
---------------------------------------------------------------------
To unsubscribe, e-mail: builds-unsubscribe@beam.apache.org
For additional commands, e-mail: builds-help@beam.apache.org
Build failed in Jenkins: beam_PostCommit_Go #11133
Posted by Apache Jenkins Server <je...@builds.apache.org>.
See <https://ci-beam.apache.org/job/beam_PostCommit_Go/11133/display/redirect>
Changes:
------------------------------------------
[...truncated 41.91 KB...]
> Task :sdks:java:extensions:protobuf:jar
> Task :sdks:java:io:google-cloud-platform:createCheckerFrameworkManifest
> Task :sdks:java:io:google-cloud-platform:compileJava
Note: Some input files use or override a deprecated API.
Note: Recompile with -Xlint:deprecation for details.
Note: Some input files use unchecked or unsafe operations.
Note: Recompile with -Xlint:unchecked for details.
> Task :sdks:java:io:google-cloud-platform:processResources NO-SOURCE
> Task :sdks:java:io:google-cloud-platform:classes
> Task :sdks:java:io:google-cloud-platform:jar
> Task :sdks:java:io:kafka:createCheckerFrameworkManifest
> Task :sdks:java:io:kafka:compileJava FROM-CACHE
> Task :sdks:java:io:kafka:processResources NO-SOURCE
> Task :sdks:java:io:kafka:classes UP-TO-DATE
> Task :sdks:java:io:kafka:jar
> Task :runners:google-cloud-dataflow-java:compileJava
Note: Some input files use or override a deprecated API.
Note: Recompile with -Xlint:deprecation for details.
Note: Some input files use unchecked or unsafe operations.
Note: Recompile with -Xlint:unchecked for details.
> Task :runners:google-cloud-dataflow-java:processResources
> Task :runners:google-cloud-dataflow-java:classes
> Task :runners:google-cloud-dataflow-java:jar
> Task :runners:google-cloud-dataflow-java:worker:createCheckerFrameworkManifest
> Task :runners:google-cloud-dataflow-java:worker:windmill:createCheckerFrameworkManifest
> Task :runners:google-cloud-dataflow-java:worker:windmill:extractIncludeProto
> Task :runners:google-cloud-dataflow-java:worker:windmill:extractProto
> Task :runners:google-cloud-dataflow-java:worker:windmill:generateProto
> Task :runners:google-cloud-dataflow-java:worker:windmill:compileJava
> Task :runners:google-cloud-dataflow-java:worker:windmill:processResources
> Task :runners:google-cloud-dataflow-java:worker:windmill:classes
> Task :runners:google-cloud-dataflow-java:worker:windmill:shadowJar
> Task :runners:google-cloud-dataflow-java:worker:compileJava
Note: Some input files use or override a deprecated API.
Note: Recompile with -Xlint:deprecation for details.
Note: Some input files use unchecked or unsafe operations.
Note: Recompile with -Xlint:unchecked for details.
> Task :runners:google-cloud-dataflow-java:worker:processResources
> Task :runners:google-cloud-dataflow-java:worker:classes
> Task :runners:google-cloud-dataflow-java:worker:shadowJar
> Task :sdks:go:test:assemble UP-TO-DATE
> Task :sdks:go:test:test UP-TO-DATE
> Task :sdks:go:test:check UP-TO-DATE
> Task :sdks:go:test:build UP-TO-DATE
> Task :goIntegrationTests
$ CURRENT_DIRECTORY=<https://ci-beam.apache.org/job/beam_PostCommit_Go/ws/src/sdks/go/test>
$ TESTS=./test/integration/... ./test/regression
$ RUNNER=portable
$ TIMEOUT=3h
$ SIMULTANEOUS=3
$ GCS_LOCATION=gs://temp-storage-for-end-to-end-tests
$ GCS_SUBFOLDER=test6177
$ PROJECT=apache-beam-testing
$ DATAFLOW_PROJECT=apache-beam-testing
$ REGION=us-central1
$ trap exit_background_processes SIGINT SIGTERM EXIT
$ key=--runner
$ case --runner in
$ RUNNER=dataflow
$ cd <https://ci-beam.apache.org/job/beam_PostCommit_Go/ws/src>
$ test -d sdks/go/test
$ command -v docker
/usr/bin/docker
$ docker -v
Docker version 20.10.23, build 7155243
$ command -v gcloud
/usr/bin/gcloud
$ gcloud --version
Google Cloud SDK 406.0.0
alpha 2022.10.17
beta 2022.10.17
bq 2.0.79
bundled-python3-unix 3.9.12
core 2022.10.17
gcloud-crc32c 1.0.0
gsutil 5.14
$ TMPDIR=/tmp/tmp.ousqw9bJbN
$ gcloud_ver=406.0.0
$ TAG=20230405-205312
$ CONTAINER=us.gcr.io/apache-beam-testing/jenkins/beam_go_sdk
Using container us.gcr.io/apache-beam-testing/jenkins/beam_go_sdk
$ ./gradlew :sdks:go:container:docker -Pdocker-repository-root=us.gcr.io/apache-beam-testing/jenkins -Pdocker-tag=20230405-205312
To honour the JVM settings for this build a single-use Daemon process will be forked. See https://docs.gradle.org/7.5.1/userguide/gradle_daemon.html#sec:disabling_the_daemon.
Daemon will be stopped at the end of the build
Configuration on demand is an incubating feature.
> Task :buildSrc:compileJava NO-SOURCE
> Task :buildSrc:compileGroovy UP-TO-DATE
> Task :buildSrc:pluginDescriptors UP-TO-DATE
> Task :buildSrc:processResources UP-TO-DATE
> Task :buildSrc:classes UP-TO-DATE
> Task :buildSrc:jar UP-TO-DATE
> Task :buildSrc:assemble UP-TO-DATE
> Task :buildSrc:spotlessGroovy UP-TO-DATE
> Task :buildSrc:spotlessGroovyCheck UP-TO-DATE
> Task :buildSrc:spotlessGroovyGradle UP-TO-DATE
> Task :buildSrc:spotlessGroovyGradleCheck UP-TO-DATE
> Task :buildSrc:spotlessCheck UP-TO-DATE
> Task :buildSrc:pluginUnderTestMetadata UP-TO-DATE
> Task :buildSrc:compileTestJava NO-SOURCE
> Task :buildSrc:compileTestGroovy NO-SOURCE
> Task :buildSrc:processTestResources NO-SOURCE
> Task :buildSrc:testClasses UP-TO-DATE
> Task :buildSrc:test NO-SOURCE
> Task :buildSrc:validatePlugins UP-TO-DATE
> Task :buildSrc:check UP-TO-DATE
> Task :buildSrc:build UP-TO-DATE
System Go installation: /snap/bin/go is go version go1.16.15 linux/amd64; Preparing to use /home/jenkins/go/bin/go1.20.2
GOCMD=/home/jenkins/go/bin/go1.20.2
go1.20.2: already downloaded in /home/jenkins/sdk/go1.20.2
> Task :sdks:go:container:copyLicenses
> Task :sdks:go:container:dockerClean UP-TO-DATE
> Task :sdks:go:container:goPrepare UP-TO-DATE
> Task :sdks:go:container:goBuild
/home/jenkins/go/bin/go1.20.2 build -o ./build/target/linux_amd64/boot boot.go boot_test.go
> Task :sdks:go:container:skipPullLicenses
> Task :sdks:go:container:dockerPrepare
#1 [internal] load build definition from Dockerfile
#1 transferring dockerfile: 1.94kB done
#1 DONE 0.1s
> Task :sdks:go:container:docker
#2 [internal] load .dockerignore
#2 transferring context: 2B done
#2 DONE 0.0s
#3 [internal] load metadata for docker.io/library/debian:bullseye
#3 DONE 0.7s
#4 [1/8] FROM docker.io/library/debian:bullseye@sha256:7b991788987ad860810df60927e1adbaf8e156520177bd4db82409f81dd3b721
#4 CACHED
#5 [internal] load build context
#5 transferring context: 22.20MB 0.4s done
#5 DONE 1.4s
#6 [2/8] RUN apt-get update && DEBIAN_FRONTEND=noninteractive apt-get install -y ca-certificates && rm -rf /var/lib/apt/lists/*
#6 2.416 Get:1 http://deb.debian.org/debian bullseye InRelease [116 kB]
#6 2.451 Get:2 http://deb.debian.org/debian-security bullseye-security InRelease [48.4 kB]
#6 2.461 Get:3 http://deb.debian.org/debian bullseye-updates InRelease [44.1 kB]
#6 2.605 Get:4 http://deb.debian.org/debian bullseye/main amd64 Packages [8183 kB]
#6 2.824 Get:5 http://deb.debian.org/debian-security bullseye-security/main amd64 Packages [236 kB]
#6 3.038 Get:6 http://deb.debian.org/debian bullseye-updates/main amd64 Packages [14.6 kB]
#6 4.516 Fetched 8642 kB in 2s (4041 kB/s)
#6 4.516 Reading package lists...
#6 5.522 Reading package lists...
#6 6.415 Building dependency tree...
#6 6.615 Reading state information...
#6 6.835 The following additional packages will be installed:
#6 6.835 openssl
#6 6.867 The following NEW packages will be installed:
#6 6.868 ca-certificates openssl
#6 6.913 0 upgraded, 2 newly installed, 0 to remove and 1 not upgraded.
#6 6.913 Need to get 1011 kB of archives.
#6 6.913 After this operation, 1892 kB of additional disk space will be used.
#6 6.913 Get:1 http://deb.debian.org/debian-security bullseye-security/main amd64 openssl amd64 1.1.1n-0+deb11u4 [853 kB]
#6 6.982 Get:2 http://deb.debian.org/debian bullseye/main amd64 ca-certificates all 20210119 [158 kB]
#6 7.296 debconf: delaying package configuration, since apt-utils is not installed
#6 7.347 Fetched 1011 kB in 0s (10.4 MB/s)
#6 7.375 Selecting previously unselected package openssl.
#6 7.375 (Reading database ... (Reading database ... 5%(Reading database ... 10%(Reading database ... 15%(Reading database ... 20%(Reading database ... 25%(Reading database ... 30%(Reading database ... 35%(Reading database ... 40%(Reading database ... 45%(Reading database ... 50%(Reading database ... 55%(Reading database ... 60%(Reading database ... 65%(Reading database ... 70%(Reading database ... 75%(Reading database ... 80%(Reading database ... 85%(Reading database ... 90%(Reading database ... 95%(Reading database ... 100%(Reading database ... 6661 files and directories currently installed.)
#6 7.386 Preparing to unpack .../openssl_1.1.1n-0+deb11u4_amd64.deb ...
#6 7.390 Unpacking openssl (1.1.1n-0+deb11u4) ...
#6 7.610 Selecting previously unselected package ca-certificates.
#6 7.610 Preparing to unpack .../ca-certificates_20210119_all.deb ...
#6 7.615 Unpacking ca-certificates (20210119) ...
#6 7.716 Setting up openssl (1.1.1n-0+deb11u4) ...
#6 7.735 Setting up ca-certificates (20210119) ...
#6 8.873 Updating certificates in /etc/ssl/certs...
#6 9.984 129 added, 0 removed; done.
#6 10.06 Processing triggers for ca-certificates (20210119) ...
#6 10.07 Updating certificates in /etc/ssl/certs...
#6 10.85 0 added, 0 removed; done.
#6 10.85 Running hooks in /etc/ca-certificates/update.d...
#6 10.85 done.
#6 DONE 12.8s
#7 [3/8] ADD target/linux_amd64/boot /opt/apache/beam/
#7 DONE 0.3s
#8 [4/8] COPY target/LICENSE /opt/apache/beam/
#8 DONE 0.1s
#9 [5/8] COPY target/NOTICE /opt/apache/beam/
#9 DONE 0.2s
#10 [6/8] COPY target/LICENSE target/go-licenses/* /opt/apache/beam/third_party_licenses/golang/
> Task :sdks:go:container:docker FAILED
#10 ERROR: lstat /var/lib/docker/tmp/buildkit-mount1112615842/target/go-licenses: no such file or directory
------
> [6/8] COPY target/LICENSE target/go-licenses/* /opt/apache/beam/third_party_licenses/golang/:
------
ERROR: failed to solve: lstat /var/lib/docker/tmp/buildkit-mount1112615842/target/go-licenses: no such file or directory
FAILURE: Build failed with an exception.
* What went wrong:
Execution failed for task ':sdks:go:container:docker'.
> Process 'command 'docker'' finished with non-zero exit value 1
* Try:
> Run with --stacktrace option to get the stack trace.
> Run with --info or --debug option to get more log output.
* Get more help at https://help.gradle.org
BUILD FAILED in 45s
16 actionable tasks: 5 executed, 11 up-to-date
Publishing build scan...
https://gradle.com/s/km5rnraweeo4u
$ ./gradlew :sdks:go:container:docker -Pdocker-repository-root=us.gcr.io/apache-beam-testing/jenkins -Pdocker-tag=20230405-205312
> Task :goIntegrationTests FAILED
FAILURE: Build failed with an exception.
* What went wrong:
Execution failed for task ':goIntegrationTests'.
> Process 'command 'sh'' finished with non-zero exit value 1
* Try:
> Run with --stacktrace option to get the stack trace.
> Run with --info or --debug option to get more log output.
* Get more help at https://help.gradle.org
Deprecated Gradle features were used in this build, making it incompatible with Gradle 8.0.
You can use '--warning-mode all' to show the individual deprecation warnings and determine if they come from your own scripts or plugins.
See https://docs.gradle.org/7.5.1/userguide/command_line_interface.html#sec:command_line_warnings
BUILD FAILED in 19m 44s
91 actionable tasks: 79 executed, 11 from cache, 1 up-to-date
Publishing build scan...
https://gradle.com/s/o5zhgosv2tnq2
Build step 'Invoke Gradle script' changed build result to FAILURE
Build step 'Invoke Gradle script' marked build as failure
---------------------------------------------------------------------
To unsubscribe, e-mail: builds-unsubscribe@beam.apache.org
For additional commands, e-mail: builds-help@beam.apache.org
Build failed in Jenkins: beam_PostCommit_Go #11132
Posted by Apache Jenkins Server <je...@builds.apache.org>.
See <https://ci-beam.apache.org/job/beam_PostCommit_Go/11132/display/redirect?page=changes>
Changes:
[noreply] Bump cloud.google.com/go/bigquery from 1.49.0 to 1.50.0 in /sdks
------------------------------------------
[...truncated 36.25 KB...]
> Task :sdks:java:expansion-service:processResources NO-SOURCE
> Task :sdks:java:expansion-service:classes UP-TO-DATE
> Task :sdks:java:expansion-service:jar
> Task :sdks:java:extensions:arrow:createCheckerFrameworkManifest
> Task :sdks:java:extensions:arrow:compileJava FROM-CACHE
> Task :sdks:java:extensions:arrow:processResources NO-SOURCE
> Task :sdks:java:extensions:arrow:classes UP-TO-DATE
> Task :sdks:java:extensions:arrow:jar
> Task :sdks:java:extensions:protobuf:createCheckerFrameworkManifest
> Task :sdks:java:extensions:protobuf:extractIncludeProto
> Task :sdks:java:extensions:protobuf:extractProto
> Task :sdks:java:extensions:protobuf:generateProto NO-SOURCE
> Task :sdks:java:extensions:protobuf:compileJava FROM-CACHE
> Task :sdks:java:extensions:protobuf:processResources NO-SOURCE
> Task :sdks:java:extensions:protobuf:classes UP-TO-DATE
> Task :sdks:java:extensions:protobuf:jar
> Task :sdks:java:io:google-cloud-platform:createCheckerFrameworkManifest
> Task :sdks:java:io:google-cloud-platform:compileJava FROM-CACHE
> Task :sdks:java:io:google-cloud-platform:processResources NO-SOURCE
> Task :sdks:java:io:google-cloud-platform:classes UP-TO-DATE
> Task :sdks:java:io:google-cloud-platform:jar
> Task :sdks:java:io:kafka:createCheckerFrameworkManifest
> Task :sdks:java:io:kafka:compileJava FROM-CACHE
> Task :sdks:java:io:kafka:processResources NO-SOURCE
> Task :sdks:java:io:kafka:classes UP-TO-DATE
> Task :sdks:java:io:kafka:jar
> Task :runners:google-cloud-dataflow-java:processResources
> Task :runners:google-cloud-dataflow-java:compileJava FROM-CACHE
> Task :runners:google-cloud-dataflow-java:classes
> Task :runners:google-cloud-dataflow-java:jar
> Task :runners:google-cloud-dataflow-java:worker:createCheckerFrameworkManifest
> Task :runners:google-cloud-dataflow-java:worker:windmill:createCheckerFrameworkManifest
> Task :runners:google-cloud-dataflow-java:worker:windmill:extractIncludeProto
> Task :runners:google-cloud-dataflow-java:worker:windmill:extractProto
> Task :runners:google-cloud-dataflow-java:worker:windmill:generateProto FROM-CACHE
> Task :runners:google-cloud-dataflow-java:worker:windmill:compileJava FROM-CACHE
> Task :runners:google-cloud-dataflow-java:worker:windmill:processResources
> Task :runners:google-cloud-dataflow-java:worker:windmill:classes
> Task :runners:google-cloud-dataflow-java:worker:windmill:shadowJar FROM-CACHE
> Task :runners:google-cloud-dataflow-java:worker:compileJava FROM-CACHE
> Task :runners:google-cloud-dataflow-java:worker:processResources
> Task :runners:google-cloud-dataflow-java:worker:classes
> Task :runners:google-cloud-dataflow-java:worker:shadowJar FROM-CACHE
> Task :sdks:go:test:assemble UP-TO-DATE
> Task :sdks:go:test:test UP-TO-DATE
> Task :sdks:go:test:check UP-TO-DATE
> Task :sdks:go:test:build UP-TO-DATE
> Task :goIntegrationTests
$ CURRENT_DIRECTORY=<https://ci-beam.apache.org/job/beam_PostCommit_Go/ws/src/sdks/go/test>
$ TESTS=./test/integration/... ./test/regression
$ RUNNER=portable
$ TIMEOUT=3h
$ SIMULTANEOUS=3
$ GCS_LOCATION=gs://temp-storage-for-end-to-end-tests
$ GCS_SUBFOLDER=test11019
$ PROJECT=apache-beam-testing
$ DATAFLOW_PROJECT=apache-beam-testing
$ REGION=us-central1
$ trap exit_background_processes SIGINT SIGTERM EXIT
$ key=--runner
$ case --runner in
$ RUNNER=dataflow
$ cd <https://ci-beam.apache.org/job/beam_PostCommit_Go/ws/src>
$ test -d sdks/go/test
$ command -v docker
/usr/bin/docker
$ docker -v
Docker version 20.10.23, build 7155243
$ command -v gcloud
/usr/bin/gcloud
$ gcloud --version
Google Cloud SDK 406.0.0
alpha 2022.10.17
beta 2022.10.17
bq 2.0.79
bundled-python3-unix 3.9.12
core 2022.10.17
gcloud-crc32c 1.0.0
gsutil 5.14
$ TMPDIR=/tmp/tmp.oSNYfZfE2V
$ gcloud_ver=406.0.0
$ TAG=20230405-143512
$ CONTAINER=us.gcr.io/apache-beam-testing/jenkins/beam_go_sdk
Using container us.gcr.io/apache-beam-testing/jenkins/beam_go_sdk
$ ./gradlew :sdks:go:container:docker -Pdocker-repository-root=us.gcr.io/apache-beam-testing/jenkins -Pdocker-tag=20230405-143512
To honour the JVM settings for this build a single-use Daemon process will be forked. See https://docs.gradle.org/7.5.1/userguide/gradle_daemon.html#sec:disabling_the_daemon.
Daemon will be stopped at the end of the build
Configuration on demand is an incubating feature.
> Task :buildSrc:compileJava NO-SOURCE
> Task :buildSrc:compileGroovy UP-TO-DATE
> Task :buildSrc:pluginDescriptors UP-TO-DATE
> Task :buildSrc:processResources UP-TO-DATE
> Task :buildSrc:classes UP-TO-DATE
> Task :buildSrc:jar UP-TO-DATE
> Task :buildSrc:assemble UP-TO-DATE
> Task :buildSrc:spotlessGroovy UP-TO-DATE
> Task :buildSrc:spotlessGroovyCheck UP-TO-DATE
> Task :buildSrc:spotlessGroovyGradle UP-TO-DATE
> Task :buildSrc:spotlessGroovyGradleCheck UP-TO-DATE
> Task :buildSrc:spotlessCheck UP-TO-DATE
> Task :buildSrc:pluginUnderTestMetadata UP-TO-DATE
> Task :buildSrc:compileTestJava NO-SOURCE
> Task :buildSrc:compileTestGroovy NO-SOURCE
> Task :buildSrc:processTestResources NO-SOURCE
> Task :buildSrc:testClasses UP-TO-DATE
> Task :buildSrc:test NO-SOURCE
> Task :buildSrc:validatePlugins UP-TO-DATE
> Task :buildSrc:check UP-TO-DATE
> Task :buildSrc:build UP-TO-DATE
System Go installation: /snap/bin/go is go version go1.16.15 linux/amd64; Preparing to use /home/jenkins/go/bin/go1.20.2
GOCMD=/home/jenkins/go/bin/go1.20.2
go1.20.2: already downloaded in /home/jenkins/sdk/go1.20.2
> Task :sdks:go:container:copyLicenses
> Task :sdks:go:container:dockerClean UP-TO-DATE
> Task :sdks:go:container:goPrepare UP-TO-DATE
> Task :sdks:go:container:goBuild
/home/jenkins/go/bin/go1.20.2 build -o ./build/target/linux_amd64/boot boot.go boot_test.go
> Task :sdks:go:container:skipPullLicenses
> Task :sdks:go:container:dockerPrepare
#1 [internal] load build definition from Dockerfile
> Task :sdks:go:container:docker
#1 transferring dockerfile: 1.94kB done
#1 DONE 0.0s
#2 [internal] load .dockerignore
#2 transferring context: 2B done
#2 DONE 0.0s
#3 [internal] load metadata for docker.io/library/debian:bullseye
#3 DONE 0.3s
#4 [1/8] FROM docker.io/library/debian:bullseye@sha256:7b991788987ad860810df60927e1adbaf8e156520177bd4db82409f81dd3b721
#4 CACHED
#5 [internal] load build context
#5 transferring context: 22.20MB 0.2s done
#5 DONE 0.2s
#6 [2/8] RUN apt-get update && DEBIAN_FRONTEND=noninteractive apt-get install -y ca-certificates && rm -rf /var/lib/apt/lists/*
#6 0.527 Get:1 http://deb.debian.org/debian bullseye InRelease [116 kB]
#6 0.654 Get:2 http://deb.debian.org/debian-security bullseye-security InRelease [48.4 kB]
#6 0.720 Get:3 http://deb.debian.org/debian bullseye-updates InRelease [44.1 kB]
#6 1.063 Get:4 http://deb.debian.org/debian bullseye/main amd64 Packages [8183 kB]
#6 1.378 Get:5 http://deb.debian.org/debian-security bullseye-security/main amd64 Packages [236 kB]
#6 1.380 Get:6 http://deb.debian.org/debian bullseye-updates/main amd64 Packages [14.6 kB]
#6 2.694 Fetched 8642 kB in 2s (3841 kB/s)
#6 2.694 Reading package lists...
#6 3.381 Reading package lists...
#6 4.071 Building dependency tree...
#6 4.255 Reading state information...
#6 4.468 The following additional packages will be installed:
#6 4.468 openssl
#6 4.500 The following NEW packages will be installed:
#6 4.501 ca-certificates openssl
#6 4.612 0 upgraded, 2 newly installed, 0 to remove and 1 not upgraded.
#6 4.612 Need to get 1011 kB of archives.
#6 4.612 After this operation, 1892 kB of additional disk space will be used.
#6 4.612 Get:1 http://deb.debian.org/debian-security bullseye-security/main amd64 openssl amd64 1.1.1n-0+deb11u4 [853 kB]
#6 4.813 Get:2 http://deb.debian.org/debian bullseye/main amd64 ca-certificates all 20210119 [158 kB]
#6 5.187 debconf: delaying package configuration, since apt-utils is not installed
#6 5.228 Fetched 1011 kB in 0s (3280 kB/s)
#6 5.311 Selecting previously unselected package openssl.
#6 5.311 (Reading database ... (Reading database ... 5%(Reading database ... 10%(Reading database ... 15%(Reading database ... 20%(Reading database ... 25%(Reading database ... 30%(Reading database ... 35%(Reading database ... 40%(Reading database ... 45%(Reading database ... 50%(Reading database ... 55%(Reading database ... 60%(Reading database ... 65%(Reading database ... 70%(Reading database ... 75%(Reading database ... 80%(Reading database ... 85%(Reading database ... 90%(Reading database ... 95%(Reading database ... 100%(Reading database ... 6661 files and directories currently installed.)
#6 5.336 Preparing to unpack .../openssl_1.1.1n-0+deb11u4_amd64.deb ...
#6 5.340 Unpacking openssl (1.1.1n-0+deb11u4) ...
#6 5.465 Selecting previously unselected package ca-certificates.
#6 5.466 Preparing to unpack .../ca-certificates_20210119_all.deb ...
#6 5.472 Unpacking ca-certificates (20210119) ...
#6 5.548 Setting up openssl (1.1.1n-0+deb11u4) ...
#6 5.569 Setting up ca-certificates (20210119) ...
#6 6.286 Updating certificates in /etc/ssl/certs...
#6 7.175 129 added, 0 removed; done.
#6 7.226 Processing triggers for ca-certificates (20210119) ...
#6 7.236 Updating certificates in /etc/ssl/certs...
#6 7.847 0 added, 0 removed; done.
#6 7.847 Running hooks in /etc/ca-certificates/update.d...
#6 7.849 done.
#6 DONE 8.9s
#7 [3/8] ADD target/linux_amd64/boot /opt/apache/beam/
#7 DONE 0.3s
#8 [4/8] COPY target/LICENSE /opt/apache/beam/
#8 DONE 0.1s
#9 [5/8] COPY target/NOTICE /opt/apache/beam/
#9 DONE 0.1s
#10 [6/8] COPY target/LICENSE target/go-licenses/* /opt/apache/beam/third_party_licenses/golang/
> Task :sdks:go:container:docker FAILED#10 ERROR: lstat /var/lib/docker/tmp/buildkit-mount3356288312/target/go-licenses: no such file or directory
------
> [6/8] COPY target/LICENSE target/go-licenses/* /opt/apache/beam/third_party_licenses/golang/:
------
ERROR: failed to solve: lstat /var/lib/docker/tmp/buildkit-mount3356288312/target/go-licenses: no such file or directory
FAILURE: Build failed with an exception.
* What went wrong:
Execution failed for task ':sdks:go:container:docker'.
> Process 'command 'docker'' finished with non-zero exit value 1
16 actionable tasks: 5 executed, 11 up-to-date
* Try:
> Run with --stacktrace option to get the stack trace.
> Run with --info or --debug option to get more log output.
* Get more help at https://help.gradle.org
BUILD FAILED in 28s
Publishing build scan...
https://gradle.com/s/vqo32f4rcmrso
$ ./gradlew :sdks:go:container:docker -Pdocker-repository-root=us.gcr.io/apache-beam-testing/jenkins -Pdocker-tag=20230405-143512
> Task :goIntegrationTests FAILED
FAILURE: Build failed with an exception.
* What went wrong:
Execution failed for task ':goIntegrationTests'.
> Process 'command 'sh'' finished with non-zero exit value 1
* Try:
> Run with --stacktrace option to get the stack trace.
> Run with --info or --debug option to get more log output.
* Get more help at https://help.gradle.org
Deprecated Gradle features were used in this build, making it incompatible with Gradle 8.0.
You can use '--warning-mode all' to show the individual deprecation warnings and determine if they come from your own scripts or plugins.
See https://docs.gradle.org/7.5.1/userguide/command_line_interface.html#sec:command_line_warnings
BUILD FAILED in 1m 2s
91 actionable tasks: 55 executed, 34 from cache, 2 up-to-date
Publishing build scan...
https://gradle.com/s/kghkoke42w2zc
Build step 'Invoke Gradle script' changed build result to FAILURE
Build step 'Invoke Gradle script' marked build as failure
---------------------------------------------------------------------
To unsubscribe, e-mail: builds-unsubscribe@beam.apache.org
For additional commands, e-mail: builds-help@beam.apache.org