You are viewing a plain text version of this content. The canonical link for it is here.
Posted to dev@openwebbeans.apache.org by Apache Jenkins Server <je...@builds.apache.org> on 2017/06/10 08:30:21 UTC
Build failed in Jenkins: OpenWebBeans-trunk-deploy #347
See <https://builds.apache.org/job/OpenWebBeans-trunk-deploy/347/display/redirect?page=changes>
Changes:
[struberg] OWB-1187 implement BeanConfigurator
Not able to finish it since the spec is ambiguous and the TCK is broken :/
------------------------------------------
Started by an SCM change
[EnvInject] - Loading node environment variables.
Building remotely on H24 (ubuntu xenial) in workspace <https://builds.apache.org/job/OpenWebBeans-trunk-deploy/ws/>
Cleaning up <https://builds.apache.org/job/OpenWebBeans-trunk-deploy/ws/trunk>
Updating https://svn.apache.org/repos/asf/openwebbeans/trunk at revision '2017-06-10T08:29:07.323 +0000'
U webbeans-impl/src/main/java/org/apache/webbeans/configurator/BeanConfiguratorImpl.java
U webbeans-impl/src/main/java/org/apache/webbeans/component/WebBeansType.java
U webbeans-impl/src/main/java/org/apache/webbeans/config/BeansDeployer.java
U webbeans-impl/src/main/java/org/apache/webbeans/portable/events/discovery/AfterBeanDiscoveryImpl.java
U webbeans-tck/standalone-suite.xml
At revision 1798297
Parsing POMs
Modules changed, recalculating dependency graph
Established TCP socket on 39725
maven33-agent.jar already up to date
maven33-interceptor.jar already up to date
maven3-interceptor-commons.jar already up to date
[trunk] $ /home/jenkins/tools/java/latest1.8/bin/java -Xmx2g -Xms256m -cp /home/jenkins/jenkins-slave/maven33-agent.jar:/home/jenkins/tools/maven/latest/boot/plexus-classworlds-2.5.2.jar:/home/jenkins/tools/maven/latest/conf/logging jenkins.maven3.agent.Maven33Main /home/jenkins/tools/maven/latest/ /home/jenkins/jenkins-slave/slave.jar /home/jenkins/jenkins-slave/maven33-interceptor.jar /home/jenkins/jenkins-slave/maven3-interceptor-commons.jar 39725
<===[JENKINS REMOTING CAPACITY]===> channel started
Executing Maven: -B -f <https://builds.apache.org/job/OpenWebBeans-trunk-deploy/ws/trunk/pom.xml> -Dmaven.repo.local=/home/jenkins/jenkins-slave/maven-repositories/0 clean deploy
java.lang.reflect.InvocationTargetException
at sun.reflect.NativeMethodAccessorImpl.invoke0(Native Method)
at sun.reflect.NativeMethodAccessorImpl.invoke(NativeMethodAccessorImpl.java:62)
at sun.reflect.DelegatingMethodAccessorImpl.invoke(DelegatingMethodAccessorImpl.java:43)
at java.lang.reflect.Method.invoke(Method.java:498)
at org.codehaus.plexus.classworlds.launcher.Launcher.launchStandard(Launcher.java:330)
at org.codehaus.plexus.classworlds.launcher.Launcher.launch(Launcher.java:238)
at jenkins.maven3.agent.Maven33Main.launch(Maven33Main.java:176)
at sun.reflect.NativeMethodAccessorImpl.invoke0(Native Method)
at sun.reflect.NativeMethodAccessorImpl.invoke(NativeMethodAccessorImpl.java:62)
at sun.reflect.DelegatingMethodAccessorImpl.invoke(DelegatingMethodAccessorImpl.java:43)
at java.lang.reflect.Method.invoke(Method.java:498)
at hudson.maven.Maven3Builder.call(Maven3Builder.java:139)
at hudson.maven.Maven3Builder.call(Maven3Builder.java:70)
at hudson.remoting.UserRequest.perform(UserRequest.java:153)
at hudson.remoting.UserRequest.perform(UserRequest.java:50)
at hudson.remoting.Request$2.run(Request.java:336)
at hudson.remoting.InterceptingExecutorService$1.call(InterceptingExecutorService.java:68)
at java.util.concurrent.FutureTask.run(FutureTask.java:266)
at java.util.concurrent.ThreadPoolExecutor.runWorker(ThreadPoolExecutor.java:1142)
at java.util.concurrent.ThreadPoolExecutor$Worker.run(ThreadPoolExecutor.java:617)
at java.lang.Thread.run(Thread.java:745)
Caused by: java.lang.NoSuchFieldError: DEFAULT_USER_SETTINGS_FILE
at org.apache.maven.cli.DefaultMavenExecutionRequestBuilder.settings(DefaultMavenExecutionRequestBuilder.java:658)
at org.apache.maven.cli.DefaultMavenExecutionRequestBuilder.getMavenExecutionRequest(DefaultMavenExecutionRequestBuilder.java:149)
at org.jvnet.hudson.maven3.launcher.Maven33Launcher.getMavenExecutionRequest(Maven33Launcher.java:150)
at org.jvnet.hudson.maven3.launcher.Maven33Launcher.main(Maven33Launcher.java:127)
... 21 more
ERROR: Failed to parse POMs
java.io.IOException: java.lang.reflect.InvocationTargetException
at hudson.maven.Maven3Builder.call(Maven3Builder.java:179)
at hudson.maven.Maven3Builder.call(Maven3Builder.java:70)
at hudson.remoting.UserRequest.perform(UserRequest.java:153)
at hudson.remoting.UserRequest.perform(UserRequest.java:50)
at hudson.remoting.Request$2.run(Request.java:336)
at hudson.remoting.InterceptingExecutorService$1.call(InterceptingExecutorService.java:68)
at java.util.concurrent.FutureTask.run(FutureTask.java:266)
at java.util.concurrent.ThreadPoolExecutor.runWorker(ThreadPoolExecutor.java:1142)
at java.util.concurrent.ThreadPoolExecutor$Worker.run(ThreadPoolExecutor.java:617)
at java.lang.Thread.run(Thread.java:745)
at ......remote call to Channel to Maven [/home/jenkins/tools/java/latest1.8/bin/java, -Xmx2g, -Xms256m, -cp, /home/jenkins/jenkins-slave/maven33-agent.jar:/home/jenkins/tools/maven/latest/boot/plexus-classworlds-2.5.2.jar:/home/jenkins/tools/maven/latest/conf/logging, jenkins.maven3.agent.Maven33Main, /home/jenkins/tools/maven/latest/, /home/jenkins/jenkins-slave/slave.jar, /home/jenkins/jenkins-slave/maven33-interceptor.jar, /home/jenkins/jenkins-slave/maven3-interceptor-commons.jar, 39725](Native Method)
at hudson.remoting.Channel.attachCallSiteStackTrace(Channel.java:1545)
at hudson.remoting.UserResponse.retrieve(UserRequest.java:253)
at hudson.remoting.Channel.call(Channel.java:830)
at hudson.maven.ProcessCache$MavenProcess.call(ProcessCache.java:161)
at hudson.maven.MavenModuleSetBuild$MavenModuleSetBuildExecution.doRun(MavenModuleSetBuild.java:873)
at hudson.model.AbstractBuild$AbstractBuildExecution.run(AbstractBuild.java:534)
at hudson.model.Run.execute(Run.java:1728)
at hudson.maven.MavenModuleSetBuild.run(MavenModuleSetBuild.java:544)
at hudson.model.ResourceController.execute(ResourceController.java:98)
at hudson.model.Executor.run(Executor.java:405)
Caused by: java.lang.reflect.InvocationTargetException
at sun.reflect.NativeMethodAccessorImpl.invoke0(Native Method)
at sun.reflect.NativeMethodAccessorImpl.invoke(NativeMethodAccessorImpl.java:62)
at sun.reflect.DelegatingMethodAccessorImpl.invoke(DelegatingMethodAccessorImpl.java:43)
at java.lang.reflect.Method.invoke(Method.java:498)
at hudson.maven.Maven3Builder.call(Maven3Builder.java:139)
at hudson.maven.Maven3Builder.call(Maven3Builder.java:70)
at hudson.remoting.UserRequest.perform(UserRequest.java:153)
at hudson.remoting.UserRequest.perform(UserRequest.java:50)
at hudson.remoting.Request$2.run(Request.java:336)
at hudson.remoting.InterceptingExecutorService$1.call(InterceptingExecutorService.java:68)
at java.util.concurrent.FutureTask.run(FutureTask.java:266)
at java.util.concurrent.ThreadPoolExecutor.runWorker(ThreadPoolExecutor.java:1142)
at java.util.concurrent.ThreadPoolExecutor$Worker.run(ThreadPoolExecutor.java:617)
at java.lang.Thread.run(Thread.java:745)
Caused by: java.lang.Exception: java.lang.reflect.InvocationTargetException
at jenkins.maven3.agent.Maven33Main.launch(Maven33Main.java:179)
... 14 more
Caused by: java.lang.reflect.InvocationTargetException
at sun.reflect.NativeMethodAccessorImpl.invoke0(Native Method)
at sun.reflect.NativeMethodAccessorImpl.invoke(NativeMethodAccessorImpl.java:62)
at sun.reflect.DelegatingMethodAccessorImpl.invoke(DelegatingMethodAccessorImpl.java:43)
at java.lang.reflect.Method.invoke(Method.java:498)
at org.codehaus.plexus.classworlds.launcher.Launcher.launchStandard(Launcher.java:330)
at org.codehaus.plexus.classworlds.launcher.Launcher.launch(Launcher.java:238)
at jenkins.maven3.agent.Maven33Main.launch(Maven33Main.java:176)
... 14 more
Caused by: java.lang.NoSuchFieldError: DEFAULT_USER_SETTINGS_FILE
at org.apache.maven.cli.DefaultMavenExecutionRequestBuilder.settings(DefaultMavenExecutionRequestBuilder.java:658)
at org.apache.maven.cli.DefaultMavenExecutionRequestBuilder.getMavenExecutionRequest(DefaultMavenExecutionRequestBuilder.java:149)
at org.jvnet.hudson.maven3.launcher.Maven33Launcher.getMavenExecutionRequest(Maven33Launcher.java:150)
at org.jvnet.hudson.maven3.launcher.Maven33Launcher.main(Maven33Launcher.java:127)
... 21 more
channel stopped
Jenkins build is back to stable : OpenWebBeans-trunk-deploy #353
Posted by Apache Jenkins Server <je...@builds.apache.org>.
See <https://builds.apache.org/job/OpenWebBeans-trunk-deploy/353/display/redirect?page=changes>
Jenkins build is still unstable: OpenWebBeans-trunk-deploy #352
Posted by Apache Jenkins Server <je...@builds.apache.org>.
See <https://builds.apache.org/job/OpenWebBeans-trunk-deploy/352/display/redirect?page=changes>
Jenkins build is still unstable: OpenWebBeans-trunk-deploy #351
Posted by Apache Jenkins Server <je...@builds.apache.org>.
See <https://builds.apache.org/job/OpenWebBeans-trunk-deploy/351/display/redirect?page=changes>
Jenkins build is unstable: OpenWebBeans-trunk-deploy #350
Posted by Apache Jenkins Server <je...@builds.apache.org>.
See <https://builds.apache.org/job/OpenWebBeans-trunk-deploy/350/display/redirect?page=changes>
Build failed in Jenkins: OpenWebBeans-trunk-deploy #349
Posted by Apache Jenkins Server <je...@builds.apache.org>.
See <https://builds.apache.org/job/OpenWebBeans-trunk-deploy/349/display/redirect?page=changes>
Changes:
[struberg] OWB-1186 epic battle against wrong events
ProcessSyntheticObserverMethod was not known to be an observer event...
[struberg] OWB-1187 implement InjectionPointConfigurator
------------------------------------------
Started by an SCM change
[EnvInject] - Loading node environment variables.
Building remotely on H24 (ubuntu xenial) in workspace <https://builds.apache.org/job/OpenWebBeans-trunk-deploy/ws/>
Cleaning up <https://builds.apache.org/job/OpenWebBeans-trunk-deploy/ws/trunk>
Updating https://svn.apache.org/repos/asf/openwebbeans/trunk at revision '2017-06-14T08:29:09.580 +0000'
U webbeans-ee/src/main/java/org/apache/webbeans/ee/event/TransactionalEventNotifier.java
A webbeans-impl/src/test/java/org/apache/webbeans/test/configurator/broken
AU webbeans-impl/src/test/java/org/apache/webbeans/test/configurator/ObserverMethodConfiguratorAfterBeanDiscoveryTest.java
U webbeans-impl/src/main/java/org/apache/webbeans/component/creation/ObserverMethodsBuilder.java
U webbeans-impl/src/main/java/org/apache/webbeans/configurator/InjectionPointConfiguratorImpl.java
U webbeans-impl/src/main/java/org/apache/webbeans/configurator/ProducerConfiguratorImpl.java
U webbeans-impl/src/main/java/org/apache/webbeans/configurator/ObserverMethodConfiguratorImpl.java
U webbeans-impl/src/main/java/org/apache/webbeans/portable/events/ProcessProducerImpl.java
U webbeans-impl/src/main/java/org/apache/webbeans/portable/events/ProcessObserverMethodImpl.java
U webbeans-impl/src/main/java/org/apache/webbeans/portable/events/ProcessInjectionPointImpl.java
U webbeans-impl/src/main/java/org/apache/webbeans/portable/events/generics/GProcessSyntheticObserverMethod.java
U webbeans-impl/src/main/java/org/apache/webbeans/portable/events/generics/GProcessObserverMethod.java
U webbeans-impl/src/main/java/org/apache/webbeans/portable/events/discovery/AfterBeanDiscoveryImpl.java
U webbeans-impl/src/main/java/org/apache/webbeans/inject/impl/InjectionPointImpl.java
U webbeans-impl/src/main/java/org/apache/webbeans/util/WebBeansUtil.java
AU webbeans-impl/src/main/java/org/apache/webbeans/event/EventContextImpl.java
U webbeans-impl/src/main/java/org/apache/webbeans/event/ObserverMethodImpl.java
U webbeans-impl/src/main/java/org/apache/webbeans/event/OwbObserverMethod.java
U webbeans-impl/src/main/java/org/apache/webbeans/event/NotificationManager.java
U webbeans-impl/src/main/java/org/apache/webbeans/event/EventMetadataImpl.java
At revision 1798657
Parsing POMs
Modules changed, recalculating dependency graph
Established TCP socket on 34068
maven33-agent.jar already up to date
maven33-interceptor.jar already up to date
maven3-interceptor-commons.jar already up to date
[trunk] $ /home/jenkins/tools/java/latest1.8/bin/java -Xmx2g -Xms256m -cp /home/jenkins/jenkins-slave/maven33-agent.jar:/home/jenkins/tools/maven/latest/boot/plexus-classworlds-2.5.2.jar:/home/jenkins/tools/maven/latest/conf/logging jenkins.maven3.agent.Maven33Main /home/jenkins/tools/maven/latest/ /home/jenkins/jenkins-slave/slave.jar /home/jenkins/jenkins-slave/maven33-interceptor.jar /home/jenkins/jenkins-slave/maven3-interceptor-commons.jar 34068
<===[JENKINS REMOTING CAPACITY]===> channel started
Executing Maven: -B -f <https://builds.apache.org/job/OpenWebBeans-trunk-deploy/ws/trunk/pom.xml> -Dmaven.repo.local=/home/jenkins/jenkins-slave/maven-repositories/0 clean deploy
java.lang.reflect.InvocationTargetException
at sun.reflect.NativeMethodAccessorImpl.invoke0(Native Method)
at sun.reflect.NativeMethodAccessorImpl.invoke(NativeMethodAccessorImpl.java:62)
at sun.reflect.DelegatingMethodAccessorImpl.invoke(DelegatingMethodAccessorImpl.java:43)
at java.lang.reflect.Method.invoke(Method.java:498)
at org.codehaus.plexus.classworlds.launcher.Launcher.launchStandard(Launcher.java:330)
at org.codehaus.plexus.classworlds.launcher.Launcher.launch(Launcher.java:238)
at jenkins.maven3.agent.Maven33Main.launch(Maven33Main.java:176)
at sun.reflect.NativeMethodAccessorImpl.invoke0(Native Method)
at sun.reflect.NativeMethodAccessorImpl.invoke(NativeMethodAccessorImpl.java:62)
at sun.reflect.DelegatingMethodAccessorImpl.invoke(DelegatingMethodAccessorImpl.java:43)
at java.lang.reflect.Method.invoke(Method.java:498)
at hudson.maven.Maven3Builder.call(Maven3Builder.java:139)
at hudson.maven.Maven3Builder.call(Maven3Builder.java:70)
at hudson.remoting.UserRequest.perform(UserRequest.java:153)
at hudson.remoting.UserRequest.perform(UserRequest.java:50)
at hudson.remoting.Request$2.run(Request.java:336)
at hudson.remoting.InterceptingExecutorService$1.call(InterceptingExecutorService.java:68)
at java.util.concurrent.FutureTask.run(FutureTask.java:266)
at java.util.concurrent.ThreadPoolExecutor.runWorker(ThreadPoolExecutor.java:1142)
at java.util.concurrent.ThreadPoolExecutor$Worker.run(ThreadPoolExecutor.java:617)
at java.lang.Thread.run(Thread.java:748)
Caused by: java.lang.NoSuchFieldError: DEFAULT_USER_SETTINGS_FILE
at org.apache.maven.cli.DefaultMavenExecutionRequestBuilder.settings(DefaultMavenExecutionRequestBuilder.java:658)
at org.apache.maven.cli.DefaultMavenExecutionRequestBuilder.getMavenExecutionRequest(DefaultMavenExecutionRequestBuilder.java:149)
at org.jvnet.hudson.maven3.launcher.Maven33Launcher.getMavenExecutionRequest(Maven33Launcher.java:150)
at org.jvnet.hudson.maven3.launcher.Maven33Launcher.main(Maven33Launcher.java:127)
... 21 more
ERROR: Failed to parse POMs
java.io.IOException: java.lang.reflect.InvocationTargetException
at hudson.maven.Maven3Builder.call(Maven3Builder.java:179)
at hudson.maven.Maven3Builder.call(Maven3Builder.java:70)
at hudson.remoting.UserRequest.perform(UserRequest.java:153)
at hudson.remoting.UserRequest.perform(UserRequest.java:50)
at hudson.remoting.Request$2.run(Request.java:336)
at hudson.remoting.InterceptingExecutorService$1.call(InterceptingExecutorService.java:68)
at java.util.concurrent.FutureTask.run(FutureTask.java:266)
at java.util.concurrent.ThreadPoolExecutor.runWorker(ThreadPoolExecutor.java:1142)
at java.util.concurrent.ThreadPoolExecutor$Worker.run(ThreadPoolExecutor.java:617)
at java.lang.Thread.run(Thread.java:748)
at ......remote call to Channel to Maven [/home/jenkins/tools/java/latest1.8/bin/java, -Xmx2g, -Xms256m, -cp, /home/jenkins/jenkins-slave/maven33-agent.jar:/home/jenkins/tools/maven/latest/boot/plexus-classworlds-2.5.2.jar:/home/jenkins/tools/maven/latest/conf/logging, jenkins.maven3.agent.Maven33Main, /home/jenkins/tools/maven/latest/, /home/jenkins/jenkins-slave/slave.jar, /home/jenkins/jenkins-slave/maven33-interceptor.jar, /home/jenkins/jenkins-slave/maven3-interceptor-commons.jar, 34068](Native Method)
at hudson.remoting.Channel.attachCallSiteStackTrace(Channel.java:1545)
at hudson.remoting.UserResponse.retrieve(UserRequest.java:253)
at hudson.remoting.Channel.call(Channel.java:830)
at hudson.maven.ProcessCache$MavenProcess.call(ProcessCache.java:161)
at hudson.maven.MavenModuleSetBuild$MavenModuleSetBuildExecution.doRun(MavenModuleSetBuild.java:873)
at hudson.model.AbstractBuild$AbstractBuildExecution.run(AbstractBuild.java:534)
at hudson.model.Run.execute(Run.java:1728)
at hudson.maven.MavenModuleSetBuild.run(MavenModuleSetBuild.java:544)
at hudson.model.ResourceController.execute(ResourceController.java:98)
at hudson.model.Executor.run(Executor.java:405)
Caused by: java.lang.reflect.InvocationTargetException
at sun.reflect.NativeMethodAccessorImpl.invoke0(Native Method)
at sun.reflect.NativeMethodAccessorImpl.invoke(NativeMethodAccessorImpl.java:62)
at sun.reflect.DelegatingMethodAccessorImpl.invoke(DelegatingMethodAccessorImpl.java:43)
at java.lang.reflect.Method.invoke(Method.java:498)
at hudson.maven.Maven3Builder.call(Maven3Builder.java:139)
at hudson.maven.Maven3Builder.call(Maven3Builder.java:70)
at hudson.remoting.UserRequest.perform(UserRequest.java:153)
at hudson.remoting.UserRequest.perform(UserRequest.java:50)
at hudson.remoting.Request$2.run(Request.java:336)
at hudson.remoting.InterceptingExecutorService$1.call(InterceptingExecutorService.java:68)
at java.util.concurrent.FutureTask.run(FutureTask.java:266)
at java.util.concurrent.ThreadPoolExecutor.runWorker(ThreadPoolExecutor.java:1142)
at java.util.concurrent.ThreadPoolExecutor$Worker.run(ThreadPoolExecutor.java:617)
at java.lang.Thread.run(Thread.java:748)
Caused by: java.lang.Exception: java.lang.reflect.InvocationTargetException
at jenkins.maven3.agent.Maven33Main.launch(Maven33Main.java:179)
... 14 more
Caused by: java.lang.reflect.InvocationTargetException
at sun.reflect.NativeMethodAccessorImpl.invoke0(Native Method)
at sun.reflect.NativeMethodAccessorImpl.invoke(NativeMethodAccessorImpl.java:62)
at sun.reflect.DelegatingMethodAccessorImpl.invoke(DelegatingMethodAccessorImpl.java:43)
at java.lang.reflect.Method.invoke(Method.java:498)
at org.codehaus.plexus.classworlds.launcher.Launcher.launchStandard(Launcher.java:330)
at org.codehaus.plexus.classworlds.launcher.Launcher.launch(Launcher.java:238)
at jenkins.maven3.agent.Maven33Main.launch(Maven33Main.java:176)
... 14 more
Caused by: java.lang.NoSuchFieldError: DEFAULT_USER_SETTINGS_FILE
at org.apache.maven.cli.DefaultMavenExecutionRequestBuilder.settings(DefaultMavenExecutionRequestBuilder.java:658)
at org.apache.maven.cli.DefaultMavenExecutionRequestBuilder.getMavenExecutionRequest(DefaultMavenExecutionRequestBuilder.java:149)
at org.jvnet.hudson.maven3.launcher.Maven33Launcher.getMavenExecutionRequest(Maven33Launcher.java:150)
at org.jvnet.hudson.maven3.launcher.Maven33Launcher.main(Maven33Launcher.java:127)
... 21 more
channel stopped
Build failed in Jenkins: OpenWebBeans-trunk-deploy #348
Posted by Apache Jenkins Server <je...@builds.apache.org>.
See <https://builds.apache.org/job/OpenWebBeans-trunk-deploy/348/display/redirect?page=changes>
Changes:
[struberg] OWB-1187 implement ProducerConfigurator
Weird as it misses a way to configure the InjectionPoints for the Producer.
So this will never work properly per the current spec...
------------------------------------------
Started by an SCM change
[EnvInject] - Loading node environment variables.
Building remotely on ubuntu-4 (ubuntu trusty) in workspace <https://builds.apache.org/job/OpenWebBeans-trunk-deploy/ws/>
Cleaning up <https://builds.apache.org/job/OpenWebBeans-trunk-deploy/ws/trunk>
Updating https://svn.apache.org/repos/asf/openwebbeans/trunk at revision '2017-06-12T08:29:07.764 +0000'
U webbeans-tck/standalone-suite.xml
U webbeans-tck/testng-dev.xml
U webbeans-impl/src/test/java/org/apache/webbeans/test/interceptors/constructor/AroundConstructTest.java
AU webbeans-impl/src/test/java/org/apache/webbeans/test/configurator/BeanAttributesConfiguratorImplTest.java
U webbeans-impl/src/test/java/org/apache/webbeans/test/configurator/AnnotatedTypeConfiguratorImplTest.java
U webbeans-impl/src/test/java/org/apache/webbeans/test/portable/addannotated/extension/AddAdditionalAnnotatedTypeExtension.java
U webbeans-impl/src/test/java/org/apache/webbeans/test/portable/BeforeBeanDiscoveryTest.java
U webbeans-impl/src/test/java/org/apache/webbeans/test/portable/events/extensions/AddBeanExtension.java
U webbeans-impl/src/main/java/org/apache/webbeans/intercept/InterceptorsManager.java
U webbeans-impl/src/main/java/org/apache/webbeans/configurator/BeanAttributesConfiguratorImpl.java
U webbeans-impl/src/main/java/org/apache/webbeans/configurator/AnnotatedMethodConfiguratorImpl.java
U webbeans-impl/src/main/java/org/apache/webbeans/configurator/AnnotatedParameterConfiguratorImpl.java
U webbeans-impl/src/main/java/org/apache/webbeans/configurator/AnnotatedTypeConfiguratorImpl.java
U webbeans-impl/src/main/java/org/apache/webbeans/configurator/AnnotatedFieldConfiguratorImpl.java
U webbeans-impl/src/main/java/org/apache/webbeans/configurator/AnnotatedConstructorConfiguratorImpl.java
U webbeans-impl/src/main/java/org/apache/webbeans/configurator/ProducerConfiguratorImpl.java
U webbeans-impl/src/main/java/org/apache/webbeans/configurator/BeanConfiguratorImpl.java
U webbeans-impl/src/main/java/org/apache/webbeans/component/creation/BeanAttributesBuilder.java
U webbeans-impl/src/main/java/org/apache/webbeans/component/AbstractOwbBean.java
U webbeans-impl/src/main/java/org/apache/webbeans/component/WebBeansType.java
U webbeans-impl/src/main/java/org/apache/webbeans/config/BeansDeployer.java
U webbeans-impl/src/main/java/org/apache/webbeans/portable/AbstractAnnotatedCallable.java
U webbeans-impl/src/main/java/org/apache/webbeans/portable/events/generics/GProcessBeanAttributes.java
U webbeans-impl/src/main/java/org/apache/webbeans/portable/events/discovery/AfterTypeDiscoveryImpl.java
AU webbeans-impl/src/main/java/org/apache/webbeans/portable/events/discovery/AnnotatedTypeConfiguratorHolder.java
U webbeans-impl/src/main/java/org/apache/webbeans/portable/events/discovery/AfterBeanDiscoveryImpl.java
U webbeans-impl/src/main/java/org/apache/webbeans/portable/events/discovery/BeforeBeanDiscoveryImpl.java
U webbeans-impl/src/main/java/org/apache/webbeans/portable/events/ProcessBeanAttributesImpl.java
U webbeans-impl/src/main/java/org/apache/webbeans/portable/events/ProcessAnnotatedTypeImpl.java
U webbeans-impl/src/main/java/org/apache/webbeans/portable/events/ProcessProducerImpl.java
U webbeans-impl/src/main/java/org/apache/webbeans/portable/AnnotatedMethodImpl.java
U webbeans-impl/src/main/java/org/apache/webbeans/portable/AnnotatedParameterImpl.java
U webbeans-impl/src/main/java/org/apache/webbeans/portable/AnnotatedTypeImpl.java
U webbeans-impl/src/main/java/org/apache/webbeans/portable/AbstractAnnotated.java
U webbeans-impl/src/main/java/org/apache/webbeans/portable/AnnotatedConstructorImpl.java
U webbeans-impl/src/main/java/org/apache/webbeans/portable/InstanceProducer.java
U webbeans-impl/src/main/java/org/apache/webbeans/portable/InjectionTargetImpl.java
U webbeans-impl/src/main/java/org/apache/webbeans/annotation/AnnotationManager.java
U webbeans-impl/src/main/java/org/apache/webbeans/annotation/RequestedScopeLiteral.java
U webbeans-impl/src/main/java/org/apache/webbeans/annotation/ApplicationScopeLiteral.java
U webbeans-impl/src/main/java/org/apache/webbeans/annotation/SessionScopeLiteral.java
U webbeans-impl/src/main/java/org/apache/webbeans/inject/instance/InstanceImpl.java
U webbeans-impl/src/main/java/org/apache/webbeans/util/WebBeansUtil.java
U webbeans-impl/src/main/java/org/apache/webbeans/event/NotificationManager.java
U webbeans-impl/src/main/java/org/apache/webbeans/container/BeanManagerImpl.java
At revision 1798424
Parsing POMs
Modules changed, recalculating dependency graph
Established TCP socket on 47492
maven33-agent.jar already up to date
maven33-interceptor.jar already up to date
maven3-interceptor-commons.jar already up to date
[trunk] $ /home/jenkins/tools/java/latest1.8/bin/java -Xmx2g -Xms256m -cp /home/jenkins/jenkins-slave/maven33-agent.jar:/home/jenkins/tools/maven/latest/boot/plexus-classworlds-2.5.2.jar:/home/jenkins/tools/maven/latest/conf/logging jenkins.maven3.agent.Maven33Main /home/jenkins/tools/maven/latest/ /home/jenkins/jenkins-slave/slave.jar /home/jenkins/jenkins-slave/maven33-interceptor.jar /home/jenkins/jenkins-slave/maven3-interceptor-commons.jar 47492
<===[JENKINS REMOTING CAPACITY]===> channel started
Executing Maven: -B -f <https://builds.apache.org/job/OpenWebBeans-trunk-deploy/ws/trunk/pom.xml> -Dmaven.repo.local=/home/jenkins/jenkins-slave/maven-repositories/1 clean deploy
java.lang.reflect.InvocationTargetException
at sun.reflect.NativeMethodAccessorImpl.invoke0(Native Method)
at sun.reflect.NativeMethodAccessorImpl.invoke(NativeMethodAccessorImpl.java:62)
at sun.reflect.DelegatingMethodAccessorImpl.invoke(DelegatingMethodAccessorImpl.java:43)
at java.lang.reflect.Method.invoke(Method.java:498)
at org.codehaus.plexus.classworlds.launcher.Launcher.launchStandard(Launcher.java:330)
at org.codehaus.plexus.classworlds.launcher.Launcher.launch(Launcher.java:238)
at jenkins.maven3.agent.Maven33Main.launch(Maven33Main.java:176)
at sun.reflect.NativeMethodAccessorImpl.invoke0(Native Method)
at sun.reflect.NativeMethodAccessorImpl.invoke(NativeMethodAccessorImpl.java:62)
at sun.reflect.DelegatingMethodAccessorImpl.invoke(DelegatingMethodAccessorImpl.java:43)
at java.lang.reflect.Method.invoke(Method.java:498)
at hudson.maven.Maven3Builder.call(Maven3Builder.java:139)
at hudson.maven.Maven3Builder.call(Maven3Builder.java:70)
at hudson.remoting.UserRequest.perform(UserRequest.java:153)
at hudson.remoting.UserRequest.perform(UserRequest.java:50)
at hudson.remoting.Request$2.run(Request.java:336)
at hudson.remoting.InterceptingExecutorService$1.call(InterceptingExecutorService.java:68)
at java.util.concurrent.FutureTask.run(FutureTask.java:266)
at java.util.concurrent.ThreadPoolExecutor.runWorker(ThreadPoolExecutor.java:1142)
at java.util.concurrent.ThreadPoolExecutor$Worker.run(ThreadPoolExecutor.java:617)
at java.lang.Thread.run(Thread.java:748)
Caused by: java.lang.NoSuchFieldError: DEFAULT_USER_SETTINGS_FILE
at org.apache.maven.cli.DefaultMavenExecutionRequestBuilder.settings(DefaultMavenExecutionRequestBuilder.java:658)
at org.apache.maven.cli.DefaultMavenExecutionRequestBuilder.getMavenExecutionRequest(DefaultMavenExecutionRequestBuilder.java:149)
at org.jvnet.hudson.maven3.launcher.Maven33Launcher.getMavenExecutionRequest(Maven33Launcher.java:150)
at org.jvnet.hudson.maven3.launcher.Maven33Launcher.main(Maven33Launcher.java:127)
... 21 more
ERROR: Failed to parse POMs
java.io.IOException: java.lang.reflect.InvocationTargetException
at hudson.maven.Maven3Builder.call(Maven3Builder.java:179)
at hudson.maven.Maven3Builder.call(Maven3Builder.java:70)
at hudson.remoting.UserRequest.perform(UserRequest.java:153)
at hudson.remoting.UserRequest.perform(UserRequest.java:50)
at hudson.remoting.Request$2.run(Request.java:336)
at hudson.remoting.InterceptingExecutorService$1.call(InterceptingExecutorService.java:68)
at java.util.concurrent.FutureTask.run(FutureTask.java:266)
at java.util.concurrent.ThreadPoolExecutor.runWorker(ThreadPoolExecutor.java:1142)
at java.util.concurrent.ThreadPoolExecutor$Worker.run(ThreadPoolExecutor.java:617)
at java.lang.Thread.run(Thread.java:748)
at ......remote call to Channel to Maven [/home/jenkins/tools/java/latest1.8/bin/java, -Xmx2g, -Xms256m, -cp, /home/jenkins/jenkins-slave/maven33-agent.jar:/home/jenkins/tools/maven/latest/boot/plexus-classworlds-2.5.2.jar:/home/jenkins/tools/maven/latest/conf/logging, jenkins.maven3.agent.Maven33Main, /home/jenkins/tools/maven/latest/, /home/jenkins/jenkins-slave/slave.jar, /home/jenkins/jenkins-slave/maven33-interceptor.jar, /home/jenkins/jenkins-slave/maven3-interceptor-commons.jar, 47492](Native Method)
at hudson.remoting.Channel.attachCallSiteStackTrace(Channel.java:1545)
at hudson.remoting.UserResponse.retrieve(UserRequest.java:253)
at hudson.remoting.Channel.call(Channel.java:830)
at hudson.maven.ProcessCache$MavenProcess.call(ProcessCache.java:161)
at hudson.maven.MavenModuleSetBuild$MavenModuleSetBuildExecution.doRun(MavenModuleSetBuild.java:873)
at hudson.model.AbstractBuild$AbstractBuildExecution.run(AbstractBuild.java:534)
at hudson.model.Run.execute(Run.java:1728)
at hudson.maven.MavenModuleSetBuild.run(MavenModuleSetBuild.java:544)
at hudson.model.ResourceController.execute(ResourceController.java:98)
at hudson.model.Executor.run(Executor.java:405)
Caused by: java.lang.reflect.InvocationTargetException
at sun.reflect.NativeMethodAccessorImpl.invoke0(Native Method)
at sun.reflect.NativeMethodAccessorImpl.invoke(NativeMethodAccessorImpl.java:62)
at sun.reflect.DelegatingMethodAccessorImpl.invoke(DelegatingMethodAccessorImpl.java:43)
at java.lang.reflect.Method.invoke(Method.java:498)
at hudson.maven.Maven3Builder.call(Maven3Builder.java:139)
at hudson.maven.Maven3Builder.call(Maven3Builder.java:70)
at hudson.remoting.UserRequest.perform(UserRequest.java:153)
at hudson.remoting.UserRequest.perform(UserRequest.java:50)
at hudson.remoting.Request$2.run(Request.java:336)
at hudson.remoting.InterceptingExecutorService$1.call(InterceptingExecutorService.java:68)
at java.util.concurrent.FutureTask.run(FutureTask.java:266)
at java.util.concurrent.ThreadPoolExecutor.runWorker(ThreadPoolExecutor.java:1142)
at java.util.concurrent.ThreadPoolExecutor$Worker.run(ThreadPoolExecutor.java:617)
at java.lang.Thread.run(Thread.java:748)
Caused by: java.lang.Exception: java.lang.reflect.InvocationTargetException
at jenkins.maven3.agent.Maven33Main.launch(Maven33Main.java:179)
... 14 more
Caused by: java.lang.reflect.InvocationTargetException
at sun.reflect.NativeMethodAccessorImpl.invoke0(Native Method)
at sun.reflect.NativeMethodAccessorImpl.invoke(NativeMethodAccessorImpl.java:62)
at sun.reflect.DelegatingMethodAccessorImpl.invoke(DelegatingMethodAccessorImpl.java:43)
at java.lang.reflect.Method.invoke(Method.java:498)
at org.codehaus.plexus.classworlds.launcher.Launcher.launchStandard(Launcher.java:330)
at org.codehaus.plexus.classworlds.launcher.Launcher.launch(Launcher.java:238)
at jenkins.maven3.agent.Maven33Main.launch(Maven33Main.java:176)
... 14 more
Caused by: java.lang.NoSuchFieldError: DEFAULT_USER_SETTINGS_FILE
at org.apache.maven.cli.DefaultMavenExecutionRequestBuilder.settings(DefaultMavenExecutionRequestBuilder.java:658)
at org.apache.maven.cli.DefaultMavenExecutionRequestBuilder.getMavenExecutionRequest(DefaultMavenExecutionRequestBuilder.java:149)
at org.jvnet.hudson.maven3.launcher.Maven33Launcher.getMavenExecutionRequest(Maven33Launcher.java:150)
at org.jvnet.hudson.maven3.launcher.Maven33Launcher.main(Maven33Launcher.java:127)
... 21 more
channel stopped