You are viewing a plain text version of this content. The canonical link for it is here.
Posted to dev@kafka.apache.org by Apache Jenkins Server <je...@builds.apache.org> on 2016/01/23 00:17:49 UTC
Build failed in Jenkins: kafka-trunk-jdk8 #306
See <https://builds.apache.org/job/kafka-trunk-jdk8/306/changes>
Changes:
[me] MINOR: Fixes version lookup exception.
------------------------------------------
[...truncated 81 lines...]
/x1/jenkins/jenkins-slave/workspace/kafka-trunk-jdk8/core/src/main/scala/kafka/server/KafkaServer.scala:305: a pure expression does nothing in statement position; you may be omitting necessary parentheses
ControllerStats.leaderElectionTimer
^
/x1/jenkins/jenkins-slave/workspace/kafka-trunk-jdk8/core/src/main/scala/kafka/controller/ControllerChannelManager.scala:389: class BrokerEndPoint in object UpdateMetadataRequest is deprecated: see corresponding Javadoc for more information.
new UpdateMetadataRequest.BrokerEndPoint(brokerEndPoint.id, brokerEndPoint.host, brokerEndPoint.port)
^
/x1/jenkins/jenkins-slave/workspace/kafka-trunk-jdk8/core/src/main/scala/kafka/controller/ControllerChannelManager.scala:391: constructor UpdateMetadataRequest in class UpdateMetadataRequest is deprecated: see corresponding Javadoc for more information.
new UpdateMetadataRequest(controllerId, controllerEpoch, liveBrokers.asJava, partitionStates.asJava)
^
/x1/jenkins/jenkins-slave/workspace/kafka-trunk-jdk8/core/src/main/scala/kafka/network/BlockingChannel.scala:129: method readFromReadableChannel in class NetworkReceive is deprecated: see corresponding Javadoc for more information.
response.readFromReadableChannel(channel)
^
there were 15 feature warning(s); re-run with -feature for details
11 warnings found
warning: [options] bootstrap class path not set in conjunction with -source 1.7
1 warning
:kafka-trunk-jdk8:core:processResources UP-TO-DATE
:kafka-trunk-jdk8:core:classes
:kafka-trunk-jdk8:clients:compileTestJavawarning: [options] bootstrap class path not set in conjunction with -source 1.7
Note: /x1/jenkins/jenkins-slave/workspace/kafka-trunk-jdk8/clients/src/test/java/org/apache/kafka/common/requests/RequestResponseTest.java uses or overrides a deprecated API.
Note: Recompile with -Xlint:deprecation for details.
1 warning
:kafka-trunk-jdk8:clients:processTestResources
:kafka-trunk-jdk8:clients:testClasses
:kafka-trunk-jdk8:core:copyDependantLibs
:kafka-trunk-jdk8:core:copyDependantTestLibs
:kafka-trunk-jdk8:core:jar
:jar_core_2_11
Building project 'core' with Scala version 2.11.7
:kafka-trunk-jdk8:clients:compileJava UP-TO-DATE
:kafka-trunk-jdk8:clients:processResources UP-TO-DATE
:kafka-trunk-jdk8:clients:classes UP-TO-DATE
:kafka-trunk-jdk8:clients:determineCommitId UP-TO-DATE
:kafka-trunk-jdk8:clients:createVersionFile
:kafka-trunk-jdk8:clients:jar UP-TO-DATE
:kafka-trunk-jdk8:core:compileJava UP-TO-DATE
:kafka-trunk-jdk8:core:compileScalaJava HotSpot(TM) 64-Bit Server VM warning: ignoring option MaxPermSize=512m; support was removed in 8.0
/x1/jenkins/jenkins-slave/workspace/kafka-trunk-jdk8/core/src/main/scala/kafka/api/OffsetCommitRequest.scala:79: value DEFAULT_TIMESTAMP in object OffsetCommitRequest is deprecated: see corresponding Javadoc for more information.
org.apache.kafka.common.requests.OffsetCommitRequest.DEFAULT_TIMESTAMP
^
/x1/jenkins/jenkins-slave/workspace/kafka-trunk-jdk8/core/src/main/scala/kafka/common/OffsetMetadataAndError.scala:36: value DEFAULT_TIMESTAMP in object OffsetCommitRequest is deprecated: see corresponding Javadoc for more information.
commitTimestamp: Long = org.apache.kafka.common.requests.OffsetCommitRequest.DEFAULT_TIMESTAMP,
^
/x1/jenkins/jenkins-slave/workspace/kafka-trunk-jdk8/core/src/main/scala/kafka/common/OffsetMetadataAndError.scala:37: value DEFAULT_TIMESTAMP in object OffsetCommitRequest is deprecated: see corresponding Javadoc for more information.
expireTimestamp: Long = org.apache.kafka.common.requests.OffsetCommitRequest.DEFAULT_TIMESTAMP) {
^
/x1/jenkins/jenkins-slave/workspace/kafka-trunk-jdk8/core/src/main/scala/kafka/coordinator/GroupMetadataManager.scala:395: value DEFAULT_TIMESTAMP in object OffsetCommitRequest is deprecated: see corresponding Javadoc for more information.
if (value.expireTimestamp == org.apache.kafka.common.requests.OffsetCommitRequest.DEFAULT_TIMESTAMP)
^
/x1/jenkins/jenkins-slave/workspace/kafka-trunk-jdk8/core/src/main/scala/kafka/server/KafkaApis.scala:293: value DEFAULT_TIMESTAMP in object OffsetCommitRequest is deprecated: see corresponding Javadoc for more information.
if (offsetAndMetadata.commitTimestamp == org.apache.kafka.common.requests.OffsetCommitRequest.DEFAULT_TIMESTAMP)
^
/x1/jenkins/jenkins-slave/workspace/kafka-trunk-jdk8/core/src/main/scala/kafka/server/KafkaServer.scala:304: a pure expression does nothing in statement position; you may be omitting necessary parentheses
ControllerStats.uncleanLeaderElectionRate
^
/x1/jenkins/jenkins-slave/workspace/kafka-trunk-jdk8/core/src/main/scala/kafka/server/KafkaServer.scala:305: a pure expression does nothing in statement position; you may be omitting necessary parentheses
ControllerStats.leaderElectionTimer
^
/x1/jenkins/jenkins-slave/workspace/kafka-trunk-jdk8/core/src/main/scala/kafka/admin/AclCommand.scala:245: method readLine in class DeprecatedConsole is deprecated: Use the method in scala.io.StdIn
Console.readLine().equalsIgnoreCase("y")
^
/x1/jenkins/jenkins-slave/workspace/kafka-trunk-jdk8/core/src/main/scala/kafka/admin/TopicCommand.scala:366: method readLine in class DeprecatedConsole is deprecated: Use the method in scala.io.StdIn
if (!Console.readLine().equalsIgnoreCase("y")) {
^
/x1/jenkins/jenkins-slave/workspace/kafka-trunk-jdk8/core/src/main/scala/kafka/controller/ControllerChannelManager.scala:389: class BrokerEndPoint in object UpdateMetadataRequest is deprecated: see corresponding Javadoc for more information.
new UpdateMetadataRequest.BrokerEndPoint(brokerEndPoint.id, brokerEndPoint.host, brokerEndPoint.port)
^
/x1/jenkins/jenkins-slave/workspace/kafka-trunk-jdk8/core/src/main/scala/kafka/controller/ControllerChannelManager.scala:391: constructor UpdateMetadataRequest in class UpdateMetadataRequest is deprecated: see corresponding Javadoc for more information.
new UpdateMetadataRequest(controllerId, controllerEpoch, liveBrokers.asJava, partitionStates.asJava)
^
/x1/jenkins/jenkins-slave/workspace/kafka-trunk-jdk8/core/src/main/scala/kafka/network/BlockingChannel.scala:129: method readFromReadableChannel in class NetworkReceive is deprecated: see corresponding Javadoc for more information.
response.readFromReadableChannel(channel)
^
there were 15 feature warnings; re-run with -feature for details
13 warnings found
warning: [options] bootstrap class path not set in conjunction with -source 1.7
1 warning
:kafka-trunk-jdk8:core:processResources UP-TO-DATE
:kafka-trunk-jdk8:core:classes
:kafka-trunk-jdk8:clients:compileTestJava UP-TO-DATE
:kafka-trunk-jdk8:clients:processTestResources UP-TO-DATE
:kafka-trunk-jdk8:clients:testClasses UP-TO-DATE
:kafka-trunk-jdk8:core:copyDependantLibs
:kafka-trunk-jdk8:core:copyDependantTestLibs
:kafka-trunk-jdk8:core:jar
:clients:compileJava UP-TO-DATE
:clients:processResources UP-TO-DATE
:clients:classes UP-TO-DATE
:clients:determineCommitId UP-TO-DATE
:clients:createVersionFile
:clients:jar UP-TO-DATE
:core:compileJava UP-TO-DATE
:core:compileScalaJava HotSpot(TM) 64-Bit Server VM warning: ignoring option MaxPermSize=512m; support was removed in 8.0
/x1/jenkins/jenkins-slave/workspace/kafka-trunk-jdk8/core/src/main/scala/kafka/api/OffsetCommitRequest.scala:79: value DEFAULT_TIMESTAMP in object OffsetCommitRequest is deprecated: see corresponding Javadoc for more information.
org.apache.kafka.common.requests.OffsetCommitRequest.DEFAULT_TIMESTAMP
^
/x1/jenkins/jenkins-slave/workspace/kafka-trunk-jdk8/core/src/main/scala/kafka/common/OffsetMetadataAndError.scala:36: value DEFAULT_TIMESTAMP in object OffsetCommitRequest is deprecated: see corresponding Javadoc for more information.
commitTimestamp: Long = org.apache.kafka.common.requests.OffsetCommitRequest.DEFAULT_TIMESTAMP,
^
/x1/jenkins/jenkins-slave/workspace/kafka-trunk-jdk8/core/src/main/scala/kafka/common/OffsetMetadataAndError.scala:37: value DEFAULT_TIMESTAMP in object OffsetCommitRequest is deprecated: see corresponding Javadoc for more information.
expireTimestamp: Long = org.apache.kafka.common.requests.OffsetCommitRequest.DEFAULT_TIMESTAMP) {
^
/x1/jenkins/jenkins-slave/workspace/kafka-trunk-jdk8/core/src/main/scala/kafka/coordinator/GroupMetadataManager.scala:395: value DEFAULT_TIMESTAMP in object OffsetCommitRequest is deprecated: see corresponding Javadoc for more information.
if (value.expireTimestamp == org.apache.kafka.common.requests.OffsetCommitRequest.DEFAULT_TIMESTAMP)
^
/x1/jenkins/jenkins-slave/workspace/kafka-trunk-jdk8/core/src/main/scala/kafka/server/KafkaApis.scala:293: value DEFAULT_TIMESTAMP in object OffsetCommitRequest is deprecated: see corresponding Javadoc for more information.
if (offsetAndMetadata.commitTimestamp == org.apache.kafka.common.requests.OffsetCommitRequest.DEFAULT_TIMESTAMP)
^
/x1/jenkins/jenkins-slave/workspace/kafka-trunk-jdk8/core/src/main/scala/kafka/server/KafkaServer.scala:304: a pure expression does nothing in statement position; you may be omitting necessary parentheses
ControllerStats.uncleanLeaderElectionRate
^
/x1/jenkins/jenkins-slave/workspace/kafka-trunk-jdk8/core/src/main/scala/kafka/server/KafkaServer.scala:305: a pure expression does nothing in statement position; you may be omitting necessary parentheses
ControllerStats.leaderElectionTimer
^
/x1/jenkins/jenkins-slave/workspace/kafka-trunk-jdk8/core/src/main/scala/kafka/controller/ControllerChannelManager.scala:389: class BrokerEndPoint in object UpdateMetadataRequest is deprecated: see corresponding Javadoc for more information.
new UpdateMetadataRequest.BrokerEndPoint(brokerEndPoint.id, brokerEndPoint.host, brokerEndPoint.port)
^
/x1/jenkins/jenkins-slave/workspace/kafka-trunk-jdk8/core/src/main/scala/kafka/controller/ControllerChannelManager.scala:391: constructor UpdateMetadataRequest in class UpdateMetadataRequest is deprecated: see corresponding Javadoc for more information.
new UpdateMetadataRequest(controllerId, controllerEpoch, liveBrokers.asJava, partitionStates.asJava)
^
/x1/jenkins/jenkins-slave/workspace/kafka-trunk-jdk8/core/src/main/scala/kafka/network/BlockingChannel.scala:129: method readFromReadableChannel in class NetworkReceive is deprecated: see corresponding Javadoc for more information.
response.readFromReadableChannel(channel)
^
there were 15 feature warning(s); re-run with -feature for details
11 warnings found
warning: [options] bootstrap class path not set in conjunction with -source 1.7
1 warning
:core:processResources UP-TO-DATE
:core:classes
:clients:compileTestJava UP-TO-DATE
:clients:processTestResources UP-TO-DATE
:clients:testClasses UP-TO-DATE
:core:copyDependantLibs UP-TO-DATE
:core:copyDependantTestLibs
:core:jar UP-TO-DATE
:examples:compileJavawarning: [options] bootstrap class path not set in conjunction with -source 1.7
1 warning
:examples:processResources UP-TO-DATE
:examples:classes
:examples:jar
:log4j-appender:compileJavawarning: [options] bootstrap class path not set in conjunction with -source 1.7
1 warning
:log4j-appender:processResources UP-TO-DATE
:log4j-appender:classes
:log4j-appender:jar
:streams:compileJavawarning: [options] bootstrap class path not set in conjunction with -source 1.7
Note: Some input files use unchecked or unsafe operations.
Note: Recompile with -Xlint:unchecked for details.
1 warning
:streams:processResources UP-TO-DATE
:streams:classes
:streams:copyDependantLibs
:streams:jar
:tools:compileJavawarning: [options] bootstrap class path not set in conjunction with -source 1.7
1 warning
:tools:processResources UP-TO-DATE
:tools:classes
:tools:copyDependantLibs
:tools:jar
:connect:api:compileJavawarning: [options] bootstrap class path not set in conjunction with -source 1.7
Note: /x1/jenkins/jenkins-slave/workspace/kafka-trunk-jdk8/connect/api/src/main/java/org/apache/kafka/connect/data/Struct.java uses unchecked or unsafe operations.
Note: Recompile with -Xlint:unchecked for details.
1 warning
:connect:api:processResources UP-TO-DATE
:connect:api:classes
:connect:api:copyDependantLibs
:connect:api:jar
:connect:file:compileJavawarning: [options] bootstrap class path not set in conjunction with -source 1.7
1 warning
:connect:file:processResources UP-TO-DATE
:connect:file:classes
:connect:file:copyDependantLibs
:connect:file:jar
:connect:json:compileJavawarning: [options] bootstrap class path not set in conjunction with -source 1.7
Note: /x1/jenkins/jenkins-slave/workspace/kafka-trunk-jdk8/connect/json/src/main/java/org/apache/kafka/connect/json/JsonConverter.java uses or overrides a deprecated API.
Note: Recompile with -Xlint:deprecation for details.
1 warning
:connect:json:processResources UP-TO-DATE
:connect:json:classes
:connect:json:copyDependantLibs
:connect:json:jar
:connect:runtime:compileJavawarning: [options] bootstrap class path not set in conjunction with -source 1.7
Note: Some input files use unchecked or unsafe operations.
Note: Recompile with -Xlint:unchecked for details.
1 warning
:connect:runtime:processResources UP-TO-DATE
:connect:runtime:classes
:connect:runtime:copyDependantLibs
:connect:runtime:jar
:jarAll
:test_core_2_10
Building project 'core' with Scala version 2.10.6
:kafka-trunk-jdk8:clients:compileJava UP-TO-DATE
:kafka-trunk-jdk8:clients:processResources UP-TO-DATE
:kafka-trunk-jdk8:clients:classes UP-TO-DATE
:kafka-trunk-jdk8:clients:determineCommitId UP-TO-DATE
:kafka-trunk-jdk8:clients:createVersionFile
:kafka-trunk-jdk8:clients:jar UP-TO-DATE
:kafka-trunk-jdk8:clients:compileTestJava UP-TO-DATE
:kafka-trunk-jdk8:clients:processTestResources UP-TO-DATE
:kafka-trunk-jdk8:clients:testClasses UP-TO-DATE
:kafka-trunk-jdk8:core:compileJava UP-TO-DATE
:kafka-trunk-jdk8:core:compileScala UP-TO-DATE
:kafka-trunk-jdk8:core:processResources UP-TO-DATE
:kafka-trunk-jdk8:core:classes UP-TO-DATE
:kafka-trunk-jdk8:core:checkstyleMain
:kafka-trunk-jdk8:core:compileTestJava UP-TO-DATE
:kafka-trunk-jdk8:core:compileTestScalaJava HotSpot(TM) 64-Bit Server VM warning: ignoring option MaxPermSize=512m; support was removed in 8.0
/x1/jenkins/jenkins-slave/workspace/kafka-trunk-jdk8/core/src/test/scala/integration/kafka/api/QuotasTest.scala:74: value BLOCK_ON_BUFFER_FULL_CONFIG in object ProducerConfig is deprecated: see corresponding Javadoc for more information.
producerProps.put(ProducerConfig.BLOCK_ON_BUFFER_FULL_CONFIG, "false")
^
/x1/jenkins/jenkins-slave/workspace/kafka-trunk-jdk8/core/src/test/scala/kafka/tools/TestLogCleaning.scala:250: value BLOCK_ON_BUFFER_FULL_CONFIG in object ProducerConfig is deprecated: see corresponding Javadoc for more information.
producerProps.setProperty(ProducerConfig.BLOCK_ON_BUFFER_FULL_CONFIG, "true")
^
there were 4 feature warning(s); re-run with -feature for details
three warnings found
:kafka-trunk-jdk8:core:processTestResources
:test_core_2_10 FAILED
FAILURE: Build failed with an exception.
* What went wrong:
org.gradle.api.internal.changedetection.state.DefaultFileCollectionSnapshotter$FileCollectionSnapshotImpl cannot be cast to org.gradle.api.internal.changedetection.state.OutputFilesCollectionSnapshotter$OutputFilesSnapshot
* Try:
Run with --stacktrace option to get the stack trace. Run with --info or --debug option to get more log output.
BUILD FAILED
Total time: 5 mins 20.46 secs
Build step 'Execute shell' marked build as failure
Recording test results
Setting JDK1_8_0_45_HOME=/home/jenkins/jenkins-slave/tools/hudson.model.JDK/jdk1.8.0_45
Setting GRADLE_2_4_RC_2_HOME=/home/jenkins/jenkins-slave/tools/hudson.plugins.gradle.GradleInstallation/Gradle_2.4-rc-2
ERROR: Publisher 'Publish JUnit test result report' failed: No test report files were found. Configuration error?
Setting JDK1_8_0_45_HOME=/home/jenkins/jenkins-slave/tools/hudson.model.JDK/jdk1.8.0_45
Setting GRADLE_2_4_RC_2_HOME=/home/jenkins/jenkins-slave/tools/hudson.plugins.gradle.GradleInstallation/Gradle_2.4-rc-2
Jenkins build is back to normal : kafka-trunk-jdk8 #313
Posted by Apache Jenkins Server <je...@builds.apache.org>.
See <https://builds.apache.org/job/kafka-trunk-jdk8/313/changes>
Build failed in Jenkins: kafka-trunk-jdk8 #312
Posted by Apache Jenkins Server <je...@builds.apache.org>.
See <https://builds.apache.org/job/kafka-trunk-jdk8/312/changes>
Changes:
[me] KAFKA-3138: 0.9.0 docs still say that log compaction doesn't work on
------------------------------------------
Started by an SCM change
[EnvInject] - Loading node environment variables.
Building remotely on ubuntu-2 (docker Ubuntu ubuntu yahoo-not-h2) in workspace <https://builds.apache.org/job/kafka-trunk-jdk8/ws/>
> git rev-parse --is-inside-work-tree # timeout=10
Fetching changes from the remote Git repository
> git config remote.origin.url https://git-wip-us.apache.org/repos/asf/kafka.git # timeout=10
Fetching upstream changes from https://git-wip-us.apache.org/repos/asf/kafka.git
> git --version # timeout=10
> git -c core.askpass=true fetch --tags --progress https://git-wip-us.apache.org/repos/asf/kafka.git +refs/heads/*:refs/remotes/origin/*
> git rev-parse refs/remotes/origin/trunk^{commit} # timeout=10
> git rev-parse refs/remotes/origin/origin/trunk^{commit} # timeout=10
Checking out Revision fa6b90f97cb366a02eae8057124ec22db1f7e9cd (refs/remotes/origin/trunk)
> git config core.sparsecheckout # timeout=10
> git checkout -f fa6b90f97cb366a02eae8057124ec22db1f7e9cd
> git rev-list 5e8a084834ad35506ee74e1da15a3964642a512e # timeout=10
Setting JDK1_8_0_45_HOME=/home/jenkins/jenkins-slave/tools/hudson.model.JDK/jdk1.8.0_45
Setting GRADLE_2_4_RC_2_HOME=/home/jenkins/jenkins-slave/tools/hudson.plugins.gradle.GradleInstallation/Gradle_2.4-rc-2
[kafka-trunk-jdk8] $ /bin/bash -xe /tmp/hudson5859266234426913771.sh
+ /home/jenkins/jenkins-slave/tools/hudson.plugins.gradle.GradleInstallation/Gradle_2.4-rc-2/bin/gradle
To honour the JVM settings for this build a new JVM will be forked. Please consider using the daemon: http://gradle.org/docs/2.4-rc-2/userguide/gradle_daemon.html.
Building project 'core' with Scala version 2.10.6
:downloadWrapper
BUILD SUCCESSFUL
Total time: 8.899 secs
Setting JDK1_8_0_45_HOME=/home/jenkins/jenkins-slave/tools/hudson.model.JDK/jdk1.8.0_45
Setting GRADLE_2_4_RC_2_HOME=/home/jenkins/jenkins-slave/tools/hudson.plugins.gradle.GradleInstallation/Gradle_2.4-rc-2
[kafka-trunk-jdk8] $ /bin/bash -xe /tmp/hudson1481640306634556333.sh
+ export GRADLE_OPTS=-Xmx1024m
+ GRADLE_OPTS=-Xmx1024m
+ ./gradlew -Dorg.gradle.project.maxParallelForks=1 clean jarAll testAll
To honour the JVM settings for this build a new JVM will be forked. Please consider using the daemon: https://docs.gradle.org/2.10/userguide/gradle_daemon.html.
Building project 'core' with Scala version 2.10.6
:clean UP-TO-DATE
:clients:clean UP-TO-DATE
:connect:clean UP-TO-DATE
:core:clean UP-TO-DATE
:examples:clean UP-TO-DATE
:log4j-appender:clean UP-TO-DATE
:streams:clean UP-TO-DATE
:tools:clean UP-TO-DATE
:connect:api:clean UP-TO-DATE
:connect:file:clean UP-TO-DATE
:connect:json:clean UP-TO-DATE
:connect:runtime:clean UP-TO-DATE
:streams:examples:clean UP-TO-DATE
:jar_core_2_10
Building project 'core' with Scala version 2.10.6
:kafka-trunk-jdk8:clients:compileJava
:jar_core_2_10 FAILED
FAILURE: Build failed with an exception.
* What went wrong:
Failed to capture snapshot of input files for task 'compileJava' during up-to-date check. See stacktrace for details.
> Could not add entry '/home/jenkins/.gradle/caches/modules-2/files-2.1/net.jpountz.lz4/lz4/1.3.0/c708bb2590c0652a642236ef45d9f99ff842a2ce/lz4-1.3.0.jar' to cache fileHashes.bin (<https://builds.apache.org/job/kafka-trunk-jdk8/ws/.gradle/2.10/taskArtifacts/fileHashes.bin).>
* Try:
Run with --stacktrace option to get the stack trace. Run with --info or --debug option to get more log output.
BUILD FAILED
Total time: 9.923 secs
Build step 'Execute shell' marked build as failure
Recording test results
Setting JDK1_8_0_45_HOME=/home/jenkins/jenkins-slave/tools/hudson.model.JDK/jdk1.8.0_45
Setting GRADLE_2_4_RC_2_HOME=/home/jenkins/jenkins-slave/tools/hudson.plugins.gradle.GradleInstallation/Gradle_2.4-rc-2
ERROR: Publisher 'Publish JUnit test result report' failed: No test report files were found. Configuration error?
Setting JDK1_8_0_45_HOME=/home/jenkins/jenkins-slave/tools/hudson.model.JDK/jdk1.8.0_45
Setting GRADLE_2_4_RC_2_HOME=/home/jenkins/jenkins-slave/tools/hudson.plugins.gradle.GradleInstallation/Gradle_2.4-rc-2
Build failed in Jenkins: kafka-trunk-jdk8 #311
Posted by Apache Jenkins Server <je...@builds.apache.org>.
See <https://builds.apache.org/job/kafka-trunk-jdk8/311/changes>
Changes:
[me] MINOR: Fixed undefined method `update_guest'
[me] KAFKA-3134: Fix missing value.deserializer error during KafkaConsumer
------------------------------------------
Started by an SCM change
[EnvInject] - Loading node environment variables.
Building remotely on ubuntu-2 (docker Ubuntu ubuntu yahoo-not-h2) in workspace <https://builds.apache.org/job/kafka-trunk-jdk8/ws/>
> git rev-parse --is-inside-work-tree # timeout=10
Fetching changes from the remote Git repository
> git config remote.origin.url https://git-wip-us.apache.org/repos/asf/kafka.git # timeout=10
Fetching upstream changes from https://git-wip-us.apache.org/repos/asf/kafka.git
> git --version # timeout=10
> git -c core.askpass=true fetch --tags --progress https://git-wip-us.apache.org/repos/asf/kafka.git +refs/heads/*:refs/remotes/origin/*
> git rev-parse refs/remotes/origin/trunk^{commit} # timeout=10
> git rev-parse refs/remotes/origin/origin/trunk^{commit} # timeout=10
Checking out Revision 5e8a084834ad35506ee74e1da15a3964642a512e (refs/remotes/origin/trunk)
> git config core.sparsecheckout # timeout=10
> git checkout -f 5e8a084834ad35506ee74e1da15a3964642a512e
> git rev-list d00cf520fb0b36c7c705250b1773db2f242d5f44 # timeout=10
Setting JDK1_8_0_45_HOME=/home/jenkins/jenkins-slave/tools/hudson.model.JDK/jdk1.8.0_45
Setting GRADLE_2_4_RC_2_HOME=/home/jenkins/jenkins-slave/tools/hudson.plugins.gradle.GradleInstallation/Gradle_2.4-rc-2
[kafka-trunk-jdk8] $ /bin/bash -xe /tmp/hudson1454130029835881017.sh
+ /home/jenkins/jenkins-slave/tools/hudson.plugins.gradle.GradleInstallation/Gradle_2.4-rc-2/bin/gradle
To honour the JVM settings for this build a new JVM will be forked. Please consider using the daemon: http://gradle.org/docs/2.4-rc-2/userguide/gradle_daemon.html.
Building project 'core' with Scala version 2.10.6
:downloadWrapper
BUILD SUCCESSFUL
Total time: 15.654 secs
Setting JDK1_8_0_45_HOME=/home/jenkins/jenkins-slave/tools/hudson.model.JDK/jdk1.8.0_45
Setting GRADLE_2_4_RC_2_HOME=/home/jenkins/jenkins-slave/tools/hudson.plugins.gradle.GradleInstallation/Gradle_2.4-rc-2
[kafka-trunk-jdk8] $ /bin/bash -xe /tmp/hudson6440679830465674655.sh
+ export GRADLE_OPTS=-Xmx1024m
+ GRADLE_OPTS=-Xmx1024m
+ ./gradlew -Dorg.gradle.project.maxParallelForks=1 clean jarAll testAll
To honour the JVM settings for this build a new JVM will be forked. Please consider using the daemon: https://docs.gradle.org/2.10/userguide/gradle_daemon.html.
Building project 'core' with Scala version 2.10.6
:clean UP-TO-DATE
:clients:clean UP-TO-DATE
:connect:clean UP-TO-DATE
:core:clean UP-TO-DATE
:examples:clean UP-TO-DATE
:log4j-appender:clean UP-TO-DATE
:streams:clean UP-TO-DATE
:tools:clean UP-TO-DATE
:connect:api:clean UP-TO-DATE
:connect:file:clean UP-TO-DATE
:connect:json:clean UP-TO-DATE
:connect:runtime:clean UP-TO-DATE
:streams:examples:clean UP-TO-DATE
:jar_core_2_10
Building project 'core' with Scala version 2.10.6
:kafka-trunk-jdk8:clients:compileJava
:jar_core_2_10 FAILED
FAILURE: Build failed with an exception.
* What went wrong:
Failed to capture snapshot of input files for task 'compileJava' during up-to-date check. See stacktrace for details.
> Could not add entry '/home/jenkins/.gradle/caches/modules-2/files-2.1/net.jpountz.lz4/lz4/1.3.0/c708bb2590c0652a642236ef45d9f99ff842a2ce/lz4-1.3.0.jar' to cache fileHashes.bin (<https://builds.apache.org/job/kafka-trunk-jdk8/ws/.gradle/2.10/taskArtifacts/fileHashes.bin).>
* Try:
Run with --stacktrace option to get the stack trace. Run with --info or --debug option to get more log output.
BUILD FAILED
Total time: 13.762 secs
Build step 'Execute shell' marked build as failure
Recording test results
Setting JDK1_8_0_45_HOME=/home/jenkins/jenkins-slave/tools/hudson.model.JDK/jdk1.8.0_45
Setting GRADLE_2_4_RC_2_HOME=/home/jenkins/jenkins-slave/tools/hudson.plugins.gradle.GradleInstallation/Gradle_2.4-rc-2
ERROR: Publisher 'Publish JUnit test result report' failed: No test report files were found. Configuration error?
Setting JDK1_8_0_45_HOME=/home/jenkins/jenkins-slave/tools/hudson.model.JDK/jdk1.8.0_45
Setting GRADLE_2_4_RC_2_HOME=/home/jenkins/jenkins-slave/tools/hudson.plugins.gradle.GradleInstallation/Gradle_2.4-rc-2
Build failed in Jenkins: kafka-trunk-jdk8 #310
Posted by Apache Jenkins Server <je...@builds.apache.org>.
See <https://builds.apache.org/job/kafka-trunk-jdk8/310/changes>
Changes:
[me] MINOR: Improve Kafka documentation
------------------------------------------
Started by an SCM change
[EnvInject] - Loading node environment variables.
Building remotely on H11 (docker Ubuntu ubuntu yahoo-not-h2) in workspace <https://builds.apache.org/job/kafka-trunk-jdk8/ws/>
> git rev-parse --is-inside-work-tree # timeout=10
Fetching changes from the remote Git repository
> git config remote.origin.url https://git-wip-us.apache.org/repos/asf/kafka.git # timeout=10
Fetching upstream changes from https://git-wip-us.apache.org/repos/asf/kafka.git
> git --version # timeout=10
> git -c core.askpass=true fetch --tags --progress https://git-wip-us.apache.org/repos/asf/kafka.git +refs/heads/*:refs/remotes/origin/*
> git rev-parse refs/remotes/origin/trunk^{commit} # timeout=10
> git rev-parse refs/remotes/origin/origin/trunk^{commit} # timeout=10
Checking out Revision d00cf520fb0b36c7c705250b1773db2f242d5f44 (refs/remotes/origin/trunk)
> git config core.sparsecheckout # timeout=10
> git checkout -f d00cf520fb0b36c7c705250b1773db2f242d5f44
> git rev-list 4f39b5bc5b2104fb39ab5b0c087fe84a71205a74 # timeout=10
Setting JDK1_8_0_45_HOME=/home/jenkins/jenkins-slave/tools/hudson.model.JDK/jdk1.8.0_45
Setting GRADLE_2_4_RC_2_HOME=/home/jenkins/jenkins-slave/tools/hudson.plugins.gradle.GradleInstallation/Gradle_2.4-rc-2
[kafka-trunk-jdk8] $ /bin/bash -xe /tmp/hudson8981097962683057057.sh
+ /home/jenkins/jenkins-slave/tools/hudson.plugins.gradle.GradleInstallation/Gradle_2.4-rc-2/bin/gradle
To honour the JVM settings for this build a new JVM will be forked. Please consider using the daemon: http://gradle.org/docs/2.4-rc-2/userguide/gradle_daemon.html.
Building project 'core' with Scala version 2.10.6
:downloadWrapper
BUILD SUCCESSFUL
Total time: 11.773 secs
Setting JDK1_8_0_45_HOME=/home/jenkins/jenkins-slave/tools/hudson.model.JDK/jdk1.8.0_45
Setting GRADLE_2_4_RC_2_HOME=/home/jenkins/jenkins-slave/tools/hudson.plugins.gradle.GradleInstallation/Gradle_2.4-rc-2
[kafka-trunk-jdk8] $ /bin/bash -xe /tmp/hudson7233861946163356963.sh
+ export GRADLE_OPTS=-Xmx1024m
+ GRADLE_OPTS=-Xmx1024m
+ ./gradlew -Dorg.gradle.project.maxParallelForks=1 clean jarAll testAll
To honour the JVM settings for this build a new JVM will be forked. Please consider using the daemon: https://docs.gradle.org/2.10/userguide/gradle_daemon.html.
Building project 'core' with Scala version 2.10.6
:clean UP-TO-DATE
:clients:clean UP-TO-DATE
:connect:clean UP-TO-DATE
:core:clean UP-TO-DATE
:examples:clean UP-TO-DATE
:log4j-appender:clean UP-TO-DATE
:streams:clean UP-TO-DATE
:tools:clean UP-TO-DATE
:connect:api:clean UP-TO-DATE
:connect:file:clean UP-TO-DATE
:connect:json:clean UP-TO-DATE
:connect:runtime:clean UP-TO-DATE
:streams:examples:clean UP-TO-DATE
:jar_core_2_10
Building project 'core' with Scala version 2.10.6
:kafka-trunk-jdk8:clients:compileJava
:jar_core_2_10 FAILED
FAILURE: Build failed with an exception.
* What went wrong:
Failed to capture snapshot of input files for task 'compileJava' during up-to-date check. See stacktrace for details.
> Could not add entry '/home/jenkins/.gradle/caches/modules-2/files-2.1/net.jpountz.lz4/lz4/1.3.0/c708bb2590c0652a642236ef45d9f99ff842a2ce/lz4-1.3.0.jar' to cache fileHashes.bin (<https://builds.apache.org/job/kafka-trunk-jdk8/ws/.gradle/2.10/taskArtifacts/fileHashes.bin).>
* Try:
Run with --stacktrace option to get the stack trace. Run with --info or --debug option to get more log output.
BUILD FAILED
Total time: 14.446 secs
Build step 'Execute shell' marked build as failure
Recording test results
Setting JDK1_8_0_45_HOME=/home/jenkins/jenkins-slave/tools/hudson.model.JDK/jdk1.8.0_45
Setting GRADLE_2_4_RC_2_HOME=/home/jenkins/jenkins-slave/tools/hudson.plugins.gradle.GradleInstallation/Gradle_2.4-rc-2
ERROR: Publisher 'Publish JUnit test result report' failed: No test report files were found. Configuration error?
Setting JDK1_8_0_45_HOME=/home/jenkins/jenkins-slave/tools/hudson.model.JDK/jdk1.8.0_45
Setting GRADLE_2_4_RC_2_HOME=/home/jenkins/jenkins-slave/tools/hudson.plugins.gradle.GradleInstallation/Gradle_2.4-rc-2
Build failed in Jenkins: kafka-trunk-jdk8 #309
Posted by Apache Jenkins Server <je...@builds.apache.org>.
See <https://builds.apache.org/job/kafka-trunk-jdk8/309/changes>
Changes:
[me] KAFKA-2846: Add Ducktape test for kafka-consumer-groups
------------------------------------------
Started by an SCM change
[EnvInject] - Loading node environment variables.
Building remotely on H11 (docker Ubuntu ubuntu yahoo-not-h2) in workspace <https://builds.apache.org/job/kafka-trunk-jdk8/ws/>
> git rev-parse --is-inside-work-tree # timeout=10
Fetching changes from the remote Git repository
> git config remote.origin.url https://git-wip-us.apache.org/repos/asf/kafka.git # timeout=10
Fetching upstream changes from https://git-wip-us.apache.org/repos/asf/kafka.git
> git --version # timeout=10
> git -c core.askpass=true fetch --tags --progress https://git-wip-us.apache.org/repos/asf/kafka.git +refs/heads/*:refs/remotes/origin/*
> git rev-parse refs/remotes/origin/trunk^{commit} # timeout=10
> git rev-parse refs/remotes/origin/origin/trunk^{commit} # timeout=10
Checking out Revision 4f39b5bc5b2104fb39ab5b0c087fe84a71205a74 (refs/remotes/origin/trunk)
> git config core.sparsecheckout # timeout=10
> git checkout -f 4f39b5bc5b2104fb39ab5b0c087fe84a71205a74
> git rev-list bc9237701b06768c119e954ddb4cd2e61c24e305 # timeout=10
Setting JDK1_8_0_45_HOME=/home/jenkins/jenkins-slave/tools/hudson.model.JDK/jdk1.8.0_45
Setting GRADLE_2_4_RC_2_HOME=/home/jenkins/jenkins-slave/tools/hudson.plugins.gradle.GradleInstallation/Gradle_2.4-rc-2
[kafka-trunk-jdk8] $ /bin/bash -xe /tmp/hudson5894136376158890533.sh
+ /home/jenkins/jenkins-slave/tools/hudson.plugins.gradle.GradleInstallation/Gradle_2.4-rc-2/bin/gradle
To honour the JVM settings for this build a new JVM will be forked. Please consider using the daemon: http://gradle.org/docs/2.4-rc-2/userguide/gradle_daemon.html.
Building project 'core' with Scala version 2.10.6
:downloadWrapper
BUILD SUCCESSFUL
Total time: 16.511 secs
Setting JDK1_8_0_45_HOME=/home/jenkins/jenkins-slave/tools/hudson.model.JDK/jdk1.8.0_45
Setting GRADLE_2_4_RC_2_HOME=/home/jenkins/jenkins-slave/tools/hudson.plugins.gradle.GradleInstallation/Gradle_2.4-rc-2
[kafka-trunk-jdk8] $ /bin/bash -xe /tmp/hudson9197031999886613459.sh
+ export GRADLE_OPTS=-Xmx1024m
+ GRADLE_OPTS=-Xmx1024m
+ ./gradlew -Dorg.gradle.project.maxParallelForks=1 clean jarAll testAll
To honour the JVM settings for this build a new JVM will be forked. Please consider using the daemon: https://docs.gradle.org/2.10/userguide/gradle_daemon.html.
Building project 'core' with Scala version 2.10.6
:clean UP-TO-DATE
:clients:clean UP-TO-DATE
:connect:clean UP-TO-DATE
:core:clean UP-TO-DATE
:examples:clean UP-TO-DATE
:log4j-appender:clean UP-TO-DATE
:streams:clean UP-TO-DATE
:tools:clean UP-TO-DATE
:connect:api:clean UP-TO-DATE
:connect:file:clean UP-TO-DATE
:connect:json:clean UP-TO-DATE
:connect:runtime:clean UP-TO-DATE
:streams:examples:clean UP-TO-DATE
:jar_core_2_10
Building project 'core' with Scala version 2.10.6
:kafka-trunk-jdk8:clients:compileJava
:jar_core_2_10 FAILED
FAILURE: Build failed with an exception.
* What went wrong:
Failed to capture snapshot of input files for task 'compileJava' during up-to-date check. See stacktrace for details.
> Could not add entry '/home/jenkins/.gradle/caches/modules-2/files-2.1/net.jpountz.lz4/lz4/1.3.0/c708bb2590c0652a642236ef45d9f99ff842a2ce/lz4-1.3.0.jar' to cache fileHashes.bin (<https://builds.apache.org/job/kafka-trunk-jdk8/ws/.gradle/2.10/taskArtifacts/fileHashes.bin).>
* Try:
Run with --stacktrace option to get the stack trace. Run with --info or --debug option to get more log output.
BUILD FAILED
Total time: 15.859 secs
Build step 'Execute shell' marked build as failure
Recording test results
Setting JDK1_8_0_45_HOME=/home/jenkins/jenkins-slave/tools/hudson.model.JDK/jdk1.8.0_45
Setting GRADLE_2_4_RC_2_HOME=/home/jenkins/jenkins-slave/tools/hudson.plugins.gradle.GradleInstallation/Gradle_2.4-rc-2
ERROR: Publisher 'Publish JUnit test result report' failed: No test report files were found. Configuration error?
Setting JDK1_8_0_45_HOME=/home/jenkins/jenkins-slave/tools/hudson.model.JDK/jdk1.8.0_45
Setting GRADLE_2_4_RC_2_HOME=/home/jenkins/jenkins-slave/tools/hudson.plugins.gradle.GradleInstallation/Gradle_2.4-rc-2
Build failed in Jenkins: kafka-trunk-jdk8 #308
Posted by Apache Jenkins Server <je...@builds.apache.org>.
See <https://builds.apache.org/job/kafka-trunk-jdk8/308/changes>
Changes:
[cshapi] KAFKA-3140: Fix PatternSyntaxException and hand caused by it in Mirroâ¦
------------------------------------------
Started by an SCM change
[EnvInject] - Loading node environment variables.
Building remotely on H11 (docker Ubuntu ubuntu yahoo-not-h2) in workspace <https://builds.apache.org/job/kafka-trunk-jdk8/ws/>
> git rev-parse --is-inside-work-tree # timeout=10
Fetching changes from the remote Git repository
> git config remote.origin.url https://git-wip-us.apache.org/repos/asf/kafka.git # timeout=10
Fetching upstream changes from https://git-wip-us.apache.org/repos/asf/kafka.git
> git --version # timeout=10
> git -c core.askpass=true fetch --tags --progress https://git-wip-us.apache.org/repos/asf/kafka.git +refs/heads/*:refs/remotes/origin/*
> git rev-parse refs/remotes/origin/trunk^{commit} # timeout=10
> git rev-parse refs/remotes/origin/origin/trunk^{commit} # timeout=10
Checking out Revision bc9237701b06768c119e954ddb4cd2e61c24e305 (refs/remotes/origin/trunk)
> git config core.sparsecheckout # timeout=10
> git checkout -f bc9237701b06768c119e954ddb4cd2e61c24e305
> git rev-list c197113a9c04e2f6c2d1a72161c0d40d5804490e # timeout=10
Setting JDK1_8_0_45_HOME=/home/jenkins/jenkins-slave/tools/hudson.model.JDK/jdk1.8.0_45
Setting GRADLE_2_4_RC_2_HOME=/home/jenkins/jenkins-slave/tools/hudson.plugins.gradle.GradleInstallation/Gradle_2.4-rc-2
[kafka-trunk-jdk8] $ /bin/bash -xe /tmp/hudson4248277982161186294.sh
+ /home/jenkins/jenkins-slave/tools/hudson.plugins.gradle.GradleInstallation/Gradle_2.4-rc-2/bin/gradle
To honour the JVM settings for this build a new JVM will be forked. Please consider using the daemon: http://gradle.org/docs/2.4-rc-2/userguide/gradle_daemon.html.
Building project 'core' with Scala version 2.10.6
:downloadWrapper
BUILD SUCCESSFUL
Total time: 12.074 secs
Setting JDK1_8_0_45_HOME=/home/jenkins/jenkins-slave/tools/hudson.model.JDK/jdk1.8.0_45
Setting GRADLE_2_4_RC_2_HOME=/home/jenkins/jenkins-slave/tools/hudson.plugins.gradle.GradleInstallation/Gradle_2.4-rc-2
[kafka-trunk-jdk8] $ /bin/bash -xe /tmp/hudson4562666494061739072.sh
+ export GRADLE_OPTS=-Xmx1024m
+ GRADLE_OPTS=-Xmx1024m
+ ./gradlew -Dorg.gradle.project.maxParallelForks=1 clean jarAll testAll
To honour the JVM settings for this build a new JVM will be forked. Please consider using the daemon: https://docs.gradle.org/2.10/userguide/gradle_daemon.html.
Building project 'core' with Scala version 2.10.6
:clean UP-TO-DATE
:clients:clean UP-TO-DATE
:connect:clean UP-TO-DATE
:core:clean UP-TO-DATE
:examples:clean UP-TO-DATE
:log4j-appender:clean UP-TO-DATE
:streams:clean UP-TO-DATE
:tools:clean UP-TO-DATE
:connect:api:clean UP-TO-DATE
:connect:file:clean UP-TO-DATE
:connect:json:clean UP-TO-DATE
:connect:runtime:clean UP-TO-DATE
:streams:examples:clean UP-TO-DATE
:jar_core_2_10
Building project 'core' with Scala version 2.10.6
:kafka-trunk-jdk8:clients:compileJava
:jar_core_2_10 FAILED
FAILURE: Build failed with an exception.
* What went wrong:
Failed to capture snapshot of input files for task 'compileJava' during up-to-date check. See stacktrace for details.
> Could not add entry '/home/jenkins/.gradle/caches/modules-2/files-2.1/net.jpountz.lz4/lz4/1.3.0/c708bb2590c0652a642236ef45d9f99ff842a2ce/lz4-1.3.0.jar' to cache fileHashes.bin (<https://builds.apache.org/job/kafka-trunk-jdk8/ws/.gradle/2.10/taskArtifacts/fileHashes.bin).>
* Try:
Run with --stacktrace option to get the stack trace. Run with --info or --debug option to get more log output.
BUILD FAILED
Total time: 14.646 secs
Build step 'Execute shell' marked build as failure
Recording test results
Setting JDK1_8_0_45_HOME=/home/jenkins/jenkins-slave/tools/hudson.model.JDK/jdk1.8.0_45
Setting GRADLE_2_4_RC_2_HOME=/home/jenkins/jenkins-slave/tools/hudson.plugins.gradle.GradleInstallation/Gradle_2.4-rc-2
ERROR: Publisher 'Publish JUnit test result report' failed: No test report files were found. Configuration error?
Setting JDK1_8_0_45_HOME=/home/jenkins/jenkins-slave/tools/hudson.model.JDK/jdk1.8.0_45
Setting GRADLE_2_4_RC_2_HOME=/home/jenkins/jenkins-slave/tools/hudson.plugins.gradle.GradleInstallation/Gradle_2.4-rc-2
Build failed in Jenkins: kafka-trunk-jdk8 #307
Posted by Apache Jenkins Server <je...@builds.apache.org>.
See <https://builds.apache.org/job/kafka-trunk-jdk8/307/changes>
Changes:
[me] KAFKA-3066: Demo Examples for Kafka Streams
------------------------------------------
Started by an SCM change
[EnvInject] - Loading node environment variables.
Building remotely on H11 (docker Ubuntu ubuntu yahoo-not-h2) in workspace <https://builds.apache.org/job/kafka-trunk-jdk8/ws/>
> git rev-parse --is-inside-work-tree # timeout=10
Fetching changes from the remote Git repository
> git config remote.origin.url https://git-wip-us.apache.org/repos/asf/kafka.git # timeout=10
Fetching upstream changes from https://git-wip-us.apache.org/repos/asf/kafka.git
> git --version # timeout=10
> git -c core.askpass=true fetch --tags --progress https://git-wip-us.apache.org/repos/asf/kafka.git +refs/heads/*:refs/remotes/origin/*
> git rev-parse refs/remotes/origin/trunk^{commit} # timeout=10
> git rev-parse refs/remotes/origin/origin/trunk^{commit} # timeout=10
Checking out Revision c197113a9c04e2f6c2d1a72161c0d40d5804490e (refs/remotes/origin/trunk)
> git config core.sparsecheckout # timeout=10
> git checkout -f c197113a9c04e2f6c2d1a72161c0d40d5804490e
> git rev-list a19729fe61b23178c6f91135cb81901f76f982f0 # timeout=10
Setting JDK1_8_0_45_HOME=/home/jenkins/jenkins-slave/tools/hudson.model.JDK/jdk1.8.0_45
Setting GRADLE_2_4_RC_2_HOME=/home/jenkins/jenkins-slave/tools/hudson.plugins.gradle.GradleInstallation/Gradle_2.4-rc-2
[kafka-trunk-jdk8] $ /bin/bash -xe /tmp/hudson2540907725560568292.sh
+ /home/jenkins/jenkins-slave/tools/hudson.plugins.gradle.GradleInstallation/Gradle_2.4-rc-2/bin/gradle
To honour the JVM settings for this build a new JVM will be forked. Please consider using the daemon: http://gradle.org/docs/2.4-rc-2/userguide/gradle_daemon.html.
Building project 'core' with Scala version 2.10.6
:downloadWrapper
BUILD SUCCESSFUL
Total time: 16.607 secs
Setting JDK1_8_0_45_HOME=/home/jenkins/jenkins-slave/tools/hudson.model.JDK/jdk1.8.0_45
Setting GRADLE_2_4_RC_2_HOME=/home/jenkins/jenkins-slave/tools/hudson.plugins.gradle.GradleInstallation/Gradle_2.4-rc-2
[kafka-trunk-jdk8] $ /bin/bash -xe /tmp/hudson2835799656596372570.sh
+ export GRADLE_OPTS=-Xmx1024m
+ GRADLE_OPTS=-Xmx1024m
+ ./gradlew -Dorg.gradle.project.maxParallelForks=1 clean jarAll testAll
To honour the JVM settings for this build a new JVM will be forked. Please consider using the daemon: https://docs.gradle.org/2.10/userguide/gradle_daemon.html.
Building project 'core' with Scala version 2.10.6
:clean UP-TO-DATE
:clients:clean UP-TO-DATE
:connect:clean UP-TO-DATE
:core:clean UP-TO-DATE
:examples:clean UP-TO-DATE
:log4j-appender:clean UP-TO-DATE
:streams:clean UP-TO-DATE
:tools:clean UP-TO-DATE
:connect:api:clean UP-TO-DATE
:connect:file:clean UP-TO-DATE
:connect:json:clean UP-TO-DATE
:connect:runtime:clean UP-TO-DATE
:streams:examples:clean UP-TO-DATE
:jar_core_2_10
Building project 'core' with Scala version 2.10.6
:kafka-trunk-jdk8:clients:compileJava
:jar_core_2_10 FAILED
FAILURE: Build failed with an exception.
* What went wrong:
Failed to capture snapshot of input files for task 'compileJava' during up-to-date check. See stacktrace for details.
> Could not add entry '/home/jenkins/.gradle/caches/modules-2/files-2.1/net.jpountz.lz4/lz4/1.3.0/c708bb2590c0652a642236ef45d9f99ff842a2ce/lz4-1.3.0.jar' to cache fileHashes.bin (<https://builds.apache.org/job/kafka-trunk-jdk8/ws/.gradle/2.10/taskArtifacts/fileHashes.bin).>
* Try:
Run with --stacktrace option to get the stack trace. Run with --info or --debug option to get more log output.
BUILD FAILED
Total time: 17.017 secs
Build step 'Execute shell' marked build as failure
Recording test results
Setting JDK1_8_0_45_HOME=/home/jenkins/jenkins-slave/tools/hudson.model.JDK/jdk1.8.0_45
Setting GRADLE_2_4_RC_2_HOME=/home/jenkins/jenkins-slave/tools/hudson.plugins.gradle.GradleInstallation/Gradle_2.4-rc-2
ERROR: Publisher 'Publish JUnit test result report' failed: No test report files were found. Configuration error?
Setting JDK1_8_0_45_HOME=/home/jenkins/jenkins-slave/tools/hudson.model.JDK/jdk1.8.0_45
Setting GRADLE_2_4_RC_2_HOME=/home/jenkins/jenkins-slave/tools/hudson.plugins.gradle.GradleInstallation/Gradle_2.4-rc-2