You are viewing a plain text version of this content. The canonical link for it is here.
Posted to commits@flex.apache.org by fl...@gmail.com on 2014/07/27 14:53:46 UTC
Build failed in Jenkins: InstallApacheFlex #89
See <http://apacheflexbuild.cloudapp.net:8080/job/InstallApacheFlex/89/>
------------------------------------------
Started by timer
Building remotely on flex-sdk slave in workspace <http://apacheflexbuild.cloudapp.net:8080/job/InstallApacheFlex/ws/>
Fetching changes from the remote Git repository
Fetching upstream changes from https://git-wip-us.apache.org/repos/asf/flex-utilities.git
Checking out Revision 861b586fe839fd23088c6f72b180c56745d246f9 (origin/develop)
[ant_on_air] $ cmd.exe /C '"c:\Jenkins\tools\hudson.tasks.Ant_AntInstallation\c_apache-ant-1.9.3\bin\ant.bat -file build.xml -Dplayerglobal.version=11.7 main && exit %%ERRORLEVEL%%"'
Buildfile: <http://apacheflexbuild.cloudapp.net:8080/job/InstallApacheFlex/ws/ant_on_air/build.xml>
clean:
[delete] Deleting directory <http://apacheflexbuild.cloudapp.net:8080/job/InstallApacheFlex/ws/ant_on_air/bin>
init:
check-as3commons.swc:
get-as3commons.swc:
third-party:
[get] Destination already exists (skipping): <http://apacheflexbuild.cloudapp.net:8080/job/InstallApacheFlex/ws/ant_on_air/external/de/ketzler/utils/SimpleUntar.as>
[get] Destination already exists (skipping): <http://apacheflexbuild.cloudapp.net:8080/job/InstallApacheFlex/ws/ant_on_air/external/de/ketzler/utils/untar/UntarFileInfo.as>
[get] Destination already exists (skipping): <http://apacheflexbuild.cloudapp.net:8080/job/InstallApacheFlex/ws/ant_on_air/external/de/ketzler/utils/untar/UntarHeaderBlock.as>
[get] Destination already exists (skipping): <http://apacheflexbuild.cloudapp.net:8080/job/InstallApacheFlex/ws/ant_on_air/external/com/probertson/utils/CRC32Generator.as>
[get] Destination already exists (skipping): <http://apacheflexbuild.cloudapp.net:8080/job/InstallApacheFlex/ws/ant_on_air/external/com/probertson/utils/GZIPBytesEncoder.as>
[get] Destination already exists (skipping): <http://apacheflexbuild.cloudapp.net:8080/job/InstallApacheFlex/ws/ant_on_air/external/com/probertson/utils/GZIPEncoder.as>
[get] Destination already exists (skipping): <http://apacheflexbuild.cloudapp.net:8080/job/InstallApacheFlex/ws/ant_on_air/external/com/probertson/utils/GZIPFile.as>
compile:
[compc] Loading configuration file C:\Jenkins\workspace\flex-sdk\frameworks\air-config.xml
[compc] Warning: The swc 'C:\Jenkins\workspace\flex-sdk\frameworks\libs\framework.swc' has style defaults and is in the library-path, which means dependencies will be linked in without the styles. This can cause applications, which use the output swc, to have missing skins. The swc should be put in the external-library-path.
[compc]
[compc] Warning: The swc 'C:\Jenkins\workspace\flex-sdk\frameworks\libs\spark.swc' has style defaults and is in the library-path, which means dependencies will be linked in without the styles. This can cause applications, which use the output swc, to have missing skins. The swc should be put in the external-library-path.
[compc]
[compc] C:\Jenkins\workspace\InstallApacheFlex\ant_on_air\bin\ant_on_air.swc (499839 bytes)
test:
[mxmlc] Loading configuration file C:\Jenkins\workspace\flex-sdk\frameworks\air-config.xml
[mxmlc] C:\Jenkins\workspace\InstallApacheFlex\ant_on_air\tests\AntOnAir.swf (1151367 bytes)
BUILD FAILED
<http://apacheflexbuild.cloudapp.net:8080/job/InstallApacheFlex/ws/ant_on_air/build.xml>:170: exec returned: 255
Total time: 50 seconds
Build step 'Invoke Ant' marked build as failure
Archiving artifacts
Jenkins build is back to normal : InstallApacheFlex #95
Posted by fl...@gmail.com.
See <http://apacheflexbuild.cloudapp.net:8080/job/InstallApacheFlex/95/changes>
Build failed in Jenkins: InstallApacheFlex #94
Posted by fl...@gmail.com.
See <http://apacheflexbuild.cloudapp.net:8080/job/InstallApacheFlex/94/changes>
Changes:
[Alex Harui] try setting user client so GitHub returns etag on Windows (does on mac)
[Alex Harui] etag has different capitalization on windows
------------------------------------------
Started by an SCM change
Building remotely on flex-sdk slave in workspace <http://apacheflexbuild.cloudapp.net:8080/job/InstallApacheFlex/ws/>
Fetching changes from the remote Git repository
Fetching upstream changes from https://git-wip-us.apache.org/repos/asf/flex-utilities.git
Checking out Revision bd47524f452068a180d24ec1f76f9017c472807f (origin/develop)
[ant_on_air] $ cmd.exe /C '"c:\Jenkins\tools\hudson.tasks.Ant_AntInstallation\c_apache-ant-1.9.3\bin\ant.bat -file build.xml -Dplayerglobal.version=11.7 main && exit %%ERRORLEVEL%%"'
Buildfile: <http://apacheflexbuild.cloudapp.net:8080/job/InstallApacheFlex/ws/ant_on_air/build.xml>
clean:
[delete] Deleting directory <http://apacheflexbuild.cloudapp.net:8080/job/InstallApacheFlex/ws/ant_on_air/bin>
init:
check-as3commons.swc:
get-as3commons.swc:
third-party:
[get] Destination already exists (skipping): <http://apacheflexbuild.cloudapp.net:8080/job/InstallApacheFlex/ws/ant_on_air/external/de/ketzler/utils/SimpleUntar.as>
[get] Destination already exists (skipping): <http://apacheflexbuild.cloudapp.net:8080/job/InstallApacheFlex/ws/ant_on_air/external/de/ketzler/utils/untar/UntarFileInfo.as>
[get] Destination already exists (skipping): <http://apacheflexbuild.cloudapp.net:8080/job/InstallApacheFlex/ws/ant_on_air/external/de/ketzler/utils/untar/UntarHeaderBlock.as>
[get] Destination already exists (skipping): <http://apacheflexbuild.cloudapp.net:8080/job/InstallApacheFlex/ws/ant_on_air/external/com/probertson/utils/CRC32Generator.as>
[get] Destination already exists (skipping): <http://apacheflexbuild.cloudapp.net:8080/job/InstallApacheFlex/ws/ant_on_air/external/com/probertson/utils/GZIPBytesEncoder.as>
[get] Destination already exists (skipping): <http://apacheflexbuild.cloudapp.net:8080/job/InstallApacheFlex/ws/ant_on_air/external/com/probertson/utils/GZIPEncoder.as>
[get] Destination already exists (skipping): <http://apacheflexbuild.cloudapp.net:8080/job/InstallApacheFlex/ws/ant_on_air/external/com/probertson/utils/GZIPFile.as>
compile:
[compc] Loading configuration file C:\Jenkins\workspace\flex-sdk\frameworks\air-config.xml
[compc] Warning: The swc 'C:\Jenkins\workspace\flex-sdk\frameworks\libs\framework.swc' has style defaults and is in the library-path, which means dependencies will be linked in without the styles. This can cause applications, which use the output swc, to have missing skins. The swc should be put in the external-library-path.
[compc]
[compc] Warning: The swc 'C:\Jenkins\workspace\flex-sdk\frameworks\libs\spark.swc' has style defaults and is in the library-path, which means dependencies will be linked in without the styles. This can cause applications, which use the output swc, to have missing skins. The swc should be put in the external-library-path.
[compc]
[compc] C:\Jenkins\workspace\InstallApacheFlex\ant_on_air\bin\ant_on_air.swc (499831 bytes)
test:
[mxmlc] Loading configuration file C:\Jenkins\workspace\flex-sdk\frameworks\air-config.xml
[mxmlc] C:\Jenkins\workspace\InstallApacheFlex\ant_on_air\tests\AntOnAir.swf (1151370 bytes)
BUILD FAILED
<http://apacheflexbuild.cloudapp.net:8080/job/InstallApacheFlex/ws/ant_on_air/build.xml>:170: exec returned: 255
Total time: 49 seconds
Build step 'Invoke Ant' marked build as failure
Archiving artifacts
Build failed in Jenkins: InstallApacheFlex #93
Posted by fl...@gmail.com.
See <http://apacheflexbuild.cloudapp.net:8080/job/InstallApacheFlex/93/changes>
Changes:
[Alex Harui] runs on my windows, but not in CI box. Try -app.xml version
------------------------------------------
Started by an SCM change
Building remotely on flex-sdk slave in workspace <http://apacheflexbuild.cloudapp.net:8080/job/InstallApacheFlex/ws/>
Fetching changes from the remote Git repository
Fetching upstream changes from https://git-wip-us.apache.org/repos/asf/flex-utilities.git
Checking out Revision 61521c5654f43626b9e3fb14a2c8d788ad1cc9df (origin/develop)
[ant_on_air] $ cmd.exe /C '"c:\Jenkins\tools\hudson.tasks.Ant_AntInstallation\c_apache-ant-1.9.3\bin\ant.bat -file build.xml -Dplayerglobal.version=11.7 main && exit %%ERRORLEVEL%%"'
Buildfile: <http://apacheflexbuild.cloudapp.net:8080/job/InstallApacheFlex/ws/ant_on_air/build.xml>
clean:
[delete] Deleting directory <http://apacheflexbuild.cloudapp.net:8080/job/InstallApacheFlex/ws/ant_on_air/bin>
init:
check-as3commons.swc:
get-as3commons.swc:
third-party:
[get] Destination already exists (skipping): <http://apacheflexbuild.cloudapp.net:8080/job/InstallApacheFlex/ws/ant_on_air/external/de/ketzler/utils/SimpleUntar.as>
[get] Destination already exists (skipping): <http://apacheflexbuild.cloudapp.net:8080/job/InstallApacheFlex/ws/ant_on_air/external/de/ketzler/utils/untar/UntarFileInfo.as>
[get] Destination already exists (skipping): <http://apacheflexbuild.cloudapp.net:8080/job/InstallApacheFlex/ws/ant_on_air/external/de/ketzler/utils/untar/UntarHeaderBlock.as>
[get] Destination already exists (skipping): <http://apacheflexbuild.cloudapp.net:8080/job/InstallApacheFlex/ws/ant_on_air/external/com/probertson/utils/CRC32Generator.as>
[get] Destination already exists (skipping): <http://apacheflexbuild.cloudapp.net:8080/job/InstallApacheFlex/ws/ant_on_air/external/com/probertson/utils/GZIPBytesEncoder.as>
[get] Destination already exists (skipping): <http://apacheflexbuild.cloudapp.net:8080/job/InstallApacheFlex/ws/ant_on_air/external/com/probertson/utils/GZIPEncoder.as>
[get] Destination already exists (skipping): <http://apacheflexbuild.cloudapp.net:8080/job/InstallApacheFlex/ws/ant_on_air/external/com/probertson/utils/GZIPFile.as>
compile:
[compc] Loading configuration file C:\Jenkins\workspace\flex-sdk\frameworks\air-config.xml
[compc] Warning: The swc 'C:\Jenkins\workspace\flex-sdk\frameworks\libs\framework.swc' has style defaults and is in the library-path, which means dependencies will be linked in without the styles. This can cause applications, which use the output swc, to have missing skins. The swc should be put in the external-library-path.
[compc]
[compc] Warning: The swc 'C:\Jenkins\workspace\flex-sdk\frameworks\libs\spark.swc' has style defaults and is in the library-path, which means dependencies will be linked in without the styles. This can cause applications, which use the output swc, to have missing skins. The swc should be put in the external-library-path.
[compc]
[compc] C:\Jenkins\workspace\InstallApacheFlex\ant_on_air\bin\ant_on_air.swc (499824 bytes)
test:
[mxmlc] Loading configuration file C:\Jenkins\workspace\flex-sdk\frameworks\air-config.xml
[mxmlc] C:\Jenkins\workspace\InstallApacheFlex\ant_on_air\tests\AntOnAir.swf (1151375 bytes)
BUILD FAILED
<http://apacheflexbuild.cloudapp.net:8080/job/InstallApacheFlex/ws/ant_on_air/build.xml>:170: exec returned: 255
Total time: 49 seconds
Build step 'Invoke Ant' marked build as failure
Archiving artifacts
Build failed in Jenkins: InstallApacheFlex #92
Posted by fl...@gmail.com.
See <http://apacheflexbuild.cloudapp.net:8080/job/InstallApacheFlex/92/changes>
Changes:
[Alex Harui] fix build on win
------------------------------------------
Started by an SCM change
Building remotely on flex-sdk slave in workspace <http://apacheflexbuild.cloudapp.net:8080/job/InstallApacheFlex/ws/>
Fetching changes from the remote Git repository
Fetching upstream changes from https://git-wip-us.apache.org/repos/asf/flex-utilities.git
Checking out Revision f031f5d6e559ec1021ba6bf329d573ad69c915b7 (origin/develop)
[ant_on_air] $ cmd.exe /C '"c:\Jenkins\tools\hudson.tasks.Ant_AntInstallation\c_apache-ant-1.9.3\bin\ant.bat -file build.xml -Dplayerglobal.version=11.7 main && exit %%ERRORLEVEL%%"'
Buildfile: <http://apacheflexbuild.cloudapp.net:8080/job/InstallApacheFlex/ws/ant_on_air/build.xml>
clean:
[delete] Deleting directory <http://apacheflexbuild.cloudapp.net:8080/job/InstallApacheFlex/ws/ant_on_air/bin>
init:
check-as3commons.swc:
get-as3commons.swc:
third-party:
[get] Destination already exists (skipping): <http://apacheflexbuild.cloudapp.net:8080/job/InstallApacheFlex/ws/ant_on_air/external/de/ketzler/utils/SimpleUntar.as>
[get] Destination already exists (skipping): <http://apacheflexbuild.cloudapp.net:8080/job/InstallApacheFlex/ws/ant_on_air/external/de/ketzler/utils/untar/UntarFileInfo.as>
[get] Destination already exists (skipping): <http://apacheflexbuild.cloudapp.net:8080/job/InstallApacheFlex/ws/ant_on_air/external/de/ketzler/utils/untar/UntarHeaderBlock.as>
[get] Destination already exists (skipping): <http://apacheflexbuild.cloudapp.net:8080/job/InstallApacheFlex/ws/ant_on_air/external/com/probertson/utils/CRC32Generator.as>
[get] Destination already exists (skipping): <http://apacheflexbuild.cloudapp.net:8080/job/InstallApacheFlex/ws/ant_on_air/external/com/probertson/utils/GZIPBytesEncoder.as>
[get] Destination already exists (skipping): <http://apacheflexbuild.cloudapp.net:8080/job/InstallApacheFlex/ws/ant_on_air/external/com/probertson/utils/GZIPEncoder.as>
[get] Destination already exists (skipping): <http://apacheflexbuild.cloudapp.net:8080/job/InstallApacheFlex/ws/ant_on_air/external/com/probertson/utils/GZIPFile.as>
compile:
[compc] Loading configuration file C:\Jenkins\workspace\flex-sdk\frameworks\air-config.xml
[compc] Warning: The swc 'C:\Jenkins\workspace\flex-sdk\frameworks\libs\framework.swc' has style defaults and is in the library-path, which means dependencies will be linked in without the styles. This can cause applications, which use the output swc, to have missing skins. The swc should be put in the external-library-path.
[compc]
[compc] Warning: The swc 'C:\Jenkins\workspace\flex-sdk\frameworks\libs\spark.swc' has style defaults and is in the library-path, which means dependencies will be linked in without the styles. This can cause applications, which use the output swc, to have missing skins. The swc should be put in the external-library-path.
[compc]
[compc] C:\Jenkins\workspace\InstallApacheFlex\ant_on_air\bin\ant_on_air.swc (499823 bytes)
test:
[mxmlc] Loading configuration file C:\Jenkins\workspace\flex-sdk\frameworks\air-config.xml
[mxmlc] C:\Jenkins\workspace\InstallApacheFlex\ant_on_air\tests\AntOnAir.swf (1151367 bytes)
BUILD FAILED
<http://apacheflexbuild.cloudapp.net:8080/job/InstallApacheFlex/ws/ant_on_air/build.xml>:170: exec returned: 255
Total time: 2 minutes 26 seconds
Build step 'Invoke Ant' marked build as failure
Archiving artifacts
Build failed in Jenkins: InstallApacheFlex #91
Posted by fl...@gmail.com.
See <http://apacheflexbuild.cloudapp.net:8080/job/InstallApacheFlex/91/changes>
Changes:
[jmclean] update licence with Open Sans font
[jmclean] update examples to use open san fonts
[jmclean] Fix simple application so it works with the modern SDK
[jmclean] README is out of date and Adobe centric
[jmclean] Change video to short apache flex installer video
[jmclean] file is not used and may be considered a binary
[Alex Harui] utility that will check MD5s of installer downloads
------------------------------------------
Started by an SCM change
Started by an SCM change
Started by an SCM change
Started by an SCM change
Started by an SCM change
Started by timer
Started by an SCM change
Started by an SCM change
Started by an SCM change
Started by an SCM change
Started by an SCM change
Building remotely on flex-sdk slave in workspace <http://apacheflexbuild.cloudapp.net:8080/job/InstallApacheFlex/ws/>
Fetching changes from the remote Git repository
Fetching upstream changes from https://git-wip-us.apache.org/repos/asf/flex-utilities.git
Checking out Revision 2454c94f4d04039ee20128301ed21305e9fd6a05 (origin/develop)
[ant_on_air] $ cmd.exe /C '"c:\Jenkins\tools\hudson.tasks.Ant_AntInstallation\c_apache-ant-1.9.3\bin\ant.bat -file build.xml -Dplayerglobal.version=11.7 main && exit %%ERRORLEVEL%%"'
Buildfile: <http://apacheflexbuild.cloudapp.net:8080/job/InstallApacheFlex/ws/ant_on_air/build.xml>
clean:
[delete] Deleting directory <http://apacheflexbuild.cloudapp.net:8080/job/InstallApacheFlex/ws/ant_on_air/bin>
init:
check-as3commons.swc:
get-as3commons.swc:
third-party:
[get] Destination already exists (skipping): <http://apacheflexbuild.cloudapp.net:8080/job/InstallApacheFlex/ws/ant_on_air/external/de/ketzler/utils/SimpleUntar.as>
[get] Destination already exists (skipping): <http://apacheflexbuild.cloudapp.net:8080/job/InstallApacheFlex/ws/ant_on_air/external/de/ketzler/utils/untar/UntarFileInfo.as>
[get] Destination already exists (skipping): <http://apacheflexbuild.cloudapp.net:8080/job/InstallApacheFlex/ws/ant_on_air/external/de/ketzler/utils/untar/UntarHeaderBlock.as>
[get] Destination already exists (skipping): <http://apacheflexbuild.cloudapp.net:8080/job/InstallApacheFlex/ws/ant_on_air/external/com/probertson/utils/CRC32Generator.as>
[get] Destination already exists (skipping): <http://apacheflexbuild.cloudapp.net:8080/job/InstallApacheFlex/ws/ant_on_air/external/com/probertson/utils/GZIPBytesEncoder.as>
[get] Destination already exists (skipping): <http://apacheflexbuild.cloudapp.net:8080/job/InstallApacheFlex/ws/ant_on_air/external/com/probertson/utils/GZIPEncoder.as>
[get] Destination already exists (skipping): <http://apacheflexbuild.cloudapp.net:8080/job/InstallApacheFlex/ws/ant_on_air/external/com/probertson/utils/GZIPFile.as>
compile:
[compc] Loading configuration file C:\Jenkins\workspace\flex-sdk\frameworks\air-config.xml
[compc] Warning: The swc 'C:\Jenkins\workspace\flex-sdk\frameworks\libs\framework.swc' has style defaults and is in the library-path, which means dependencies will be linked in without the styles. This can cause applications, which use the output swc, to have missing skins. The swc should be put in the external-library-path.
[compc]
[compc] Warning: The swc 'C:\Jenkins\workspace\flex-sdk\frameworks\libs\spark.swc' has style defaults and is in the library-path, which means dependencies will be linked in without the styles. This can cause applications, which use the output swc, to have missing skins. The swc should be put in the external-library-path.
[compc]
[compc] C:\Jenkins\workspace\InstallApacheFlex\ant_on_air\bin\ant_on_air.swc (499842 bytes)
test:
[mxmlc] Loading configuration file C:\Jenkins\workspace\flex-sdk\frameworks\air-config.xml
[mxmlc] C:\Jenkins\workspace\InstallApacheFlex\ant_on_air\tests\AntOnAir.swf (1151367 bytes)
BUILD FAILED
<http://apacheflexbuild.cloudapp.net:8080/job/InstallApacheFlex/ws/ant_on_air/build.xml>:170: exec returned: 255
Total time: 53 seconds
Build step 'Invoke Ant' marked build as failure
Archiving artifacts
Build failed in Jenkins: InstallApacheFlex #90
Posted by fl...@gmail.com.
See <http://apacheflexbuild.cloudapp.net:8080/job/InstallApacheFlex/90/>
------------------------------------------
Started by timer
Building remotely on flex-sdk slave in workspace <http://apacheflexbuild.cloudapp.net:8080/job/InstallApacheFlex/ws/>
Fetching changes from the remote Git repository
Fetching upstream changes from https://git-wip-us.apache.org/repos/asf/flex-utilities.git
Checking out Revision 861b586fe839fd23088c6f72b180c56745d246f9 (origin/develop)
[ant_on_air] $ cmd.exe /C '"c:\Jenkins\tools\hudson.tasks.Ant_AntInstallation\c_apache-ant-1.9.3\bin\ant.bat -file build.xml -Dplayerglobal.version=11.7 main && exit %%ERRORLEVEL%%"'
Buildfile: <http://apacheflexbuild.cloudapp.net:8080/job/InstallApacheFlex/ws/ant_on_air/build.xml>
clean:
[delete] Deleting directory <http://apacheflexbuild.cloudapp.net:8080/job/InstallApacheFlex/ws/ant_on_air/bin>
init:
check-as3commons.swc:
get-as3commons.swc:
third-party:
[get] Destination already exists (skipping): <http://apacheflexbuild.cloudapp.net:8080/job/InstallApacheFlex/ws/ant_on_air/external/de/ketzler/utils/SimpleUntar.as>
[get] Destination already exists (skipping): <http://apacheflexbuild.cloudapp.net:8080/job/InstallApacheFlex/ws/ant_on_air/external/de/ketzler/utils/untar/UntarFileInfo.as>
[get] Destination already exists (skipping): <http://apacheflexbuild.cloudapp.net:8080/job/InstallApacheFlex/ws/ant_on_air/external/de/ketzler/utils/untar/UntarHeaderBlock.as>
[get] Destination already exists (skipping): <http://apacheflexbuild.cloudapp.net:8080/job/InstallApacheFlex/ws/ant_on_air/external/com/probertson/utils/CRC32Generator.as>
[get] Destination already exists (skipping): <http://apacheflexbuild.cloudapp.net:8080/job/InstallApacheFlex/ws/ant_on_air/external/com/probertson/utils/GZIPBytesEncoder.as>
[get] Destination already exists (skipping): <http://apacheflexbuild.cloudapp.net:8080/job/InstallApacheFlex/ws/ant_on_air/external/com/probertson/utils/GZIPEncoder.as>
[get] Destination already exists (skipping): <http://apacheflexbuild.cloudapp.net:8080/job/InstallApacheFlex/ws/ant_on_air/external/com/probertson/utils/GZIPFile.as>
compile:
[compc] Loading configuration file C:\Jenkins\workspace\flex-sdk\frameworks\air-config.xml
[compc] Warning: The swc 'C:\Jenkins\workspace\flex-sdk\frameworks\libs\framework.swc' has style defaults and is in the library-path, which means dependencies will be linked in without the styles. This can cause applications, which use the output swc, to have missing skins. The swc should be put in the external-library-path.
[compc]
[compc] Warning: The swc 'C:\Jenkins\workspace\flex-sdk\frameworks\libs\spark.swc' has style defaults and is in the library-path, which means dependencies will be linked in without the styles. This can cause applications, which use the output swc, to have missing skins. The swc should be put in the external-library-path.
[compc]
[compc] C:\Jenkins\workspace\InstallApacheFlex\ant_on_air\bin\ant_on_air.swc (499827 bytes)
test:
[mxmlc] Loading configuration file C:\Jenkins\workspace\flex-sdk\frameworks\air-config.xml
[mxmlc] C:\Jenkins\workspace\InstallApacheFlex\ant_on_air\tests\AntOnAir.swf (1151367 bytes)
BUILD FAILED
<http://apacheflexbuild.cloudapp.net:8080/job/InstallApacheFlex/ws/ant_on_air/build.xml>:170: exec returned: 255
Total time: 51 seconds
Build step 'Invoke Ant' marked build as failure
Archiving artifacts