You are viewing a plain text version of this content. The canonical link for it is here.
Posted to yarn-dev@hadoop.apache.org by Apache Jenkins Server <je...@builds.apache.org> on 2015/03/03 21:10:19 UTC
Failed: YARN-3267 PreCommit Build #6821
Jira: https://issues.apache.org/jira/browse/YARN-3267
Build: https://builds.apache.org/job/PreCommit-YARN-Build/6821/
###################################################################################
########################## LAST 60 LINES OF THE CONSOLE ###########################
[...truncated 3955 lines...]
{color:green}+1 tests included{color}. The patch appears to include 4 new or modified test files.
{color:green}+1 javac{color}. The applied patch does not increase the total number of javac compiler warnings.
{color:green}+1 javadoc{color}. There were no new javadoc warning messages.
{color:green}+1 eclipse:eclipse{color}. The patch built with eclipse:eclipse.
{color:green}+1 findbugs{color}. The patch does not introduce any new Findbugs (version 2.0.3) warnings.
{color:green}+1 release audit{color}. The applied patch does not increase the total number of release audit warnings.
{color:red}-1 core tests{color}. The patch failed these unit tests in hadoop-mapreduce-project/hadoop-mapreduce-client/hadoop-mapreduce-client-app hadoop-mapreduce-project/hadoop-mapreduce-client/hadoop-mapreduce-client-jobclient hadoop-yarn-project/hadoop-yarn/hadoop-yarn-applications/hadoop-yarn-applications-distributedshell hadoop-yarn-project/hadoop-yarn/hadoop-yarn-server/hadoop-yarn-server-applicationhistoryservice:
org.apache.hadoop.mapred.TestReduceFetch
org.apache.hadoop.yarn.server.timeline.TestTimelineDataManager
org.apache.hadoop.yarn.server.timeline.webapp.TestTimelineWebServices
The following test timeouts occurred in hadoop-mapreduce-project/hadoop-mapreduce-client/hadoop-mapreduce-client-app hadoop-mapreduce-project/hadoop-mapreduce-client/hadoop-mapreduce-client-jobclient hadoop-yarn-project/hadoop-yarn/hadoop-yarn-applications/hadoop-yarn-applications-distributedshell hadoop-yarn-project/hadoop-yarn/hadoop-yarn-server/hadoop-yarn-server-applicationhistoryservice:
org.apache.hadoop.mapred.TestMRIntermediateDataEncryption
Test results: https://builds.apache.org/job/PreCommit-YARN-Build/6821//testReport/
Console output: https://builds.apache.org/job/PreCommit-YARN-Build/6821//console
This message is automatically generated.
======================================================================
======================================================================
Adding comment to Jira.
======================================================================
======================================================================
Comment added.
dc273e394384f9cb157ae25ebedf7d4543702d48 logged out
======================================================================
======================================================================
Finished build.
======================================================================
======================================================================
Build step 'Execute shell' marked build as failure
Archiving artifacts
Sending artifact delta relative to PreCommit-YARN-Build #6776
Archived 30 artifacts
Archive block size is 32768
Received 35 blocks and 7975083 bytes
Compression is 12.6%
Took 1 min 24 sec
Description set: MAPREDUCE-5583
Recording test results
Email was triggered for: Failure
Sending email for trigger: Failure
###################################################################################
############################## FAILED TESTS (if any) ##############################
3 tests failed.
FAILED: org.apache.hadoop.mapred.TestReduceFetchFromPartialMem.testReduceFromPartialMem
Error Message:
Job failed!
Stack Trace:
java.io.IOException: Job failed!
at org.apache.hadoop.mapred.JobClient.runJob(JobClient.java:838)
at org.apache.hadoop.mapred.TestReduceFetchFromPartialMem.runJob(TestReduceFetchFromPartialMem.java:300)
at org.apache.hadoop.mapred.TestReduceFetchFromPartialMem.testReduceFromPartialMem(TestReduceFetchFromPartialMem.java:93)
FAILED: org.apache.hadoop.yarn.server.timeline.TestTimelineDataManager.testGetOldEntitiesWithOutDomainId
Error Message:
expected:<DEFAULT> but was:<null>
Stack Trace:
java.lang.AssertionError: expected:<DEFAULT> but was:<null>
at org.junit.Assert.fail(Assert.java:88)
at org.junit.Assert.failNotEquals(Assert.java:743)
at org.junit.Assert.assertEquals(Assert.java:118)
at org.junit.Assert.assertEquals(Assert.java:144)
at org.apache.hadoop.yarn.server.timeline.TestTimelineDataManager.testGetOldEntitiesWithOutDomainId(TestTimelineDataManager.java:97)
FAILED: org.apache.hadoop.yarn.server.timeline.webapp.TestTimelineWebServices.testGetEntitiesWithYarnACLsEnabled
Error Message:
expected:<1> but was:<2>
Stack Trace:
java.lang.AssertionError: expected:<1> but was:<2>
at org.junit.Assert.fail(Assert.java:88)
at org.junit.Assert.failNotEquals(Assert.java:743)
at org.junit.Assert.assertEquals(Assert.java:118)
at org.junit.Assert.assertEquals(Assert.java:555)
at org.junit.Assert.assertEquals(Assert.java:542)
at org.apache.hadoop.yarn.server.timeline.webapp.TestTimelineWebServices.testGetEntitiesWithYarnACLsEnabled(TestTimelineWebServices.java:728)
Failed: YARN-2981 PreCommit Build #6822
Posted by Apache Jenkins Server <je...@builds.apache.org>.
Jira: https://issues.apache.org/jira/browse/YARN-2981
Build: https://builds.apache.org/job/PreCommit-YARN-Build/6822/
###################################################################################
########################## LAST 60 LINES OF THE CONSOLE ###########################
[...truncated 3464 lines...]
{color:red}-1 overall{color}. Here are the results of testing the latest attachment
http://issues.apache.org/jira/secure/attachment/12702254/YARN-2981.patch
against trunk revision e17e5ba.
{color:green}+1 @author{color}. The patch does not contain any @author tags.
{color:green}+1 tests included{color}. The patch appears to include 2 new or modified test files.
{color:green}+1 javac{color}. The applied patch does not increase the total number of javac compiler warnings.
{color:green}+1 javadoc{color}. There were no new javadoc warning messages.
{color:green}+1 eclipse:eclipse{color}. The patch built with eclipse:eclipse.
{color:green}+1 findbugs{color}. The patch does not introduce any new Findbugs (version 2.0.3) warnings.
{color:green}+1 release audit{color}. The applied patch does not increase the total number of release audit warnings.
{color:red}-1 core tests{color}. The patch failed these unit tests in hadoop-yarn-project/hadoop-yarn/hadoop-yarn-server/hadoop-yarn-server-nodemanager:
org.apache.hadoop.yarn.server.nodemanager.TestDockerContainerExecutorWithMocks
Test results: https://builds.apache.org/job/PreCommit-YARN-Build/6822//testReport/
Console output: https://builds.apache.org/job/PreCommit-YARN-Build/6822//console
This message is automatically generated.
======================================================================
======================================================================
Adding comment to Jira.
======================================================================
======================================================================
Comment added.
99435a3c6ed4a3e672223282d341f27b07b36fb9 logged out
======================================================================
======================================================================
Finished build.
======================================================================
======================================================================
Build step 'Execute shell' marked build as failure
Archiving artifacts
Sending artifact delta relative to PreCommit-YARN-Build #6776
Archived 15 artifacts
Archive block size is 32768
Received 179 blocks and 3092095 bytes
Compression is 65.5%
Took 2.3 sec
[description-setter] Could not determine description.
Recording test results
Email was triggered for: Failure
Sending email for trigger: Failure
###################################################################################
############################## FAILED TESTS (if any) ##############################
1 tests failed.
FAILED: org.apache.hadoop.yarn.server.nodemanager.TestDockerContainerExecutorWithMocks.testContainerLaunch
Error Message:
expected:<[/bin/true, run, --rm, --net=host, --name, CONTAINER_ID, --memory, 0m, --cpu-shares, 0, --user, nobody, -v, /tmp/nm-local-dir1425419244449:/tmp/nm-local-dir1425419244449, -v, /tmp/userlogs1425419244449:/tmp/userlogs1425419244449, -v, /tmp/temp-1425419244525:/tmp/temp-1425419244525, sequenceiq/hadoop-docker:2.4.1, bash, "/tmp/temp-1425419244525/launch_container.sh"]> but was:<[/bin/true, run, --rm, --net=host, --name, CONTAINER_ID, -v, /tmp/nm-local-dir1425419244449:/tmp/nm-local-dir1425419244449, -v, /tmp/userlogs1425419244449:/tmp/userlogs1425419244449, -v, /tmp/temp-1425419244525:/tmp/temp-1425419244525, sequenceiq/hadoop-docker:2.4.1, bash, "/tmp/temp-1425419244525/launch_container.sh"]>
Stack Trace:
java.lang.AssertionError: expected:<[/bin/true, run, --rm, --net=host, --name, CONTAINER_ID, --memory, 0m, --cpu-shares, 0, --user, nobody, -v, /tmp/nm-local-dir1425419244449:/tmp/nm-local-dir1425419244449, -v, /tmp/userlogs1425419244449:/tmp/userlogs1425419244449, -v, /tmp/temp-1425419244525:/tmp/temp-1425419244525, sequenceiq/hadoop-docker:2.4.1, bash, "/tmp/temp-1425419244525/launch_container.sh"]> but was:<[/bin/true, run, --rm, --net=host, --name, CONTAINER_ID, -v, /tmp/nm-local-dir1425419244449:/tmp/nm-local-dir1425419244449, -v, /tmp/userlogs1425419244449:/tmp/userlogs1425419244449, -v, /tmp/temp-1425419244525:/tmp/temp-1425419244525, sequenceiq/hadoop-docker:2.4.1, bash, "/tmp/temp-1425419244525/launch_container.sh"]>
at org.junit.Assert.fail(Assert.java:88)
at org.junit.Assert.failNotEquals(Assert.java:743)
at org.junit.Assert.assertEquals(Assert.java:118)
at org.junit.Assert.assertEquals(Assert.java:144)
at org.apache.hadoop.yarn.server.nodemanager.TestDockerContainerExecutorWithMocks.testContainerLaunch(TestDockerContainerExecutorWithMocks.java:241)