You are viewing a plain text version of this content. The canonical link for it is here.
Posted to builds@solr.apache.org by Apache Jenkins Server <je...@builds.apache.org> on 2024/02/05 09:32:34 UTC
[JENKINS] Solr » Solr-Check-9.x (Crave) - Build # 6250 - Still Failing!
Build: https://ci-builds.apache.org/job/Solr/job/Solr-Check-9.x%20(Crave)/6250/
No tests ran.
Build Log:
[...truncated 1431 lines...]
ERROR: Step ‘Publish JUnit test result report’ failed: No test report files were found. Configuration error?
Email was triggered for: Failure - Any
Sending email for trigger: Failure - Any
[JENKINS] Solr » Solr-Check-9.x (Crave) - Build # 6256 - Still Failing!
Posted by Apache Jenkins Server <je...@builds.apache.org>.
Build: https://ci-builds.apache.org/job/Solr/job/Solr-Check-9.x%20(Crave)/6256/
No tests ran.
Build Log:
[...truncated 1216 lines...]
ERROR: Step ‘Publish JUnit test result report’ failed: No test report files were found. Configuration error?
Email was triggered for: Failure - Any
Sending email for trigger: Failure - Any
[JENKINS] Solr » Solr-Check-9.x (Crave) - Build # 6255 - Still Failing!
Posted by Apache Jenkins Server <je...@builds.apache.org>.
Build: https://ci-builds.apache.org/job/Solr/job/Solr-Check-9.x%20(Crave)/6255/
No tests ran.
Build Log:
[...truncated 1441 lines...]
2> SimplePostTool: FATAL: Connection error (is Solr running at https://127.0.0.1:46663/solr/testBasicRun/update ?): javax.net.ssl.SSLHandshakeException: PKIX path building failed: sun.security.provider.certpath.SunCertPathBuilderException: unable to find valid certification path to requested target
2>
2> ERROR: System/Runtime.exit(2) or halt(2) calls are not allowed because they terminate the test runner's JVM.
2>
> java.lang.AssertionError: expected:<0> but was:<1>
> at __randomizedtesting.SeedInfo.seed([5ABE15268B743599:98C8E222802F9DDA]:0)
> at org.junit.Assert.fail(Assert.java:89)
> at org.junit.Assert.failNotEquals(Assert.java:835)
> at org.junit.Assert.assertEquals(Assert.java:647)
> at org.junit.Assert.assertEquals(Assert.java:633)
> at org.apache.solr.cli.PostToolTest.testBasicRun(PostToolTest.java:63)
> at java.base/jdk.internal.reflect.NativeMethodAccessorImpl.invoke0(Native Method)
> at java.base/jdk.internal.reflect.NativeMethodAccessorImpl.invoke(NativeMethodAccessorImpl.java:62)
> at java.base/jdk.internal.reflect.DelegatingMethodAccessorImpl.invoke(DelegatingMethodAccessorImpl.java:43)
> at java.base/java.lang.reflect.Method.invoke(Method.java:566)
> at com.carrotsearch.randomizedtesting.RandomizedRunner.invoke(RandomizedRunner.java:1758)
> at com.carrotsearch.randomizedtesting.RandomizedRunner$8.evaluate(RandomizedRunner.java:946)
> at com.carrotsearch.randomizedtesting.RandomizedRunner$9.evaluate(RandomizedRunner.java:982)
> at com.carrotsearch.randomizedtesting.RandomizedRunner$10.evaluate(RandomizedRunner.java:996)
> at com.carrotsearch.randomizedtesting.rules.SystemPropertiesRestoreRule$1.evaluate(SystemPropertiesRestoreRule.java:80)
> at org.junit.rules.RunRules.evaluate(RunRules.java:20)
> at org.apache.lucene.tests.util.TestRuleSetupTeardownChained$1.evaluate(TestRuleSetupTeardownChained.java:48)
> at org.apache.lucene.tests.util.AbstractBeforeAfterRule$1.evaluate(AbstractBeforeAfterRule.java:43)
> at org.apache.lucene.tests.util.TestRuleThreadAndTestName$1.evaluate(TestRuleThreadAndTestName.java:45)
> at org.apache.lucene.tests.util.TestRuleIgnoreAfterMaxFailures$1.evaluate(TestRuleIgnoreAfterMaxFailures.java:60)
> at org.apache.lucene.tests.util.TestRuleMarkFailure$1.evaluate(TestRuleMarkFailure.java:44)
> at org.junit.rules.RunRules.evaluate(RunRules.java:20)
> at com.carrotsearch.randomizedtesting.rules.StatementAdapter.evaluate(StatementAdapter.java:36)
> at com.carrotsearch.randomizedtesting.ThreadLeakControl$StatementRunner.run(ThreadLeakControl.java:390)
> at com.carrotsearch.randomizedtesting.ThreadLeakControl.forkTimeoutingTask(ThreadLeakControl.java:843)
> at com.carrotsearch.randomizedtesting.ThreadLeakControl$3.evaluate(ThreadLeakControl.java:490)
> at com.carrotsearch.randomizedtesting.RandomizedRunner.runSingleTest(RandomizedRunner.java:955)
> at com.carrotsearch.randomizedtesting.RandomizedRunner$5.evaluate(RandomizedRunner.java:840)
> at com.carrotsearch.randomizedtesting.RandomizedRunner$6.evaluate(RandomizedRunner.java:891)
> at com.carrotsearch.randomizedtesting.RandomizedRunner$7.evaluate(RandomizedRunner.java:902)
> at com.carrotsearch.randomizedtesting.rules.StatementAdapter.evaluate(StatementAdapter.java:36)
> at com.carrotsearch.randomizedtesting.rules.StatementAdapter.evaluate(StatementAdapter.java:36)
> at org.apache.lucene.tests.util.AbstractBeforeAfterRule$1.evaluate(AbstractBeforeAfterRule.java:43)
> at org.apache.lucene.tests.util.AbstractBeforeAfterRule$1.evaluate(AbstractBeforeAfterRule.java:43)
> at com.carrotsearch.randomizedtesting.rules.SystemPropertiesRestoreRule$1.evaluate(SystemPropertiesRestoreRule.java:80)
> at org.junit.rules.RunRules.evaluate(RunRules.java:20)
> at org.apache.lucene.tests.util.AbstractBeforeAfterRule$1.evaluate(AbstractBeforeAfterRule.java:43)
> at com.carrotsearch.randomizedtesting.rules.StatementAdapter.evaluate(StatementAdapter.java:36)
> at org.apache.lucene.tests.util.TestRuleStoreClassName$1.evaluate(TestRuleStoreClassName.java:38)
> at com.carrotsearch.randomizedtesting.rules.NoShadowingOrOverridesOnMethodsRule$1.evaluate(NoShadowingOrOverridesOnMethodsRule.java:40)
> at com.carrotsearch.randomizedtesting.rules.NoShadowingOrOverridesOnMethodsRule$1.evaluate(NoShadowingOrOverridesOnMethodsRule.java:40)
> at com.carrotsearch.randomizedtesting.rules.StatementAdapter.evaluate(StatementAdapter.java:36)
> at com.carrotsearch.randomizedtesting.rules.StatementAdapter.evaluate(StatementAdapter.java:36)
> at org.apache.lucene.tests.util.TestRuleAssertionsRequired$1.evaluate(TestRuleAssertionsRequired.java:53)
> at org.apache.lucene.tests.util.AbstractBeforeAfterRule$1.evaluate(AbstractBeforeAfterRule.java:43)
> at org.apache.lucene.tests.util.TestRuleMarkFailure$1.evaluate(TestRuleMarkFailure.java:44)
> at org.apache.lucene.tests.util.TestRuleIgnoreAfterMaxFailures$1.evaluate(TestRuleIgnoreAfterMaxFailures.java:60)
> at org.apache.lucene.tests.util.TestRuleIgnoreTestSuites$1.evaluate(TestRuleIgnoreTestSuites.java:47)
> at org.junit.rules.RunRules.evaluate(RunRules.java:20)
> at com.carrotsearch.randomizedtesting.rules.StatementAdapter.evaluate(StatementAdapter.java:36)
> at com.carrotsearch.randomizedtesting.ThreadLeakControl$StatementRunner.run(ThreadLeakControl.java:390)
> at com.carrotsearch.randomizedtesting.ThreadLeakControl.lambda$forkTimeoutingTask$0(ThreadLeakControl.java:850)
> at java.base/java.lang.Thread.run(Thread.java:829)
2> NOTE: reproduce with: gradlew test --tests PostToolTest.testBasicRun -Dtests.seed=5ABE15268B743599 -Dtests.locale=mfe -Dtests.timezone=Indian/Mauritius -Dtests.asserts=true -Dtests.file.encoding=UTF-8
2> 17147 INFO (jetty-closer-36-thread-1) [n: c: s: r: x: t:] o.e.j.s.Server Stopped Server@2b5db962{STOPPING}[10.0.19,sto=0]
2> 17155 INFO (jetty-closer-36-thread-1) [n: c: s: r: x: t:] o.e.j.s.AbstractConnector Stopped ServerConnector@65ea30cc{ssl, (ssl, alpn, http/1.1, h2)}{127.0.0.1:0}
2> 17161 INFO (jetty-closer-36-thread-1) [n: c: s: r: x: t:] o.e.j.s.h.ContextHandler Stopped o.e.j.s.ServletContextHandler@2b3f03c6{/solr,file:///tmp/src/solr/solr/core/build/tmp/tests-cwd/,STOPPED}
2> 17624 WARN (ZkTestServer Run Thread) [n: c: s: r: x: t:] o.a.s.c.ZkTestServer Watch limit violations:
2> Maximum concurrent create/delete watches above limit:
2>
2> 2 /solr/aliases.json
2>
2> Maximum concurrent data watches above limit:
2>
2> 2 /solr/clusterprops.json
2>
2> Maximum concurrent children watches above limit:
2>
2> 5 /solr/overseer/collection-queue-work
2> 4 /solr/live_nodes
2> 2 /solr/collections
2>
2> NOTE: leaving temporary files on disk at: /tmp/src/solr/solr/core/build/tmp/tests-tmp/solr.cli.PostToolTest_5ABE15268B743599-001
2> NOTE: test params are: codec=Asserting(Lucene99): {}, docValues:{}, maxPointsInLeafNode=652, maxMBSortInHeap=5.342148917803719, sim=Asserting(RandomSimilarity(queryNorm=true): {}), locale=mfe, timezone=Indian/Mauritius
2> NOTE: Linux 5.4.0-100-generic amd64/Eclipse Adoptium 11.0.22 (64-bit)/cpus=1,threads=2,free=260340136,total=324534272
2> NOTE: All tests run in this JVM: [PostToolTest]
WARNING: Test org.apache.solr.TestRandomFaceting wrote 11,331,648 bytes of output.
WARNING: Test org.apache.solr.schema.DocValuesTest wrote 11,196,654 bytes of output.
WARNING: Test org.apache.solr.schema.TestCloudSchemaless wrote 15,313,245 bytes of output.
:solr:core:test (FAILURE): 4965 test(s), 1 failure(s), 210 skipped
4965 tests completed, 1 failed, 210 skipped
> Task :solr:core:test FAILED
> Task :solr:core:wipeTaskTemp
> Task :solr:modules:hdfs:test
WARNING: Test org.apache.solr.hdfs.index.CheckHdfsIndexTest wrote 43,444,432 bytes of output.
:solr:modules:hdfs:test (SUCCESS): 104 test(s), 41 skipped
> Task :solr:modules:hdfs:wipeTaskTemp
ERROR: The following test(s) have failed:
- org.apache.solr.cli.PostToolTest.testBasicRun (:solr:core)
Test output: /tmp/src/solr/solr/core/build/test-results/test/outputs/OUTPUT-org.apache.solr.cli.PostToolTest.txt
Reproduce with: gradlew :solr:core:test --tests "org.apache.solr.cli.PostToolTest.testBasicRun" -Ptests.jvms=96 "-Ptests.jvmargs=-XX:TieredStopAtLevel=1 -XX:+UseParallelGC -XX:ActiveProcessorCount=1 -XX:ReservedCodeCacheSize=120m" -Ptests.seed=5ABE15268B743599 -Ptests.file.encoding=ISO-8859-1
WARNING: there were unreferenced files under license folder:
- /tmp/src/solr/solr/licenses/jakarta.inject-2.6.1.jar.sha1
FAILURE: Build failed with an exception.
* What went wrong:
Execution failed for task ':solr:core:test'.
> There were failing tests. See the results at: file:///tmp/src/solr/solr/core/build/test-results/test/
* Try:
> Run with --scan to get full insights.
BUILD FAILED in 9m 27s
670 actionable tasks: 668 executed, 2 up-to-date
[0m[?12l[?25h
------------------------------------------------------------------------
Build Failed: returned 1
Total time: 9m48.5s
------------------------------------------------------------------------
+ status=1
+ ./crave pull '**/build/**/test/TEST-*.xml'
+ ./crave pull '**/*.events'
+ ./crave pull 'heapdumps/**'
Error: rsync: [sender] change_dir "/tmp/src/solr/heapdumps" failed: No such file or directory (2)
rsync error: some files/attrs were not transferred (see previous errors) (code 23) at main.c(1675) [Receiver=3.1.2]
rsync: [Receiver] write error: Broken pipe (32)
+ ./crave pull '**/hs_err_pid*'
+ exit 1
Build step 'Execute shell' marked build as failure
Archiving artifacts
Recording test results
ERROR: Step ‘Publish JUnit test result report’ failed: No test report files were found. Configuration error?
Email was triggered for: Failure - Any
Sending email for trigger: Failure - Any
[JENKINS] Solr » Solr-Check-9.x (Crave) - Build # 6254 - Still Failing!
Posted by Apache Jenkins Server <je...@builds.apache.org>.
Build: https://ci-builds.apache.org/job/Solr/job/Solr-Check-9.x%20(Crave)/6254/
No tests ran.
Build Log:
[...truncated 1434 lines...]
ERROR: Step ‘Publish JUnit test result report’ failed: No test report files were found. Configuration error?
Email was triggered for: Failure - Any
Sending email for trigger: Failure - Any
[JENKINS] Solr » Solr-Check-9.x (Crave) - Build # 6253 - Still Failing!
Posted by Apache Jenkins Server <je...@builds.apache.org>.
Build: https://ci-builds.apache.org/job/Solr/job/Solr-Check-9.x%20(Crave)/6253/
No tests ran.
Build Log:
[...truncated 331 lines...]
BUILD FAILED in 1m 22s
177 actionable tasks: 175 executed, 2 up-to-date
[0m[?12l[?25h
------------------------------------------------------------------------
Build Failed: returned 1
Total time: 1m47.5s
------------------------------------------------------------------------
+ status=1
+ ./crave pull '**/build/**/test/TEST-*.xml'
+ ./crave pull '**/*.events'
+ ./crave pull 'heapdumps/**'
Error: rsync: [sender] change_dir "/tmp/src/solr/heapdumps" failed: No such file or directory (2)
rsync error: some files/attrs were not transferred (see previous errors) (code 23) at main.c(1675) [Receiver=3.1.2]
rsync: [Receiver] write error: Broken pipe (32)
+ ./crave pull '**/hs_err_pid*'
+ exit 1
Build step 'Execute shell' marked build as failure
Archiving artifacts
Recording test results
ERROR: Step ‘Publish JUnit test result report’ failed: No test report files were found. Configuration error?
Email was triggered for: Failure - Any
Sending email for trigger: Failure - Any
[JENKINS] Solr » Solr-Check-9.x (Crave) - Build # 6252 - Still Failing!
Posted by Apache Jenkins Server <je...@builds.apache.org>.
Build: https://ci-builds.apache.org/job/Solr/job/Solr-Check-9.x%20(Crave)/6252/
No tests ran.
Build Log:
[...truncated 1432 lines...]
ERROR: Step ‘Publish JUnit test result report’ failed: No test report files were found. Configuration error?
Email was triggered for: Failure - Any
Sending email for trigger: Failure - Any
[JENKINS] Solr » Solr-Check-9.x (Crave) - Build # 6251 - Still Failing!
Posted by Apache Jenkins Server <je...@builds.apache.org>.
Build: https://ci-builds.apache.org/job/Solr/job/Solr-Check-9.x%20(Crave)/6251/
No tests ran.
Build Log:
[...truncated 1431 lines...]
ERROR: Step ‘Publish JUnit test result report’ failed: No test report files were found. Configuration error?
Email was triggered for: Failure - Any
Sending email for trigger: Failure - Any