You are viewing a plain text version of this content. The canonical link for it is here.
Posted to dev@lucene.apache.org by Apache Jenkins Server <je...@builds.apache.org> on 2016/05/05 06:21:23 UTC
[JENKINS] Lucene-Solr-SmokeRelease-master - Build # 483 - Still
Failing
Build: https://builds.apache.org/job/Lucene-Solr-SmokeRelease-master/483/
No tests ran.
Build Log:
[...truncated 40519 lines...]
prepare-release-no-sign:
[mkdir] Created dir: /x1/jenkins/jenkins-slave/workspace/Lucene-Solr-SmokeRelease-master/lucene/build/smokeTestRelease/dist
[copy] Copying 476 files to /x1/jenkins/jenkins-slave/workspace/Lucene-Solr-SmokeRelease-master/lucene/build/smokeTestRelease/dist/lucene
[copy] Copying 245 files to /x1/jenkins/jenkins-slave/workspace/Lucene-Solr-SmokeRelease-master/lucene/build/smokeTestRelease/dist/solr
[smoker] Java 1.8 JAVA_HOME=/home/jenkins/jenkins-slave/tools/hudson.model.JDK/latest1.8
[smoker] NOTE: output encoding is UTF-8
[smoker]
[smoker] Load release URL "file:/x1/jenkins/jenkins-slave/workspace/Lucene-Solr-SmokeRelease-master/lucene/build/smokeTestRelease/dist/"...
[smoker]
[smoker] Test Lucene...
[smoker] test basics...
[smoker] get KEYS
[smoker] 0.2 MB in 0.01 sec (14.7 MB/sec)
[smoker] check changes HTML...
[smoker] download lucene-7.0.0-src.tgz...
[smoker] 28.6 MB in 0.03 sec (1087.2 MB/sec)
[smoker] verify md5/sha1 digests
[smoker] download lucene-7.0.0.tgz...
[smoker] 63.0 MB in 0.06 sec (1084.0 MB/sec)
[smoker] verify md5/sha1 digests
[smoker] download lucene-7.0.0.zip...
[smoker] 73.5 MB in 0.07 sec (1027.8 MB/sec)
[smoker] verify md5/sha1 digests
[smoker] unpack lucene-7.0.0.tgz...
[smoker] verify JAR metadata/identity/no javax.* or java.* classes...
[smoker] test demo with 1.8...
[smoker] got 6003 hits for query "lucene"
[smoker] checkindex with 1.8...
[smoker] check Lucene's javadoc JAR
[smoker] unpack lucene-7.0.0.zip...
[smoker] verify JAR metadata/identity/no javax.* or java.* classes...
[smoker] test demo with 1.8...
[smoker] got 6003 hits for query "lucene"
[smoker] checkindex with 1.8...
[smoker] check Lucene's javadoc JAR
[smoker] unpack lucene-7.0.0-src.tgz...
[smoker] make sure no JARs/WARs in src dist...
[smoker] run "ant validate"
[smoker] run tests w/ Java 8 and testArgs='-Dtests.slow=false'...
[smoker] test demo with 1.8...
[smoker] got 218 hits for query "lucene"
[smoker] checkindex with 1.8...
[smoker] generate javadocs w/ Java 8...
[smoker]
[smoker] Crawl/parse...
[smoker]
[smoker] Verify...
[smoker] confirm all releases have coverage in TestBackwardsCompatibility
[smoker] find all past Lucene releases...
[smoker] run TestBackwardsCompatibility..
[smoker] success!
[smoker]
[smoker] Test Solr...
[smoker] test basics...
[smoker] get KEYS
[smoker] 0.2 MB in 0.00 sec (192.8 MB/sec)
[smoker] check changes HTML...
[smoker] download solr-7.0.0-src.tgz...
[smoker] 37.7 MB in 0.03 sec (1089.1 MB/sec)
[smoker] verify md5/sha1 digests
[smoker] download solr-7.0.0.tgz...
[smoker] 132.1 MB in 0.13 sec (1037.9 MB/sec)
[smoker] verify md5/sha1 digests
[smoker] download solr-7.0.0.zip...
[smoker] 140.7 MB in 0.13 sec (1064.8 MB/sec)
[smoker] verify md5/sha1 digests
[smoker] unpack solr-7.0.0.tgz...
[smoker] verify JAR metadata/identity/no javax.* or java.* classes...
[smoker] unpack lucene-7.0.0.tgz...
[smoker] **WARNING**: skipping check of /x1/jenkins/jenkins-slave/workspace/Lucene-Solr-SmokeRelease-master/lucene/build/smokeTestRelease/tmp/unpack/solr-7.0.0/contrib/dataimporthandler-extras/lib/javax.mail-1.5.1.jar: it has javax.* classes
[smoker] **WARNING**: skipping check of /x1/jenkins/jenkins-slave/workspace/Lucene-Solr-SmokeRelease-master/lucene/build/smokeTestRelease/tmp/unpack/solr-7.0.0/contrib/dataimporthandler-extras/lib/activation-1.1.1.jar: it has javax.* classes
[smoker] copying unpacked distribution for Java 8 ...
[smoker] test solr example w/ Java 8...
[smoker] start Solr instance (log=/x1/jenkins/jenkins-slave/workspace/Lucene-Solr-SmokeRelease-master/lucene/build/smokeTestRelease/tmp/unpack/solr-7.0.0-java8/solr-example.log)...
[smoker] No process found for Solr node running on port 8983
[smoker] Running techproducts example on port 8983 from /x1/jenkins/jenkins-slave/workspace/Lucene-Solr-SmokeRelease-master/lucene/build/smokeTestRelease/tmp/unpack/solr-7.0.0-java8
[smoker] Creating Solr home directory /x1/jenkins/jenkins-slave/workspace/Lucene-Solr-SmokeRelease-master/lucene/build/smokeTestRelease/tmp/unpack/solr-7.0.0-java8/example/techproducts/solr
[smoker]
[smoker] Starting up Solr on port 8983 using command:
[smoker] bin/solr start -p 8983 -s "example/techproducts/solr"
[smoker]
[smoker] Waiting up to 30 seconds to see Solr running on port 8983 [|] [/] [-] [\] [|] [/] [-] [\] [|] [/] [-]
[smoker] Started Solr server on port 8983 (pid=24089). Happy searching!
[smoker]
[smoker]
[smoker] Copying configuration to new core instance directory:
[smoker] /x1/jenkins/jenkins-slave/workspace/Lucene-Solr-SmokeRelease-master/lucene/build/smokeTestRelease/tmp/unpack/solr-7.0.0-java8/example/techproducts/solr/techproducts
[smoker]
[smoker] Creating new core 'techproducts' using command:
[smoker] http://localhost:8983/solr/admin/cores?action=CREATE&name=techproducts&instanceDir=techproducts
[smoker]
[smoker] {
[smoker] "responseHeader":{
[smoker] "status":0,
[smoker] "QTime":1240},
[smoker] "core":"techproducts"}
[smoker]
[smoker]
[smoker] Indexing tech product example docs from /x1/jenkins/jenkins-slave/workspace/Lucene-Solr-SmokeRelease-master/lucene/build/smokeTestRelease/tmp/unpack/solr-7.0.0-java8/example/exampledocs
[smoker] SimplePostTool version 5.0.0
[smoker] Posting files to [base] url http://localhost:8983/solr/techproducts/update using content-type application/xml...
[smoker] POSTing file money.xml to [base]
[smoker] POSTing file mem.xml to [base]
[smoker] POSTing file vidcard.xml to [base]
[smoker] POSTing file ipod_video.xml to [base]
[smoker] POSTing file sd500.xml to [base]
[smoker] POSTing file gb18030-example.xml to [base]
[smoker] POSTing file mp500.xml to [base]
[smoker] POSTing file monitor2.xml to [base]
[smoker] POSTing file utf8-example.xml to [base]
[smoker] POSTing file manufacturers.xml to [base]
[smoker] POSTing file hd.xml to [base]
[smoker] POSTing file solr.xml to [base]
[smoker] POSTing file monitor.xml to [base]
[smoker] POSTing file ipod_other.xml to [base]
[smoker] 14 files indexed.
[smoker] COMMITting Solr index changes to http://localhost:8983/solr/techproducts/update...
[smoker] Time spent: 0:00:00.453
[smoker]
[smoker] Solr techproducts example launched successfully. Direct your Web browser to http://localhost:8983/solr to visit the Solr Admin UI
[smoker] test utf8...
[smoker] run query...
[smoker] stop server using: bin/solr stop -p 8983
[smoker] Sending stop command to Solr running on port 8983 ... waiting 5 seconds to allow Jetty process 24089 to stop gracefully.
[smoker] [|] [/] [-] [\] [|] [/] [-] [\] [|] [/] unpack solr-7.0.0.zip...
[smoker] verify JAR metadata/identity/no javax.* or java.* classes...
[smoker] unpack lucene-7.0.0.tgz...
[smoker] **WARNING**: skipping check of /x1/jenkins/jenkins-slave/workspace/Lucene-Solr-SmokeRelease-master/lucene/build/smokeTestRelease/tmp/unpack/solr-7.0.0/contrib/dataimporthandler-extras/lib/javax.mail-1.5.1.jar: it has javax.* classes
[smoker] **WARNING**: skipping check of /x1/jenkins/jenkins-slave/workspace/Lucene-Solr-SmokeRelease-master/lucene/build/smokeTestRelease/tmp/unpack/solr-7.0.0/contrib/dataimporthandler-extras/lib/activation-1.1.1.jar: it has javax.* classes
[smoker] copying unpacked distribution for Java 8 ...
[smoker] test solr example w/ Java 8...
[smoker] start Solr instance (log=/x1/jenkins/jenkins-slave/workspace/Lucene-Solr-SmokeRelease-master/lucene/build/smokeTestRelease/tmp/unpack/solr-7.0.0-java8/solr-example.log)...
[smoker] No process found for Solr node running on port 8983
[smoker] Running techproducts example on port 8983 from /x1/jenkins/jenkins-slave/workspace/Lucene-Solr-SmokeRelease-master/lucene/build/smokeTestRelease/tmp/unpack/solr-7.0.0-java8
[smoker] Creating Solr home directory /x1/jenkins/jenkins-slave/workspace/Lucene-Solr-SmokeRelease-master/lucene/build/smokeTestRelease/tmp/unpack/solr-7.0.0-java8/example/techproducts/solr
[smoker]
[smoker] Starting up Solr on port 8983 using command:
[smoker] bin/solr start -p 8983 -s "example/techproducts/solr"
[smoker]
[smoker] Waiting up to 30 seconds to see Solr running on port 8983 [|] [/] [-] [\] [|] [/] [-] [\] [|] [/] [-]
[smoker] Started Solr server on port 8983 (pid=24886). Happy searching!
[smoker]
[smoker]
[smoker] Copying configuration to new core instance directory:
[smoker] /x1/jenkins/jenkins-slave/workspace/Lucene-Solr-SmokeRelease-master/lucene/build/smokeTestRelease/tmp/unpack/solr-7.0.0-java8/example/techproducts/solr/techproducts
[smoker]
[smoker] Creating new core 'techproducts' using command:
[smoker] http://localhost:8983/solr/admin/cores?action=CREATE&name=techproducts&instanceDir=techproducts
[smoker]
[smoker] {
[smoker] "responseHeader":{
[smoker] "status":0,
[smoker] "QTime":1159},
[smoker] "core":"techproducts"}
[smoker]
[smoker]
[smoker] Indexing tech product example docs from /x1/jenkins/jenkins-slave/workspace/Lucene-Solr-SmokeRelease-master/lucene/build/smokeTestRelease/tmp/unpack/solr-7.0.0-java8/example/exampledocs
[smoker] SimplePostTool version 5.0.0
[smoker] Posting files to [base] url http://localhost:8983/solr/techproducts/update using content-type application/xml...
[smoker] POSTing file money.xml to [base]
[smoker] POSTing file mem.xml to [base]
[smoker] POSTing file vidcard.xml to [base]
[smoker] POSTing file ipod_video.xml to [base]
[smoker] POSTing file sd500.xml to [base]
[smoker] POSTing file gb18030-example.xml to [base]
[smoker] POSTing file mp500.xml to [base]
[smoker] POSTing file monitor2.xml to [base]
[smoker] POSTing file utf8-example.xml to [base]
[smoker] POSTing file manufacturers.xml to [base]
[smoker] POSTing file hd.xml to [base]
[smoker] POSTing file solr.xml to [base]
[smoker] POSTing file monitor.xml to [base]
[smoker] POSTing file ipod_other.xml to [base]
[smoker] 14 files indexed.
[smoker] COMMITting Solr index changes to http://localhost:8983/solr/techproducts/update...
[smoker] Time spent: 0:00:00.378
[smoker]
[smoker] Solr techproducts example launched successfully. Direct your Web browser to http://localhost:8983/solr to visit the Solr Admin UI
[smoker] test utf8...
[smoker] run query...
[smoker] stop server using: bin/solr stop -p 8983
[smoker] Sending stop command to Solr running on port 8983 ... waiting 5 seconds to allow Jetty process 24886 to stop gracefully.
[smoker] [|] [/] [-] [\] [|] [/] [-] [\] [|] [/] unpack solr-7.0.0-src.tgz...
[smoker] make sure no JARs/WARs in src dist...
[smoker] run "ant validate"
[smoker] run tests w/ Java 8 and testArgs='-Dtests.slow=false'...
[smoker]
[smoker] command "export JAVA_HOME="/home/jenkins/jenkins-slave/tools/hudson.model.JDK/latest1.8" PATH="/home/jenkins/jenkins-slave/tools/hudson.model.JDK/latest1.8/bin:$PATH" JAVACMD="/home/jenkins/jenkins-slave/tools/hudson.model.JDK/latest1.8/bin/java"; ant clean test -Dtests.slow=false -Dtests.slow=false" failed:
[smoker] Buildfile: /x1/jenkins/jenkins-slave/workspace/Lucene-Solr-SmokeRelease-master/lucene/build/smokeTestRelease/tmp/unpack/solr-7.0.0/solr/build.xml
[smoker]
[smoker] clean:
[smoker] [delete] Deleting directory /x1/jenkins/jenkins-slave/workspace/Lucene-Solr-SmokeRelease-master/lucene/build/smokeTestRelease/tmp/unpack/solr-7.0.0/solr/build
[smoker]
[smoker] ivy-availability-check:
[smoker]
[smoker] ivy-fail:
[smoker]
[smoker] ivy-configure:
[smoker] [ivy:configure] :: Apache Ivy 2.3.0 - 20130110142753 :: http://ant.apache.org/ivy/ ::
[smoker] [ivy:configure] :: loading settings :: file = /x1/jenkins/jenkins-slave/workspace/Lucene-Solr-SmokeRelease-master/lucene/build/smokeTestRelease/tmp/unpack/solr-7.0.0/lucene/ivy-settings.xml
[smoker]
[smoker] resolve-groovy:
[smoker] [ivy:cachepath] :: resolving dependencies :: org.codehaus.groovy#groovy-all-caller;working
[smoker] [ivy:cachepath] confs: [default]
[smoker] [ivy:cachepath] found org.codehaus.groovy#groovy-all;2.4.6 in public
[smoker] [ivy:cachepath] :: resolution report :: resolve 152ms :: artifacts dl 2ms
[smoker] ---------------------------------------------------------------------
[smoker] | | modules || artifacts |
[smoker] | conf | number| search|dwnlded|evicted|| number|dwnlded|
[smoker] ---------------------------------------------------------------------
[smoker] | default | 1 | 0 | 0 | 0 || 1 | 0 |
[smoker] ---------------------------------------------------------------------
[smoker]
[smoker] -init-totals:
[smoker] [mkdir] Created dir: /x1/jenkins/jenkins-slave/workspace/Lucene-Solr-SmokeRelease-master/lucene/build/smokeTestRelease/tmp/unpack/solr-7.0.0/solr/build/solr
[smoker]
[smoker] -clover.load:
[smoker]
[smoker] test-solr-core:
[smoker]
[smoker] test:
[smoker]
[smoker] -clover.disable:
[smoker]
[smoker] ivy-availability-check:
[smoker]
[smoker] ivy-fail:
[smoker]
[smoker] ivy-configure:
[smoker] [ivy:configure] :: loading settings :: file = /x1/jenkins/jenkins-slave/workspace/Lucene-Solr-SmokeRelease-master/lucene/build/smokeTestRelease/tmp/unpack/solr-7.0.0/lucene/ivy-settings.xml
[smoker]
[smoker] -clover.load:
[smoker]
[smoker] -clover.classpath:
[smoker]
[smoker] -clover.setup:
[smoker]
[smoker] clover:
[smoker]
[smoker] check-analyzers-icu-uptodate:
[smoker]
[smoker] jar-analyzers-icu:
[smoker]
[smoker] -compile-test-lucene-queryparser:
[smoker]
[smoker] -check-git-state:
[smoker]
[smoker] -git-cleanroot:
[smoker]
[smoker] -copy-git-state:
[smoker]
[smoker] git-autoclean:
[smoker]
[smoker] ivy-availability-check:
[smoker]
[smoker] ivy-fail:
[smoker]
[smoker] ivy-configure:
[smoker] [ivy:configure] :: loading settings :: file = /x1/jenkins/jenkins-slave/workspace/Lucene-Solr-SmokeRelease-master/lucene/build/smokeTestRelease/tmp/unpack/solr-7.0.0/lucene/ivy-settings.xml
[smoker]
[smoker] resolve:
[smoker]
[smoker] common.init:
[smoker]
[smoker] compile-lucene-core:
[smoker]
[smoker] -check-git-state:
[smoker]
[smoker] -git-cleanroot:
[smoker]
[smoker] -copy-git-state:
[smoker]
[smoker] git-autoclean:
[smoker]
[smoker] ivy-availability-check:
[smoker]
[smoker] ivy-fail:
[smoker]
[smoker] ivy-configure:
[smoker] [ivy:configure] :: loading settings :: file = /x1/jenkins/jenkins-slave/workspace/Lucene-Solr-SmokeRelease-master/lucene/build/smokeTestRelease/tmp/unpack/solr-7.0.0/lucene/ivy-settings.xml
[smoker]
[smoker] resolve:
[smoker]
[smoker] init:
[smoker]
[smoker] -clover.disable:
[smoker]
[smoker] -clover.load:
[smoker]
[smoker] -clover.classpath:
[smoker]
[smoker] -clover.setup:
[smoker]
[smoker] clover:
[smoker]
[smoker] compile-core:
[smoker]
[smoker] init:
[smoker]
[smoker] compile-test:
[smoker]
[smoker] check-queries-uptodate:
[smoker]
[smoker] jar-queries:
[smoker]
[smoker] check-sandbox-uptodate:
[smoker]
[smoker] jar-sandbox:
[smoker]
[smoker] -check-git-state:
[smoker]
[smoker] -git-cleanroot:
[smoker]
[smoker] -copy-git-state:
[smoker]
[smoker] git-autoclean:
[smoker]
[smoker] ivy-availability-check:
[smoker]
[smoker] ivy-configure:
[smoker] [ivy:configure] :: loading settings :: file = /x1/jenkins/jenkins-slave/workspace/Lucene-Solr-SmokeRelease-master/lucene/build/smokeTestRelease/tmp/unpack/solr-7.0.0/lucene/ivy-settings.xml
[smoker]
[smoker] resolve:
[smoker]
[smoker] common.init:
[smoker]
[smoker] compile-lucene-core:
[smoker]
[smoker] init:
[smoker]
[smoker] -clover.disable:
[smoker]
[smoker] -clover.load:
[smoker]
[smoker] -clover.classpath:
[smoker]
[smoker] -clover.setup:
[smoker]
[smoker] clover:
[smoker]
[smoker] common.compile-core:
[smoker]
[smoker] compile-core:
[smoker]
[smoker] compile-test-framework:
[smoker]
[smoker] -check-git-state:
[smoker]
[smoker] -git-cleanroot:
[smoker]
[smoker] -copy-git-state:
[smoker]
[smoker] git-autoclean:
[smoker]
[smoker] ivy-availability-check:
[smoker]
[smoker] ivy-fail:
[smoker]
[smoker] ivy-configure:
[smoker] [ivy:configure] :: loading settings :: file = /x1/jenkins/jenkins-slave/workspace/Lucene-Solr-SmokeRelease-master/lucene/build/smokeTestRelease/tmp/unpack/solr-7.0.0/lucene/ivy-settings.xml
[smoker]
[smoker] resolve:
[smoker]
[smoker] init:
[smoker]
[smoker] compile-lucene-core:
[smoker]
[smoker] compile-codecs:
[smoker]
[smoker] -check-git-state:
[smoker]
[smoker] -git-cleanroot:
[smoker]
[smoker] -copy-git-state:
[smoker]
[smoker] git-autoclean:
[smoker]
[smoker] ivy-availability-check:
[smoker]
[smoker] ivy-fail:
[smoker]
[smoker] ivy-configure:
[smoker] [ivy:configure] :: loading settings :: file = /x1/jenkins/jenkins-slave/workspace/Lucene-Solr-SmokeRelease-master/lucene/build/smokeTestRelease/tmp/unpack/solr-7.0.0/lucene/ivy-settings.xml
[smoker]
[smoker] resolve:
[smoker]
[smoker] common.init:
[smoker]
[smoker] compile-lucene-core:
[smoker]
[smoker] init:
[smoker]
[smoker] -clover.disable:
[smoker]
[smoker] -clover.load:
[smoker]
[smoker] -clover.classpath:
[smoker]
[smoker] -clover.setup:
[smoker]
[smoker] clover:
[smoker]
[smoker] compile-core:
[smoker]
[smoker] -clover.disable:
[smoker]
[smoker] -clover.load:
[smoker]
[smoker] -clover.classpath:
[smoker]
[smoker] -clover.setup:
[smoker]
[smoker] clover:
[smoker]
[smoker] common.compile-core:
[smoker]
[smoker] compile-core:
[smoker]
[smoker] common.compile-test:
[smoker]
[smoker] -compile-analysis-extras:
[smoker]
[smoker] check-analyzers-icu-uptodate:
[smoker]
[smoker] jar-analyzers-icu:
[smoker]
[smoker] compile-solr-core:
[smoker]
[smoker] compile-solrj:
[smoker]
[smoker] check-lucene-core-uptodate:
[smoker]
[smoker] jar-lucene-core:
[smoker]
[smoker] check-backward-codecs-uptodate:
[smoker]
[smoker] jar-backward-codecs:
[smoker]
[smoker] check-analyzers-phonetic-uptodate:
[smoker]
[smoker] jar-analyzers-phonetic:
[smoker]
[smoker] check-analyzers-kuromoji-uptodate:
[smoker]
[smoker] jar-analyzers-kuromoji:
[smoker]
[smoker] check-codecs-uptodate:
[smoker]
[smoker] jar-codecs:
[smoker]
[smoker] check-expressions-uptodate:
[smoker]
[smoker] jar-expressions:
[smoker]
[smoker] check-suggest-uptodate:
[smoker]
[smoker] jar-suggest:
[smoker]
[smoker] check-highlighter-uptodate:
[smoker]
[smoker] jar-highlighter:
[smoker]
[smoker] check-memory-uptodate:
[smoker]
[smoker] jar-memory:
[smoker]
[smoker] check-misc-uptodate:
[smoker]
[smoker] jar-misc:
[smoker]
[smoker] check-spatial-extras-uptodate:
[smoker]
[smoker] jar-spatial-extras:
[smoker]
[smoker] check-grouping-uptodate:
[smoker]
[smoker] jar-grouping:
[smoker]
[smoker] check-queries-uptodate:
[smoker]
[smoker] jar-queries:
[smoker]
[smoker] check-queryparser-uptodate:
[smoker]
[smoker] jar-queryparser:
[smoker]
[smoker] check-join-uptodate:
[smoker]
[smoker] jar-join:
[smoker]
[smoker] check-sandbox-uptodate:
[smoker]
[smoker] jar-sandbox:
[smoker]
[smoker] check-classification-uptodate:
[smoker]
[smoker] jar-classification:
[smoker]
[smoker] prep-lucene-jars:
[smoker]
[smoker] resolve-example:
[smoker]
[smoker] ivy-availability-check:
[smoker]
[smoker] ivy-fail:
[smoker]
[smoker] ivy-configure:
[smoker] [ivy:configure] :: loading settings :: file = /x1/jenkins/jenkins-slave/workspace/Lucene-Solr-SmokeRelease-master/lucene/build/smokeTestRelease/tmp/unpack/solr-7.0.0/lucene/ivy-settings.xml
[smoker]
[smoker] resolve:
[smoker]
[smoker] resolve-server:
[smoker]
[smoker] ivy-availability-check:
[smoker]
[smoker] ivy-fail:
[smoker]
[smoker] ivy-fail:
[smoker]
[smoker] ivy-configure:
[smoker] [ivy:configure] :: loading settings :: file = /x1/jenkins/jenkins-slave/workspace/Lucene-Solr-SmokeRelease-master/lucene/build/smokeTestRelease/tmp/unpack/solr-7.0.0/lucene/ivy-settings.xml
[smoker]
[smoker] resolve:
[smoker]
[smoker] -check-git-state:
[smoker]
[smoker] -git-cleanroot:
[smoker]
[smoker] -copy-git-state:
[smoker]
[smoker] git-autoclean:
[smoker]
[smoker] ivy-availability-check:
[smoker]
[smoker] ivy-fail:
[smoker]
[smoker] ivy-fail:
[smoker]
[smoker] ivy-configure:
[smoker] [ivy:configure] :: loading settings :: file = /x1/jenkins/jenkins-slave/workspace/Lucene-Solr-SmokeRelease-master/lucene/build/smokeTestRelease/tmp/unpack/solr-7.0.0/lucene/ivy-settings.xml
[smoker]
[smoker] resolve:
[smoker]
[smoker] common.init:
[smoker]
[smoker] compile-lucene-core:
[smoker]
[smoker] -check-git-state:
[smoker]
[smoker] -git-cleanroot:
[smoker]
[smoker] -copy-git-state:
[smoker]
[smoker] git-autoclean:
[smoker]
[smoker] ivy-availability-check:
[smoker]
[smoker] ivy-fail:
[smoker]
[smoker] ivy-configure:
[smoker] [ivy:configure] :: loading settings :: file = /x1/jenkins/jenkins-slave/workspace/Lucene-Solr-SmokeRelease-master/lucene/build/smokeTestRelease/tmp/unpack/solr-7.0.0/lucene/ivy-settings.xml
[smoker]
[smoker] resolve:
[smoker]
[smoker] init:
[smoker]
[smoker] -clover.disable:
[smoker]
[smoker] -clover.load:
[smoker]
[smoker] -clover.classpath:
[smoker]
[smoker] -clover.setup:
[smoker]
[smoker] clover:
[smoker]
[smoker] compile-core:
[smoker]
[smoker] init:
[smoker]
[smoker] -clover.disable:
[smoker]
[smoker] -clover.load:
[smoker]
[smoker] -clover.classpath:
[smoker]
[smoker] -clover.setup:
[smoker]
[smoker] clover:
[smoker]
[smoker] common.compile-core:
[smoker] [mkdir] Created dir: /x1/jenkins/jenkins-slave/workspace/Lucene-Solr-SmokeRelease-master/lucene/build/smokeTestRelease/tmp/unpack/solr-7.0.0/solr/build/solr-solrj/classes/java
[smoker] [javac] Compiling 280 source files to /x1/jenkins/jenkins-slave/workspace/Lucene-Solr-SmokeRelease-master/lucene/build/smokeTestRelease/tmp/unpack/solr-7.0.0/solr/build/solr-solrj/classes/java
[smoker] [javac] Note: Some input files use or override a deprecated API.
[smoker] [javac] Note: Recompile with -Xlint:deprecation for details.
[smoker] [javac] Note: Some input files use unchecked or unsafe operations.
[smoker] [javac] Note: Recompile with -Xlint:unchecked for details.
[smoker] [javac] Creating empty /x1/jenkins/jenkins-slave/workspace/Lucene-Solr-SmokeRelease-master/lucene/build/smokeTestRelease/tmp/unpack/solr-7.0.0/solr/build/solr-solrj/classes/java/org/apache/solr/client/solrj/request/schema/package-info.class
[smoker] [javac] Creating empty /x1/jenkins/jenkins-slave/workspace/Lucene-Solr-SmokeRelease-master/lucene/build/smokeTestRelease/tmp/unpack/solr-7.0.0/solr/build/solr-solrj/classes/java/org/apache/solr/client/solrj/response/schema/package-info.class
[smoker] [javac] Creating empty /x1/jenkins/jenkins-slave/workspace/Lucene-Solr-SmokeRelease-master/lucene/build/smokeTestRelease/tmp/unpack/solr-7.0.0/solr/build/solr-solrj/classes/java/org/apache/solr/client/solrj/beans/package-info.class
[smoker] [javac] Creating empty /x1/jenkins/jenkins-slave/workspace/Lucene-Solr-SmokeRelease-master/lucene/build/smokeTestRelease/tmp/unpack/solr-7.0.0/solr/build/solr-solrj/classes/java/org/apache/solr/client/solrj/io/stream/expr/package-info.class
[smoker] [javac] Creating empty /x1/jenkins/jenkins-slave/workspace/Lucene-Solr-SmokeRelease-master/lucene/build/smokeTestRelease/tmp/unpack/solr-7.0.0/solr/build/solr-solrj/classes/java/org/apache/solr/client/solrj/response/package-info.class
[smoker] [javac] Creating empty /x1/jenkins/jenkins-slave/workspace/Lucene-Solr-SmokeRelease-master/lucene/build/smokeTestRelease/tmp/unpack/solr-7.0.0/solr/build/solr-solrj/classes/java/org/apache/solr/common/util/package-info.class
[smoker] [javac] Creating empty /x1/jenkins/jenkins-slave/workspace/Lucene-Solr-SmokeRelease-master/lucene/build/smokeTestRelease/tmp/unpack/solr-7.0.0/solr/build/solr-solrj/classes/java/org/apache/solr/client/solrj/request/package-info.class
[smoker] [javac] Creating empty /x1/jenkins/jenkins-slave/workspace/Lucene-Solr-SmokeRelease-master/lucene/build/smokeTestRelease/tmp/unpack/solr-7.0.0/solr/build/solr-solrj/classes/java/org/apache/solr/client/solrj/package-info.class
[smoker] [javac] Creating empty /x1/jenkins/jenkins-slave/workspace/Lucene-Solr-SmokeRelease-master/lucene/build/smokeTestRelease/tmp/unpack/solr-7.0.0/solr/build/solr-solrj/classes/java/org/apache/solr/common/cloud/package-info.class
[smoker] [javac] Creating empty /x1/jenkins/jenkins-slave/workspace/Lucene-Solr-SmokeRelease-master/lucene/build/smokeTestRelease/tmp/unpack/solr-7.0.0/solr/build/solr-solrj/classes/java/org/apache/solr/common/params/package-info.class
[smoker] [javac] Creating empty /x1/jenkins/jenkins-slave/workspace/Lucene-Solr-SmokeRelease-master/lucene/build/smokeTestRelease/tmp/unpack/solr-7.0.0/solr/build/solr-solrj/classes/java/org/apache/solr/client/solrj/impl/package-info.class
[smoker] [javac] Creating empty /x1/jenkins/jenkins-slave/workspace/Lucene-Solr-SmokeRelease-master/lucene/build/smokeTestRelease/tmp/unpack/solr-7.0.0/solr/build/solr-solrj/classes/java/org/apache/solr/client/solrj/io/eq/package-info.class
[smoker] [javac] Creating empty /x1/jenkins/jenkins-slave/workspace/Lucene-Solr-SmokeRelease-master/lucene/build/smokeTestRelease/tmp/unpack/solr-7.0.0/solr/build/solr-solrj/classes/java/org/apache/solr/client/solrj/io/stream/metrics/package-info.class
[smoker] [javac] Creating empty /x1/jenkins/jenkins-slave/workspace/Lucene-Solr-SmokeRelease-master/lucene/build/smokeTestRelease/tmp/unpack/solr-7.0.0/solr/build/solr-solrj/classes/java/org/apache/solr/client/solrj/io/sql/package-info.class
[smoker] [javac] Creating empty /x1/jenkins/jenkins-slave/workspace/Lucene-Solr-SmokeRelease-master/lucene/build/smokeTestRelease/tmp/unpack/solr-7.0.0/solr/build/solr-solrj/classes/java/org/apache/solr/common/luke/package-info.class
[smoker] [javac] Creating empty /x1/jenkins/jenkins-slave/workspace/Lucene-Solr-SmokeRelease-master/lucene/build/smokeTestRelease/tmp/unpack/solr-7.0.0/solr/build/solr-solrj/classes/java/org/apache/solr/client/solrj/io/graph/package-info.class
[smoker] [javac] Creating empty /x1/jenkins/jenkins-slave/workspace/Lucene-Solr-SmokeRelease-master/lucene/build/smokeTestRelease/tmp/unpack/solr-7.0.0/solr/build/solr-solrj/classes/java/org/apache/solr/client/solrj/io/package-info.class
[smoker] [javac] Creating empty /x1/jenkins/jenkins-slave/workspace/Lucene-Solr-SmokeRelease-master/lucene/build/smokeTestRelease/tmp/unpack/solr-7.0.0/solr/build/solr-solrj/classes/java/org/apache/solr/client/solrj/io/stream/package-info.class
[smoker] [javac] Creating empty /x1/jenkins/jenkins-slave/workspace/Lucene-Solr-SmokeRelease-master/lucene/build/smokeTestRelease/tmp/unpack/solr-7.0.0/solr/build/solr-solrj/classes/java/org/apache/solr/client/solrj/io/ops/package-info.class
[smoker] [javac] Creating empty /x1/jenkins/jenkins-slave/workspace/Lucene-Solr-SmokeRelease-master/lucene/build/smokeTestRelease/tmp/unpack/solr-7.0.0/solr/build/solr-solrj/classes/java/org/apache/solr/common/package-info.class
[smoker] [javac] Creating empty /x1/jenkins/jenkins-slave/workspace/Lucene-Solr-SmokeRelease-master/lucene/build/smokeTestRelease/tmp/unpack/solr-7.0.0/solr/build/solr-solrj/classes/java/org/apache/solr/client/solrj/io/comp/package-info.class
[smoker] [javac] Creating empty /x1/jenkins/jenkins-slave/workspace/Lucene-Solr-SmokeRelease-master/lucene/build/smokeTestRelease/tmp/unpack/solr-7.0.0/solr/build/solr-solrj/classes/java/org/apache/solr/client/solrj/util/package-info.class
[smoker] [copy] Copying 1 file to /x1/jenkins/jenkins-slave/workspace/Lucene-Solr-SmokeRelease-master/lucene/build/smokeTestRelease/tmp/unpack/solr-7.0.0/solr/build/solr-solrj/classes/java
[smoker]
[smoker] compile-core:
[smoker]
[smoker] check-lucene-core-uptodate:
[smoker]
[smoker] jar-lucene-core:
[smoker]
[smoker] check-backward-codecs-uptodate:
[smoker]
[smoker] jar-backward-codecs:
[smoker]
[smoker] check-analyzers-phonetic-uptodate:
[smoker]
[smoker] jar-analyzers-phonetic:
[smoker]
[smoker] check-analyzers-kuromoji-uptodate:
[smoker]
[smoker] jar-analyzers-kuromoji:
[smoker]
[smoker] check-codecs-uptodate:
[smoker]
[smoker] jar-codecs:
[smoker]
[smoker] check-expressions-uptodate:
[smoker]
[smoker] jar-expressions:
[smoker]
[smoker] check-suggest-uptodate:
[smoker]
[smoker] jar-suggest:
[smoker]
[smoker] check-highlighter-uptodate:
[smoker]
[smoker] jar-highlighter:
[smoker]
[smoker] check-memory-uptodate:
[smoker]
[smoker] jar-memory:
[smoker]
[smoker] check-misc-uptodate:
[smoker]
[smoker] jar-misc:
[smoker]
[smoker] check-spatial-extras-uptodate:
[smoker]
[smoker] jar-spatial-extras:
[smoker]
[smoker] check-grouping-uptodate:
[smoker]
[smoker] jar-grouping:
[smoker]
[smoker] check-queries-uptodate:
[smoker]
[smoker] jar-queries:
[smoker]
[smoker] check-queryparser-uptodate:
[smoker]
[smoker] jar-queryparser:
[smoker]
[smoker] check-join-uptodate:
[smoker]
[smoker] jar-join:
[smoker]
[smoker] check-sandbox-uptodate:
[smoker]
[smoker] jar-sandbox:
[smoker]
[smoker] check-classification-uptodate:
[smoker]
[smoker] jar-classification:
[smoker]
[smoker] prep-lucene-jars:
[smoker]
[smoker] resolve-example:
[smoker]
[smoker] ivy-availability-check:
[smoker]
[smoker] ivy-fail:
[smoker]
[smoker] ivy-configure:
[smoker] [ivy:configure] :: loading settings :: file = /x1/jenkins/jenkins-slave/workspace/Lucene-Solr-SmokeRelease-master/lucene/build/smokeTestRelease/tmp/unpack/solr-7.0.0/lucene/ivy-settings.xml
[smoker]
[smoker] resolve:
[smoker]
[smoker] resolve-server:
[smoker]
[smoker] ivy-availability-check:
[smoker]
[smoker] ivy-fail:
[smoker]
[smoker] ivy-fail:
[smoker]
[smoker] ivy-configure:
[smoker] [ivy:configure] :: loading settings :: file = /x1/jenkins/jenkins-slave/workspace/Lucene-Solr-SmokeRelease-master/lucene/build/smokeTestRelease/tmp/unpack/solr-7.0.0/lucene/ivy-settings.xml
[smoker]
[smoker] resolve:
[smoker]
[smoker] -check-git-state:
[smoker]
[smoker] -git-cleanroot:
[smoker]
[smoker] -copy-git-state:
[smoker]
[smoker] git-autoclean:
[smoker]
[smoker] ivy-availability-check:
[smoker]
[smoker] ivy-fail:
[smoker]
[smoker] ivy-fail:
[smoker]
[smoker] ivy-configure:
[smoker] [ivy:configure] :: loading settings :: file = /x1/jenkins/jenkins-slave/workspace/Lucene-Solr-SmokeRelease-master/lucene/build/smokeTestRelease/tmp/unpack/solr-7.0.0/lucene/ivy-settings.xml
[smoker]
[smoker] resolve:
[smoker]
[smoker] common.init:
[smoker]
[smoker] compile-lucene-core:
[smoker]
[smoker] -check-git-state:
[smoker]
[smoker] -git-cleanroot:
[smoker]
[smoker] -copy-git-state:
[smoker]
[smoker] git-autoclean:
[smoker]
[smoker] ivy-availability-check:
[smoker]
[smoker] ivy-fail:
[smoker]
[smoker] ivy-configure:
[smoker] [ivy:configure] :: loading settings :: file = /x1/jenkins/jenkins-slave/workspace/Lucene-Solr-SmokeRelease-master/lucene/build/smokeTestRelease/tmp/unpack/solr-7.0.0/lucene/ivy-settings.xml
[smoker]
[smoker] resolve:
[smoker]
[smoker] init:
[smoker]
[smoker] -clover.disable:
[smoker]
[smoker] -clover.load:
[smoker]
[smoker] -clover.classpath:
[smoker]
[smoker] -clover.setup:
[smoker]
[smoker] clover:
[smoker]
[smoker] compile-core:
[smoker]
[smoker] init:
[smoker]
[smoker] -clover.disable:
[smoker]
[smoker] -clover.load:
[smoker]
[smoker] -clover.classpath:
[smoker]
[smoker] -clover.setup:
[smoker]
[smoker] clover:
[smoker]
[smoker] common.compile-core:
[smoker] [mkdir] Created dir: /x1/jenkins/jenkins-slave/workspace/Lucene-Solr-SmokeRelease-master/lucene/build/smokeTestRelease/tmp/unpack/solr-7.0.0/solr/build/solr-core/classes/java
[smoker] [javac] Compiling 917 source files to /x1/jenkins/jenkins-slave/workspace/Lucene-Solr-SmokeRelease-master/lucene/build/smokeTestRelease/tmp/unpack/solr-7.0.0/solr/build/solr-core/classes/java
[smoker] [javac] Note: Some input files use or override a deprecated API.
[smoker] [javac] Note: Recompile with -Xlint:deprecation for details.
[smoker] [javac] Note: Some input files use unchecked or unsafe operations.
[smoker] [javac] Note: Recompile with -Xlint:unchecked for details.
[smoker] [javac] Creating empty /x1/jenkins/jenkins-slave/workspace/Lucene-Solr-SmokeRelease-master/lucene/build/smokeTestRelease/tmp/unpack/solr-7.0.0/solr/build/solr-core/classes/java/org/apache/solr/logging/log4j/package-info.class
[smoker] [javac] Creating empty /x1/jenkins/jenkins-slave/workspace/Lucene-Solr-SmokeRelease-master/lucene/build/smokeTestRelease/tmp/unpack/solr-7.0.0/solr/build/solr-core/classes/java/org/apache/solr/client/solrj/embedded/package-info.class
[smoker] [javac] Creating empty /x1/jenkins/jenkins-slave/workspace/Lucene-Solr-SmokeRelease-master/lucene/build/smokeTestRelease/tmp/unpack/solr-7.0.0/solr/build/solr-core/classes/java/org/apache/solr/internal/csv/package-info.class
[smoker] [javac] Creating empty /x1/jenkins/jenkins-slave/workspace/Lucene-Solr-SmokeRelease-master/lucene/build/smokeTestRelease/tmp/unpack/solr-7.0.0/solr/build/solr-core/classes/java/org/apache/solr/search/function/distance/package-info.class
[smoker] [javac] Creating empty /x1/jenkins/jenkins-slave/workspace/Lucene-Solr-SmokeRelease-master/lucene/build/smokeTestRelease/tmp/unpack/solr-7.0.0/solr/build/solr-core/classes/java/org/apache/solr/search/grouping/distributed/requestfactory/package-info.class
[smoker] [javac] Creating empty /x1/jenkins/jenkins-slave/workspace/Lucene-Solr-SmokeRelease-master/lucene/build/smokeTestRelease/tmp/unpack/solr-7.0.0/solr/build/solr-core/classes/java/org/apache/solr/search/grouping/collector/package-info.class
[smoker] [javac] Creating empty /x1/jenkins/jenkins-slave/workspace/Lucene-Solr-SmokeRelease-master/lucene/build/smokeTestRelease/tmp/unpack/solr-7.0.0/solr/build/solr-core/classes/java/org/apache/solr/search/grouping/distributed/command/package-info.class
[smoker] [javac] Creating empty /x1/jenkins/jenkins-slave/workspace/Lucene-Solr-SmokeRelease-master/lucene/build/smokeTestRelease/tmp/unpack/solr-7.0.0/solr/build/solr-core/classes/java/org/apache/solr/spelling/package-info.class
[smoker] [javac] Creating empty /x1/jenkins/jenkins-slave/workspace/Lucene-Solr-SmokeRelease-master/lucene/build/smokeTestRelease/tmp/unpack/solr-7.0.0/solr/build/solr-core/classes/java/org/apache/solr/cloud/package-info.class
[smoker] [javac] Creating empty /x1/jenkins/jenkins-slave/workspace/Lucene-Solr-SmokeRelease-master/lucene/build/smokeTestRelease/tmp/unpack/solr-7.0.0/solr/build/solr-core/classes/java/org/apache/solr/spelling/suggest/fst/package-info.class
[smoker] [javac] Creating empty /x1/jenkins/jenkins-slave/workspace/Lucene-Solr-SmokeRelease-master/lucene/build/smokeTestRelease/tmp/unpack/solr-7.0.0/solr/build/solr-core/classes/java/org/apache/solr/util/plugin/package-info.class
[smoker] [javac] Creating empty /x1/jenkins/jenkins-slave/workspace/Lucene-Solr-SmokeRelease-master/lucene/build/smokeTestRelease/tmp/unpack/solr-7.0.0/solr/build/solr-core/classes/java/org/apache/solr/search/function/package-info.class
[smoker] [javac] Creating empty /x1/jenkins/jenkins-slave/workspace/Lucene-Solr-SmokeRelease-master/lucene/build/smokeTestRelease/tmp/unpack/solr-7.0.0/solr/build/solr-core/classes/java/org/apache/solr/store/blockcache/package-info.class
[smoker] [javac] Creating empty /x1/jenkins/jenkins-slave/workspace/Lucene-Solr-SmokeRelease-master/lucene/build/smokeTestRelease/tmp/unpack/solr-7.0.0/solr/build/solr-core/classes/java/org/apache/solr/index/package-info.class
[smoker] [javac] Creating empty /x1/jenkins/jenkins-slave/workspace/Lucene-Solr-SmokeRelease-master/lucene/build/smokeTestRelease/tmp/unpack/solr-7.0.0/solr/build/solr-core/classes/java/org/apache/solr/util/hll/package-info.class
[smoker] [javac] Creating empty /x1/jenkins/jenkins-slave/workspace/Lucene-Solr-SmokeRelease-master/lucene/build/smokeTestRelease/tmp/unpack/solr-7.0.0/solr/build/solr-core/classes/java/org/apache/solr/search/package-info.class
[smoker] [javac] Creating empty /x1/jenkins/jenkins-slave/workspace/Lucene-Solr-SmokeRelease-master/lucene/build/smokeTestRelease/tmp/unpack/solr-7.0.0/solr/build/solr-core/classes/java/org/apache/solr/analysis/package-info.class
[smoker] [javac] Creating empty /x1/jenkins/jenkins-slave/workspace/Lucene-Solr-SmokeRelease-master/lucene/build/smokeTestRelease/tmp/unpack/solr-7.0.0/solr/build/solr-core/classes/java/org/apache/solr/handler/package-info.class
[smoker] [javac] Creating empty /x1/jenkins/jenkins-slave/workspace/Lucene-Solr-SmokeRelease-master/lucene/build/smokeTestRelease/tmp/unpack/solr-7.0.0/solr/build/solr-core/classes/java/org/apache/solr/search/grouping/distributed/responseprocessor/package-info.class
[smoker] [javac] Creating empty /x1/jenkins/jenkins-slave/workspace/Lucene-Solr-SmokeRelease-master/lucene/build/smokeTestRelease/tmp/unpack/solr-7.0.0/solr/build/solr-core/classes/java/org/apache/solr/search/join/package-info.class
[smoker] [javac] Creating empty /x1/jenkins/jenkins-slave/workspace/Lucene-Solr-SmokeRelease-master/lucene/build/smokeTestRelease/tmp/unpack/solr-7.0.0/solr/build/solr-core/classes/java/org/apache/solr/security/package-info.class
[smoker] [javac] Creating empty /x1/jenkins/jenkins-slave/workspace/Lucene-Solr-SmokeRelease-master/lucene/build/smokeTestRelease/tmp/unpack/solr-7.0.0/solr/build/solr-core/classes/java/org/apache/solr/cloud/rule/package-info.class
[smoker] [javac] Creating empty /x1/jenkins/jenkins-slave/workspace/Lucene-Solr-SmokeRelease-master/lucene/build/smokeTestRelease/tmp/unpack/solr-7.0.0/solr/build/solr-core/classes/java/org/apache/solr/index/hdfs/package-info.class
[smoker] [javac] Creating empty /x1/jenkins/jenkins-slave/workspace/Lucene-Solr-SmokeRelease-master/lucene/build/smokeTestRelease/tmp/unpack/solr-7.0.0/solr/build/solr-core/classes/java/org/apache/solr/cloud/overseer/package-info.class
[smoker] [javac] Creating empty /x1/jenkins/jenkins-slave/workspace/Lucene-Solr-SmokeRelease-master/lucene/build/smokeTestRelease/tmp/unpack/solr-7.0.0/solr/build/solr-core/classes/java/org/apache/solr/rest/package-info.class
[smoker] [javac] Creating empty /x1/jenkins/jenkins-slave/workspace/Lucene-Solr-SmokeRelease-master/lucene/build/smokeTestRelease/tmp/unpack/solr-7.0.0/solr/build/solr-core/classes/java/org/apache/solr/spelling/suggest/jaspell/package-info.class
[smoker] [javac] Creating empty /x1/jenkins/jenkins-slave/workspace/Lucene-Solr-SmokeRelease-master/lucene/build/smokeTestRelease/tmp/unpack/solr-7.0.0/solr/build/solr-core/classes/java/org/apache/solr/search/grouping/package-info.class
[smoker] [javac] Creating empty /x1/jenkins/jenkins-slave/workspace/Lucene-Solr-SmokeRelease-master/lucene/build/smokeTestRelease/tmp/unpack/solr-7.0.0/solr/build/solr-core/classes/java/org/apache/solr/servlet/package-info.class
[smoker] [javac] Creating empty /x1/jenkins/jenkins-slave/workspace/Lucene-Solr-SmokeRelease-master/lucene/build/smokeTestRelease/tmp/unpack/solr-7.0.0/solr/build/solr-core/classes/java/org/apache/solr/schema/package-info.class
[smoker] [javac] Creating empty /x1/jenkins/jenkins-slave/workspace/Lucene-Solr-SmokeRelease-master/lucene/build/smokeTestRelease/tmp/unpack/solr-7.0.0/solr/build/solr-core/classes/java/org/apache/solr/search/grouping/distributed/package-info.class
[smoker] [javac] Creating empty /x1/jenkins/jenkins-slave/workspace/Lucene-Solr-SmokeRelease-master/lucene/build/smokeTestRelease/tmp/unpack/solr-7.0.0/solr/build/solr-core/classes/java/org/apache/solr/handler/loader/package-info.class
[smoker] [javac] Creating empty /x1/jenkins/jenkins-slave/workspace/Lucene-Solr-SmokeRelease-master/lucene/build/smokeTestRelease/tmp/unpack/solr-7.0.0/solr/build/solr-core/classes/java/org/apache/solr/response/package-info.class
[smoker] [javac] Creating empty /x1/jenkins/jenkins-slave/workspace/Lucene-Solr-SmokeRelease-master/lucene/build/smokeTestRelease/tmp/unpack/solr-7.0.0/solr/build/solr-core/classes/java/org/apache/solr/search/stats/package-info.class
[smoker] [javac] Creating empty /x1/jenkins/jenkins-slave/workspace/Lucene-Solr-SmokeRelease-master/lucene/build/smokeTestRelease/tmp/unpack/solr-7.0.0/solr/build/solr-core/classes/java/org/apache/solr/util/package-info.class
[smoker] [javac] Creating empty /x1/jenkins/jenkins-slave/workspace/Lucene-Solr-SmokeRelease-master/lucene/build/smokeTestRelease/tmp/unpack/solr-7.0.0/solr/build/solr-core/classes/java/org/apache/solr/search/grouping/endresulttransformer/package-info.class
[smoker] [javac] Creating empty /x1/jenkins/jenkins-slave/workspace/Lucene-Solr-SmokeRelease-master/lucene/build/smokeTestRelease/tmp/unpack/solr-7.0.0/solr/build/solr-core/classes/java/org/apache/solr/rest/schema/analysis/package-info.class
[smoker] [javac] Creating empty /x1/jenkins/jenkins-slave/workspace/Lucene-Solr-SmokeRelease-master/lucene/build/smokeTestRelease/tmp/unpack/solr-7.0.0/solr/build/solr-core/classes/java/org/apache/solr/handler/admin/package-info.class
[smoker] [javac] Creating empty /x1/jenkins/jenkins-slave/workspace/Lucene-Solr-SmokeRelease-master/lucene/build/smokeTestRelease/tmp/unpack/solr-7.0.0/solr/build/solr-core/classes/java/org/apache/solr/search/similarities/package-info.class
[smoker] [javac] Creating empty /x1/jenkins/jenkins-slave/workspace/Lucene-Solr-SmokeRelease-master/lucene/build/smokeTestRelease/tmp/unpack/solr-7.0.0/solr/build/solr-core/classes/java/org/apache/solr/spelling/suggest/tst/package-info.class
[smoker] [javac] Creating empty /x1/jenkins/jenkins-slave/workspace/Lucene-Solr-SmokeRelease-master/lucene/build/smokeTestRelease/tmp/unpack/solr-7.0.0/solr/build/solr-core/classes/java/org/apache/solr/util/stats/package-info.class
[smoker] [javac] Creating empty /x1/jenkins/jenkins-slave/workspace/Lucene-Solr-SmokeRelease-master/lucene/build/smokeTestRelease/tmp/unpack/solr-7.0.0/solr/build/solr-core/classes/java/org/apache/solr/response/transform/package-info.class
[smoker] [javac] Creating empty /x1/jenkins/jenkins-slave/workspace/Lucene-Solr-SmokeRelease-master/lucene/build/smokeTestRelease/tmp/unpack/solr-7.0.0/solr/build/solr-core/classes/java/org/apache/solr/search/grouping/distributed/shardresultserializer/package-info.class
[smoker] [javac] Creating empty /x1/jenkins/jenkins-slave/workspace/Lucene-Solr-SmokeRelease-master/lucene/build/smokeTestRelease/tmp/unpack/solr-7.0.0/solr/build/solr-core/classes/java/org/apache/solr/update/processor/package-info.class
[smoker] [javac] Creating empty /x1/jenkins/jenkins-slave/workspace/Lucene-Solr-SmokeRelease-master/lucene/build/smokeTestRelease/tmp/unpack/solr-7.0.0/solr/build/solr-core/classes/java/org/apache/solr/core/package-info.class
[smoker] [javac] Creating empty /x1/jenkins/jenkins-slave/workspace/Lucene-Solr-SmokeRelease-master/lucene/build/smokeTestRelease/tmp/unpack/solr-7.0.0/solr/build/solr-core/classes/java/org/apache/solr/request/package-info.class
[smoker] [javac] Creating empty /x1/jenkins/jenkins-slave/workspace/Lucene-Solr-SmokeRelease-master/lucene/build/smokeTestRelease/tmp/unpack/solr-7.0.0/solr/build/solr-core/classes/java/org/apache/solr/search/mlt/package-info.class
[smoker] [javac] Creating empty /x1/jenkins/jenkins-slave/workspace/Lucene-Solr-SmokeRelease-master/lucene/build/smokeTestRelease/tmp/unpack/solr-7.0.0/solr/build/solr-core/classes/java/org/apache/solr/logging/jul/package-info.class
[smoker] [javac] Creating empty /x1/jenkins/jenkins-slave/workspace/Lucene-Solr-SmokeRelease-master/lucene/build/smokeTestRelease/tmp/unpack/solr-7.0.0/solr/build/solr-core/classes/java/org/apache/solr/rest/schema/package-info.class
[smoker] [javac] Creating empty /x1/jenkins/jenkins-slave/workspace/Lucene-Solr-SmokeRelease-master/lucene/build/smokeTestRelease/tmp/unpack/solr-7.0.0/solr/build/solr-core/classes/java/org/apache/solr/highlight/package-info.class
[smoker] [javac] Creating empty /x1/jenkins/jenkins-slave/workspace/Lucene-Solr-SmokeRelease-master/lucene/build/smokeTestRelease/tmp/unpack/solr-7.0.0/solr/build/solr-core/classes/java/org/apache/solr/servlet/cache/package-info.class
[smoker] [javac] Creating empty /x1/jenkins/jenkins-slave/workspace/Lucene-Solr-SmokeRelease-master/lucene/build/smokeTestRelease/tmp/unpack/solr-7.0.0/solr/build/solr-core/classes/java/org/apache/solr/package-info.class
[smoker] [javac] Creating empty /x1/jenkins/jenkins-slave/workspace/Lucene-Solr-SmokeRelease-master/lucene/build/smokeTestRelease/tmp/unpack/solr-7.0.0/solr/build/solr-core/classes/java/org/apache/solr/parser/package-info.class
[smoker] [javac] Creating empty /x1/jenkins/jenkins-slave/workspace/Lucene-Solr-SmokeRelease-master/lucene/build/smokeTestRelease/tmp/unpack/solr-7.0.0/solr/build/solr-core/classes/java/org/apache/solr/store/hdfs/package-info.class
[smoker] [javac] Creating empty /x1/jenkins/jenkins-slave/workspace/Lucene-Solr-SmokeRelease-master/lucene/build/smokeTestRelease/tmp/unpack/solr-7.0.0/solr/build/solr-core/classes/java/org/apache/solr/spelling/suggest/package-info.class
[smoker] [javac] Creating empty /x1/jenkins/jenkins-slave/workspace/Lucene-Solr-SmokeRelease-master/lucene/build/smokeTestRelease/tmp/unpack/solr-7.0.0/solr/build/solr-core/classes/java/org/apache/solr/handler/component/package-info.class
[smoker] [javac] Creating empty /x1/jenkins/jenkins-slave/workspace/Lucene-Solr-SmokeRelease-master/lucene/build/smokeTestRelease/tmp/unpack/solr-7.0.0/solr/build/solr-core/classes/java/org/apache/solr/logging/package-info.class
[smoker] [javac] Creating empty /x1/jenkins/jenkins-slave/workspace/Lucene-Solr-SmokeRelease-master/lucene/build/smokeTestRelease/tmp/unpack/solr-7.0.0/solr/build/solr-core/classes/java/org/apache/solr/update/package-info.class
[smoker] [javac] Creating empty /x1/jenkins/jenkins-slave/workspace/Lucene-Solr-SmokeRelease-master/lucene/build/smokeTestRelease/tmp/unpack/solr-7.0.0/solr/build/solr-core/classes/java/org/apache/solr/internal/csv/writer/package-info.class
[smoker] [javac] Creating empty /x1/jenkins/jenkins-slave/workspace/Lucene-Solr-SmokeRelease-master/lucene/build/smokeTestRelease/tmp/unpack/solr-7.0.0/solr/build/solr-core/classes/java/org/apache/solr/util/xslt/package-info.class
[smoker] [copy] Copying 4 files to /x1/jenkins/jenkins-slave/workspace/Lucene-Solr-SmokeRelease-master/lucene/build/smokeTestRelease/tmp/unpack/solr-7.0.0/solr/build/solr-core/classes/java
[smoker]
[smoker] common-solr.compile-core:
[smoker]
[smoker] compile-core:
[smoker]
[smoker] compile-solrj:
[smoker]
[smoker] check-lucene-core-uptodate:
[smoker]
[smoker] jar-lucene-core:
[smoker]
[smoker] check-backward-codecs-uptodate:
[smoker]
[smoker] jar-backward-codecs:
[smoker]
[smoker] check-analyzers-phonetic-uptodate:
[smoker]
[smoker] jar-analyzers-phonetic:
[smoker]
[smoker] check-analyzers-kuromoji-uptodate:
[smoker]
[smoker] jar-analyzers-kuromoji:
[smoker]
[smoker] check-codecs-uptodate:
[smoker]
[smoker] jar-codecs:
[smoker]
[smoker] check-expressions-uptodate:
[smoker]
[smoker] jar-expressions:
[smoker]
[smoker] check-suggest-uptodate:
[smoker]
[smoker] jar-suggest:
[smoker]
[smoker] check-highlighter-uptodate:
[smoker]
[smoker] jar-highlighter:
[smoker]
[smoker] check-memory-uptodate:
[smoker]
[smoker] jar-memory:
[smoker]
[smoker] check-misc-uptodate:
[smoker]
[smoker] jar-misc:
[smoker]
[smoker] check-spatial-extras-uptodate:
[smoker]
[smoker] jar-spatial-extras:
[smoker]
[smoker] check-grouping-uptodate:
[smoker]
[smoker] jar-grouping:
[smoker]
[smoker] check-queries-uptodate:
[smoker]
[smoker] jar-queries:
[smoker]
[smoker] check-queryparser-uptodate:
[smoker]
[smoker] jar-queryparser:
[smoker]
[smoker] check-join-uptodate:
[smoker]
[smoker] jar-join:
[smoker]
[smoker] check-sandbox-uptodate:
[smoker]
[smoker] jar-sandbox:
[smoker]
[smoker] check-classification-uptodate:
[smoker]
[smoker] jar-classification:
[smoker]
[smoker] prep-lucene-jars:
[smoker]
[smoker] resolve-example:
[smoker]
[smoker] ivy-availability-check:
[smoker]
[smoker] ivy-fail:
[smoker]
[smoker] ivy-configure:
[smoker] [ivy:configure] :: loading settings :: file = /x1/jenkins/jenkins-slave/workspace/Lucene-Solr-SmokeRelease-master/lucene/build/smokeTestRelease/tmp/unpack/solr-7.0.0/lucene/ivy-settings.xml
[smoker]
[smoker] resolve:
[smoker]
[smoker] resolve-server:
[smoker]
[smoker] ivy-availability-check:
[smoker]
[smoker] ivy-fail:
[smoker]
[smoker] ivy-fail:
[smoker]
[smoker] ivy-configure:
[smoker] [ivy:configure] :: loading settings :: file = /x1/jenkins/jenkins-slave/workspace/Lucene-Solr-SmokeRelease-master/lucene/build/smokeTestRelease/tmp/unpack/solr-7.0.0/lucene/ivy-settings.xml
[smoker]
[smoker] resolve:
[smoker]
[smoker] -check-git-state:
[smoker]
[smoker] -git-cleanroot:
[smoker]
[smoker] -copy-git-state:
[smoker]
[smoker] git-autoclean:
[smoker]
[smoker] ivy-availability-check:
[smoker]
[smoker] ivy-fail:
[smoker]
[smoker] ivy-fail:
[smoker]
[smoker] ivy-configure:
[smoker] [ivy:configure] :: loading settings :: file = /x1/jenkins/jenkins-slave/workspace/Lucene-Solr-SmokeRelease-master/lucene/build/smokeTestRelease/tmp/unpack/solr-7.0.0/lucene/ivy-settings.xml
[smoker]
[smoker] resolve:
[smoker]
[smoker] common.init:
[smoker]
[smoker] compile-lucene-core:
[smoker]
[smoker] -check-git-state:
[smoker]
[smoker] -git-cleanroot:
[smoker]
[smoker] -copy-git-state:
[smoker]
[smoker] git-autoclean:
[smoker]
[smoker] ivy-availability-check:
[smoker]
[smoker] ivy-fail:
[smoker]
[smoker] ivy-configure:
[smoker] [ivy:configure] :: loading settings :: file = /x1/jenkins/jenkins-slave/workspace/Lucene-Solr-SmokeRelease-master/lucene/build/smokeTestRelease/tmp/unpack/solr-7.0.0/lucene/ivy-settings.xml
[smoker]
[smoker] resolve:
[smoker]
[smoker] init:
[smoker]
[smoker] -clover.disable:
[smoker]
[smoker] -clover.load:
[smoker]
[smoker] -clover.classpath:
[smoker]
[smoker] -clover.setup:
[smoker]
[smoker] clover:
[smoker]
[smoker] compile-core:
[smoker]
[smoker] init:
[smoker]
[smoker] -clover.disable:
[smoker]
[smoker] -clover.load:
[smoker]
[smoker] -clover.classpath:
[smoker]
[smoker] -clover.setup:
[smoker]
[smoker] clover:
[smoker]
[smoker] common.compile-core:
[smoker]
[smoker] compile-core:
[smoker]
[smoker] check-lucene-core-uptodate:
[smoker]
[smoker] jar-lucene-core:
[smoker]
[smoker] check-backward-codecs-uptodate:
[smoker]
[smoker] jar-backward-codecs:
[smoker]
[smoker] check-analyzers-phonetic-uptodate:
[smoker]
[smoker] jar-analyzers-phonetic:
[smoker]
[smoker] check-analyzers-kuromoji-uptodate:
[smoker]
[smoker] jar-analyzers-kuromoji:
[smoker]
[smoker] check-codecs-uptodate:
[smoker]
[smoker] jar-codecs:
[smoker]
[smoker] check-expressions-uptodate:
[smoker]
[smoker] jar-expressions:
[smoker]
[smoker] check-suggest-uptodate:
[smoker]
[smoker] jar-suggest:
[smoker]
[smoker] check-highlighter-uptodate:
[smoker]
[smoker] jar-highlighter:
[smoker]
[smoker] check-memory-uptodate:
[smoker]
[smoker] jar-memory:
[smoker]
[smoker] check-misc-uptodate:
[smoker]
[smoker] jar-misc:
[smoker]
[smoker] check-spatial-extras-uptodate:
[smoker]
[smoker] jar-spatial-extras:
[smoker]
[smoker] check-grouping-uptodate:
[smoker]
[smoker] jar-grouping:
[smoker]
[smoker] check-queries-uptodate:
[smoker]
[smoker] jar-queries:
[smoker]
[smoker] check-queryparser-uptodate:
[smoker]
[smoker] jar-queryparser:
[smoker]
[smoker] check-join-uptodate:
[smoker]
[smoker] jar-join:
[smoker]
[smoker] check-sandbox-uptodate:
[smoker]
[smoker] jar-sandbox:
[smoker]
[smoker] check-classification-uptodate:
[smoker]
[smoker] jar-classification:
[smoker]
[smoker] prep-lucene-jars:
[smoker]
[smoker] resolve-example:
[smoker]
[smoker] ivy-availability-check:
[smoker]
[smoker] ivy-fail:
[smoker]
[smoker] ivy-configure:
[smoker] [ivy:configure] :: loading settings :: file = /x1/jenkins/jenkins-slave/workspace/Lucene-Solr-SmokeRelease-master/lucene/build/smokeTestRelease/tmp/unpack/solr-7.0.0/lucene/ivy-settings.xml
[smoker]
[smoker] resolve:
[smoker]
[smoker] resolve-server:
[smoker]
[smoker] ivy-availability-check:
[smoker]
[smoker] ivy-fail:
[smoker]
[smoker] ivy-fail:
[smoker]
[smoker] ivy-configure:
[smoker] [ivy:configure] :: loading settings :: file = /x1/jenkins/jenkins-slave/workspace/Lucene-Solr-SmokeRelease-master/lucene/build/smokeTestRelease/tmp/unpack/solr-7.0.0/lucene/ivy-settings.xml
[smoker]
[smoker] resolve:
[smoker]
[smoker] -check-git-state:
[smoker]
[smoker] -git-cleanroot:
[smoker]
[smoker] -copy-git-state:
[smoker]
[smoker] git-autoclean:
[smoker]
[smoker] ivy-availability-check:
[smoker]
[smoker] ivy-fail:
[smoker]
[smoker] ivy-fail:
[smoker]
[smoker] ivy-configure:
[smoker] [ivy:configure] :: loading settings :: file = /x1/jenkins/jenkins-slave/workspace/Lucene-Solr-SmokeRelease-master/lucene/build/smokeTestRelease/tmp/unpack/solr-7.0.0/lucene/ivy-settings.xml
[smoker]
[smoker] resolve:
[smoker]
[smoker] common.init:
[smoker]
[smoker] compile-lucene-core:
[smoker]
[smoker] -check-git-state:
[smoker]
[smoker] -git-cleanroot:
[smoker]
[smoker] -copy-git-state:
[smoker]
[smoker] git-autoclean:
[smoker]
[smoker] ivy-availability-check:
[smoker]
[smoker] ivy-fail:
[smoker]
[smoker] ivy-configure:
[smoker] [ivy:configure] :: loading settings :: file = /x1/jenkins/jenkins-slave/workspace/Lucene-Solr-SmokeRelease-master/lucene/build/smokeTestRelease/tmp/unpack/solr-7.0.0/lucene/ivy-settings.xml
[smoker]
[smoker] resolve:
[smoker]
[smoker] init:
[smoker]
[smoker] -clover.disable:
[smoker]
[smoker] -clover.load:
[smoker]
[smoker] -clover.classpath:
[smoker]
[smoker] -clover.setup:
[smoker]
[smoker] clover:
[smoker]
[smoker] compile-core:
[smoker]
[smoker] init:
[smoker]
[smoker] -clover.disable:
[smoker]
[smoker] -clover.load:
[smoker]
[smoker] -clover.classpath:
[smoker]
[smoker] -clover.setup:
[smoker]
[smoker] clover:
[smoker]
[smoker] common.compile-core:
[smoker] [mkdir] Created dir: /x1/jenkins/jenkins-slave/workspace/Lucene-Solr-SmokeRelease-master/lucene/build/smokeTestRelease/tmp/unpack/solr-7.0.0/solr/build/contrib/solr-analysis-extras/classes/java
[smoker] [javac] Compiling 1 source file to /x1/jenkins/jenkins-slave/workspace/Lucene-Solr-SmokeRelease-master/lucene/build/smokeTestRelease/tmp/unpack/solr-7.0.0/solr/build/contrib/solr-analysis-extras/classes/java
[smoker] [javac] Note: /x1/jenkins/jenkins-slave/workspace/Lucene-Solr-SmokeRelease-master/lucene/build/smokeTestRelease/tmp/unpack/solr-7.0.0/solr/contrib/analysis-extras/src/java/org/apache/solr/schema/ICUCollationField.java uses or overrides a deprecated API.
[smoker] [javac] Note: Recompile with -Xlint:deprecation for details.
[smoker]
[smoker] common-solr.compile-core:
[smoker]
[smoker] solr-contrib-build.compile-core:
[smoker]
[smoker] compile-core:
[smoker]
[smoker] compile:
[smoker]
[smoker] compile-solr-test-framework:
[smoker]
[smoker] ivy-availability-check:
[smoker]
[smoker] ivy-fail:
[smoker]
[smoker] ivy-configure:
[smoker] [ivy:configure] :: loading settings :: file = /x1/jenkins/jenkins-slave/workspace/Lucene-Solr-SmokeRelease-master/lucene/build/smokeTestRelease/tmp/unpack/solr-7.0.0/lucene/ivy-settings.xml
[smoker]
[smoker] resolve:
[smoker]
[smoker] compile-solr-core:
[smoker]
[smoker] compile-solrj:
[smoker]
[smoker] check-lucene-core-uptodate:
[smoker]
[smoker] jar-lucene-core:
[smoker]
[smoker] check-backward-codecs-uptodate:
[smoker]
[smoker] jar-backward-codecs:
[smoker]
[smoker] check-analyzers-phonetic-uptodate:
[smoker]
[smoker] jar-analyzers-phonetic:
[smoker]
[smoker] check-analyzers-kuromoji-uptodate:
[smoker]
[smoker] jar-analyzers-kuromoji:
[smoker]
[smoker] check-codecs-uptodate:
[smoker]
[smoker] jar-codecs:
[smoker]
[smoker] check-expressions-uptodate:
[smoker]
[smoker] jar-expressions:
[smoker]
[smoker] check-suggest-uptodate:
[smoker]
[smoker] jar-suggest:
[smoker]
[smoker] check-highlighter-uptodate:
[smoker]
[smoker] jar-highlighter:
[smoker]
[smoker] check-memory-uptodate:
[smoker]
[smoker] jar-memory:
[smoker]
[smoker] check-misc-uptodate:
[smoker]
[smoker] jar-misc:
[smoker]
[smoker] check-spatial-extras-uptodate:
[smoker]
[smoker] jar-spatial-extras:
[smoker]
[smoker] check-grouping-uptodate:
[smoker]
[smoker] jar-grouping:
[smoker]
[smoker] check-queries-uptodate:
[smoker]
[smoker] jar-queries:
[smoker]
[smoker] check-queryparser-uptodate:
[smoker]
[smoker] jar-queryparser:
[smoker]
[smoker] check-join-uptodate:
[smoker]
[smoker] jar-join:
[smoker]
[smoker] check-sandbox-uptodate:
[smoker]
[smoker] jar-sandbox:
[smoker]
[smoker] check-classification-uptodate:
[smoker]
[smoker] jar-classification:
[smoker]
[smoker] prep-lucene-jars:
[smoker]
[smoker] resolve-example:
[smoker]
[smoker] ivy-availability-check:
[smoker]
[smoker] ivy-fail:
[smoker]
[smoker] ivy-configure:
[smoker] [ivy:configure] :: loading settings :: file = /x1/jenkins/jenkins-slave/workspace/Lucene-Solr-SmokeRelease-master/lucene/build/smokeTestRelease/tmp/unpack/solr-7.0.0/lucene/ivy-settings.xml
[smoker]
[smoker] resolve:
[smoker]
[smoker] resolve-server:
[smoker]
[smoker] ivy-availability-check:
[smoker]
[smoker] ivy-fail:
[smoker]
[smoker] ivy-fail:
[smoker]
[smoker] ivy-configure:
[smoker] [ivy:configure] :: loading settings :: file = /x1/jenkins/jenkins-slave/workspace/Lucene-Solr-SmokeRelease-master/lucene/build/smokeTestRelease/tmp/unpack/solr-7.0.0/lucene/ivy-settings.xml
[smoker]
[smoker] resolve:
[smoker]
[smoker] -check-git-state:
[smoker]
[smoker] -git-cleanroot:
[smoker]
[smoker] -copy-git-state:
[smoker]
[smoker] git-autoclean:
[smoker]
[smoker] ivy-availability-check:
[smoker]
[smoker] ivy-fail:
[smoker]
[smoker] ivy-fail:
[smoker]
[smoker] ivy-configure:
[smoker] [ivy:configure] :: loading settings :: file = /x1/jenkins/jenkins-slave/workspace/Lucene-Solr-SmokeRelease-master/lucene/build/smokeTestRelease/tmp/unpack/solr-7.0.0/lucene/ivy-settings.xml
[smoker]
[smoker] resolve:
[smoker]
[smoker] common.init:
[smoker]
[smoker] compile-lucene-core:
[smoker]
[smoker] -check-git-state:
[smoker]
[smoker] -git-cleanroot:
[smoker]
[smoker] -copy-git-state:
[smoker]
[smoker] git-autoclean:
[smoker]
[smoker] ivy-availability-check:
[smoker]
[smoker] ivy-fail:
[smoker]
[smoker] ivy-configure:
[smoker] [ivy:configure] :: loading settings :: file = /x1/jenkins/jenkins-slave/workspace/Lucene-Solr-SmokeRelease-master/lucene/build/smokeTestRelease/tmp/unpack/solr-7.0.0/lucene/ivy-settings.xml
[smoker]
[smoker] resolve:
[smoker]
[smoker] init:
[smoker]
[smoker] -clover.disable:
[smoker]
[smoker] -clover.load:
[smoker]
[smoker] -clover.classpath:
[smoker]
[smoker] -clover.setup:
[smoker]
[smoker] clover:
[smoker]
[smoker] compile-core:
[smoker]
[smoker] init:
[smoker]
[smoker] -clover.disable:
[smoker]
[smoker] -clover.load:
[smoker]
[smoker] -clover.classpath:
[smoker]
[smoker] -clover.setup:
[smoker]
[smoker] clover:
[smoker]
[smoker] common.compile-core:
[smoker]
[smoker] compile-core:
[smoker]
[smoker] check-lucene-core-uptodate:
[smoker]
[smoker] jar-lucene-core:
[smoker]
[smoker] check-backward-codecs-uptodate:
[smoker]
[smoker] jar-backward-codecs:
[smoker]
[smoker] check-analyzers-phonetic-uptodate:
[smoker]
[smoker] jar-analyzers-phonetic:
[smoker]
[smoker] check-analyzers-kuromoji-uptodate:
[smoker]
[smoker] jar-analyzers-kuromoji:
[smoker]
[smoker] check-codecs-uptodate:
[smoker]
[smoker] jar-codecs:
[smoker]
[smoker] check-expressions-uptodate:
[smoker]
[smoker] jar-expressions:
[smoker]
[smoker] check-suggest-uptodate:
[smoker]
[smoker] jar-suggest:
[smoker]
[smoker] check-highlighter-uptodate:
[smoker]
[smoker] jar-highlighter:
[smoker]
[smoker] check-memory-uptodate:
[smoker]
[smoker] jar-memory:
[smoker]
[smoker] check-misc-uptodate:
[smoker]
[smoker] jar-misc:
[smoker]
[smoker] check-spatial-extras-uptodate:
[smoker]
[smoker] jar-spatial-extras:
[smoker]
[smoker] check-grouping-uptodate:
[smoker]
[smoker] jar-grouping:
[smoker]
[smoker] check-queries-uptodate:
[smoker]
[smoker] jar-queries:
[smoker]
[smoker] check-queryparser-uptodate:
[smoker]
[smoker] jar-queryparser:
[smoker]
[smoker] check-join-uptodate:
[smoker]
[smoker] jar-join:
[smoker]
[smoker] check-sandbox-uptodate:
[smoker]
[smoker] jar-sandbox:
[smoker]
[smoker] check-classification-uptodate:
[smoker]
[smoker] jar-classification:
[smoker]
[smoker] prep-lucene-jars:
[smoker]
[smoker] resolve-example:
[smoker]
[smoker] ivy-availability-check:
[smoker]
[smoker] ivy-fail:
[smoker]
[smoker] ivy-configure:
[smoker] [ivy:configure] :: loading settings :: file = /x1/jenkins/jenkins-slave/workspace/Lucene-Solr-SmokeRelease-master/lucene/build/smokeTestRelease/tmp/unpack/solr-7.0.0/lucene/ivy-settings.xml
[smoker]
[smoker] resolve:
[smoker]
[smoker] resolve-server:
[smoker]
[smoker] ivy-availability-check:
[smoker]
[smoker] ivy-fail:
[smoker]
[smoker] ivy-fail:
[smoker]
[smoker] ivy-configure:
[smoker] [ivy:configure] :: loading settings :: file = /x1/jenkins/jenkins-slave/workspace/Lucene-Solr-SmokeRelease-master/lucene/build/smokeTestRelease/tmp/unpack/solr-7.0.0/lucene/ivy-settings.xml
[smoker]
[smoker] resolve:
[smoker]
[smoker] -check-git-state:
[smoker]
[smoker] -git-cleanroot:
[smoker]
[smoker] -copy-git-state:
[smoker]
[smoker] git-autoclean:
[smoker]
[smoker] ivy-availability-check:
[smoker]
[smoker] ivy-fail:
[smoker]
[smoker] ivy-fail:
[smoker]
[smoker] ivy-configure:
[smoker] [ivy:configure] :: loading settings :: file = /x1/jenkins/jenkins-slave/workspace/Lucene-Solr-SmokeRelease-master/lucene/build/smokeTestRelease/tmp/unpack/solr-7.0.0/lucene/ivy-settings.xml
[smoker]
[smoker] resolve:
[smoker]
[smoker] common.init:
[smoker]
[smoker] compile-lucene-core:
[smoker]
[smoker] -check-git-state:
[smoker]
[smoker] -git-cleanroot:
[smoker]
[smoker] -copy-git-state:
[smoker]
[smoker] git-autoclean:
[smoker]
[smoker] ivy-availability-check:
[smoker]
[smoker] ivy-fail:
[smoker]
[smoker] ivy-configure:
[smoker] [ivy:configure] :: loading settings :: file = /x1/jenkins/jenkins-slave/workspace/Lucene-Solr-SmokeRelease-master/lucene/build/smokeTestRelease/tmp/unpack/solr-7.0.0/lucene/ivy-settings.xml
[smoker]
[smoker] resolve:
[smoker]
[smoker] init:
[smoker]
[smoker] -clover.disable:
[smoker]
[smoker] -clover.load:
[smoker]
[smoker] -clover.classpath:
[smoker]
[smoker] -clover.setup:
[smoker]
[smoker] clover:
[smoker]
[smoker] compile-core:
[smoker]
[smoker] init:
[smoker]
[smoker] -clover.disable:
[smoker]
[smoker] -clover.load:
[smoker]
[smoker] -clover.classpath:
[smoker]
[smoker] -clover.setup:
[smoker]
[smoker] clover:
[smoker]
[smoker] common.compile-core:
[smoker]
[smoker] common-solr.compile-core:
[smoker]
[smoker] compile-core:
[smoker]
[smoker] compile-test-framework:
[smoker]
[smoker] compile-test-framework:
[smoker]
[smoker] -check-git-state:
[smoker]
[smoker] -git-cleanroot:
[smoker]
[smoker] -copy-git-state:
[smoker]
[smoker] git-autoclean:
[smoker]
[smoker] ivy-availability-check:
[smoker]
[smoker] ivy-fail:
[smoker]
[smoker] ivy-configure:
[smoker] [ivy:configure] :: loading settings :: file = /x1/jenkins/jenkins-slave/workspace/Lucene-Solr-SmokeRelease-master/lucene/build/smokeTestRelease/tmp/unpack/solr-7.0.0/lucene/ivy-settings.xml
[smoker]
[smoker] resolve:
[smoker]
[smoker] init:
[smoker]
[smoker] compile-lucene-core:
[smoker]
[smoker] -check-git-state:
[smoker]
[smoker] -git-cleanroot:
[smoker]
[smoker] -copy-git-state:
[smoker]
[smoker] git-autoclean:
[smoker]
[smoker] ivy-availability-check:
[smoker]
[smoker] ivy-fail:
[smoker]
[smoker] ivy-configure:
[smoker] [ivy:configure] :: loading settings :: file = /x1/jenkins/jenkins-slave/workspace/Lucene-Solr-SmokeRelease-master/lucene/build/smokeTestRelease/tmp/unpack/solr-7.0.0/lucene/ivy-settings.xml
[smoker]
[smoker] resolve:
[smoker]
[smoker] init:
[smoker]
[smoker] -clover.disable:
[smoker]
[smoker] -clover.load:
[smoker]
[smoker] -clover.classpath:
[smoker]
[smoker] -clover.setup:
[smoker]
[smoker] clover:
[smoker]
[smoker] compile-core:
[smoker]
[smoker] compile-codecs:
[smoker]
[smoker] -check-git-state:
[smoker]
[smoker] -git-cleanroot:
[smoker]
[smoker] -copy-git-state:
[smoker]
[smoker] git-autoclean:
[smoker]
[smoker] ivy-availability-check:
[smoker]
[smoker] ivy-fail:
[smoker]
[smoker] ivy-configure:
[smoker] [ivy:configure] :: loading settings :: file = /x1/jenkins/jenkins-slave/workspace/Lucene-Solr-SmokeRelease-master/lucene/build/smokeTestRelease/tmp/unpack/solr-7.0.0/lucene/ivy-settings.xml
[smoker]
[smoker] resolve:
[smoker]
[smoker] common.init:
[smoker]
[smoker] compile-lucene-core:
[smoker]
[smoker] init:
[smoker]
[smoker] -clover.disable:
[smoker]
[smoker] -clover.load:
[smoker]
[smoker] -clover.classpath:
[smoker]
[smoker] -clover.setup:
[smoker]
[smoker] clover:
[smoker]
[smoker] compile-core:
[smoker]
[smoker] -clover.disable:
[smoker]
[smoker] -clover.load:
[smoker]
[smoker] -clover.classpath:
[smoker]
[smoker] -clover.setup:
[smoker]
[smoker] clover:
[smoker]
[smoker] common.compile-core:
[smoker]
[smoker] compile-core:
[smoker]
[smoker] compile-core:
[smoker] [mkdir] Created dir: /x1/jenkins/jenkins-slave/workspace/Lucene-Solr-SmokeRelease-master/lucene/build/smokeTestRelease/tmp/unpack/solr-7.0.0/solr/build/solr-test-framework/classes/java
[smoker] [javac] Compiling 47 source files to /x1/jenkins/jenkins-slave/workspace/Lucene-Solr-SmokeRelease-master/lucene/build/smokeTestRelease/tmp/unpack/solr-7.0.0/solr/build/solr-test-framework/classes/java
[smoker] [javac] Note: Some input files use or override a deprecated API.
[smoker] [javac] Note: Recompile with -Xlint:deprecation for details.
[smoker] [javac] Note: Some input files use unchecked or unsafe operations.
[smoker] [javac] Note: Recompile with -Xlint:unchecked for details.
[smoker]
[smoker] compile-solrj:
[smoker]
[smoker] check-lucene-core-uptodate:
[smoker]
[smoker] jar-lucene-core:
[smoker]
[smoker] check-backward-codecs-uptodate:
[smoker]
[smoker] jar-backward-codecs:
[smoker]
[smoker] check-analyzers-phonetic-uptodate:
[smoker]
[smoker] jar-analyzers-phonetic:
[smoker]
[smoker] check-analyzers-kuromoji-uptodate:
[smoker]
[smoker] jar-analyzers-kuromoji:
[smoker]
[smoker] check-codecs-uptodate:
[smoker]
[smoker] jar-codecs:
[smoker]
[smoker] check-expressions-uptodate:
[smoker]
[smoker] jar-expressions:
[smoker]
[smoker] check-suggest-uptodate:
[smoker]
[smoker] jar-suggest:
[smoker]
[smoker] check-highlighter-uptodate:
[smoker]
[smoker] jar-highlighter:
[smoker]
[smoker] check-memory-uptodate:
[smoker]
[smoker] jar-memory:
[smoker]
[smoker] check-misc-uptodate:
[smoker]
[smoker] jar-misc:
[smoker]
[smoker] check-spatial-extras-uptodate:
[smoker]
[smoker] jar-spatial-extras:
[smoker]
[smoker] check-grouping-uptodate:
[smoker]
[smoker] jar-grouping:
[smoker]
[smoker] check-queries-uptodate:
[smoker]
[smoker] jar-queries:
[smoker]
[smoker] check-queryparser-uptodate:
[smoker]
[smoker] jar-queryparser:
[smoker]
[smoker] check-join-uptodate:
[smoker]
[smoker] jar-join:
[smoker]
[smoker] check-sandbox-uptodate:
[smoker]
[smoker] jar-sandbox:
[smoker]
[smoker] check-classification-uptodate:
[smoker]
[smoker] jar-classification:
[smoker]
[smoker] prep-lucene-jars:
[smoker]
[smoker] resolve-example:
[smoker]
[smoker] ivy-availability-check:
[smoker]
[smoker] ivy-fail:
[smoker]
[smoker] ivy-configure:
[smoker] [ivy:configure] :: loading settings :: file = /x1/jenkins/jenkins-slave/workspace/Lucene-Solr-SmokeRelease-master/lucene/build/smokeTestRelease/tmp/unpack/solr-7.0.0/lucene/ivy-settings.xml
[smoker]
[smoker] resolve:
[smoker]
[smoker] resolve-server:
[smoker]
[smoker] ivy-availability-check:
[smoker]
[smoker] ivy-fail:
[smoker]
[smoker] ivy-fail:
[smoker]
[smoker] ivy-configure:
[smoker] [ivy:configure] :: loading settings :: file = /x1/jenkins/jenkins-slave/workspace/Lucene-Solr-SmokeRelease-master/lucene/build/smokeTestRelease/tmp/unpack/solr-7.0.0/lucene/ivy-settings.xml
[smoker]
[smoker] resolve:
[smoker]
[smoker] -check-git-state:
[smoker]
[smoker] -git-cleanroot:
[smoker]
[smoker] -copy-git-state:
[smoker]
[smoker] git-autoclean:
[smoker]
[smoker] ivy-availability-check:
[smoker]
[smoker] ivy-fail:
[smoker]
[smoker] ivy-fail:
[smoker]
[smoker] ivy-configure:
[smoker] [ivy:configure] :: loading settings :: file = /x1/jenkins/jenkins-slave/workspace/Lucene-Solr-SmokeRelease-master/lucene/build/smokeTestRelease/tmp/unpack/solr-7.0.0/lucene/ivy-settings.xml
[smoker]
[smoker] resolve:
[smoker]
[smoker] common.init:
[smoker]
[smoker] compile-lucene-core:
[smoker]
[smoker] -check-git-state:
[smoker]
[smoker] -git-cleanroot:
[smoker]
[smoker] -copy-git-state:
[smoker]
[smoker] git-autoclean:
[smoker]
[smoker] ivy-availability-check:
[smoker]
[smoker] ivy-fail:
[smoker]
[smoker] ivy-configure:
[smoker] [ivy:configure] :: loading settings :: file = /x1/jenkins/jenkins-slave/workspace/Lucene-Solr-SmokeRelease-master/lucene/build/smokeTestRelease/tmp/unpack/solr-7.0.0/lucene/ivy-settings.xml
[smoker]
[smoker] resolve:
[smoker]
[smoker] init:
[smoker]
[smoker] -clover.disable:
[smoker]
[smoker] -clover.load:
[smoker]
[smoker] -clover.classpath:
[smoker]
[smoker] -clover.setup:
[smoker]
[smoker] clover:
[smoker]
[smoker] compile-core:
[smoker]
[smoker] init:
[smoker]
[smoker] -clover.disable:
[smoker]
[smoker] -clover.load:
[smoker]
[smoker] -clover.classpath:
[smoker]
[smoker] -clover.setup:
[smoker]
[smoker] clover:
[smoker]
[smoker] common.compile-core:
[smoker]
[smoker] compile-core:
[smoker]
[smoker] check-lucene-core-uptodate:
[smoker]
[smoker] jar-lucene-core:
[smoker]
[smoker] check-backward-codecs-uptodate:
[smoker]
[smoker] jar-backward-codecs:
[smoker]
[smoker] check-analyzers-phonetic-uptodate:
[smoker]
[smoker] jar-analyzers-phonetic:
[smoker]
[smoker] check-analyzers-kuromoji-uptodate:
[smoker]
[smoker] jar-analyzers-kuromoji:
[smoker]
[smoker] check-codecs-uptodate:
[smoker]
[smoker] jar-codecs:
[smoker]
[smoker] check-expressions-uptodate:
[smoker]
[smoker] jar-expressions:
[smoker]
[smoker] check-suggest-uptodate:
[smoker]
[smoker] jar-suggest:
[smoker]
[smoker] check-highlighter-uptodate:
[smoker]
[smoker] jar-highlighter:
[smoker]
[smoker] check-memory-uptodate:
[smoker]
[smoker] jar-memory:
[smoker]
[smoker] check-misc-uptodate:
[smoker]
[smoker] jar-misc:
[smoker]
[smoker] check-spatial-extras-uptodate:
[smoker]
[smoker] jar-spatial-extras:
[smoker]
[smoker] check-grouping-uptodate:
[smoker]
[smoker] jar-grouping:
[smoker]
[smoker] check-queries-uptodate:
[smoker]
[smoker] jar-queries:
[smoker]
[smoker] check-queryparser-uptodate:
[smoker]
[smoker] jar-queryparser:
[smoker]
[smoker] check-join-uptodate:
[smoker]
[smoker] jar-join:
[smoker]
[smoker] check-sandbox-uptodate:
[smoker]
[smoker] jar-sandbox:
[smoker]
[smoker] check-classification-uptodate:
[smoker]
[smoker] jar-classification:
[smoker]
[smoker] prep-lucene-jars:
[smoker]
[smoker] resolve-example:
[smoker]
[smoker] ivy-availability-check:
[smoker]
[smoker] ivy-fail:
[smoker]
[smoker] ivy-configure:
[smoker] [ivy:configure] :: loading settings :: file = /x1/jenkins/jenkins-slave/workspace/Lucene-Solr-SmokeRelease-master/lucene/build/smokeTestRelease/tmp/unpack/solr-7.0.0/lucene/ivy-settings.xml
[smoker]
[smoker] resolve:
[smoker]
[smoker] resolve-server:
[smoker]
[smoker] ivy-availability-check:
[smoker]
[smoker] ivy-fail:
[smoker]
[smoker] ivy-fail:
[smoker]
[smoker] ivy-configure:
[smoker] [ivy:configure] :: loading settings :: file = /x1/jenkins/jenkins-slave/workspace/Lucene-Solr-SmokeRelease-master/lucene/build/smokeTestRelease/tmp/unpack/solr-7.0.0/lucene/ivy-settings.xml
[smoker]
[smoker] resolve:
[smoker]
[smoker] -check-git-state:
[smoker]
[smoker] -git-cleanroot:
[smoker]
[smoker] -copy-git-state:
[smoker]
[smoker] git-autoclean:
[smoker]
[smoker] ivy-fail:
[smoker]
[smoker] resolve:
[smoker]
[smoker] common.init:
[smoker]
[smoker] compile-lucene-core:
[smoker]
[smoker] -check-git-state:
[smoker]
[smoker] -git-cleanroot:
[smoker]
[smoker] -copy-git-state:
[smoker]
[smoker] git-autoclean:
[smoker]
[smoker] ivy-availability-check:
[smoker]
[smoker] ivy-fail:
[smoker]
[smoker] ivy-configure:
[smoker] [ivy:configure] :: loading settings :: file = /x1/jenkins/jenkins-slave/workspace/Lucene-Solr-SmokeRelease-master/lucene/build/smokeTestRelease/tmp/unpack/solr-7.0.0/lucene/ivy-settings.xml
[smoker]
[smoker] resolve:
[smoker]
[smoker] init:
[smoker]
[smoker] -clover.disable:
[smoker]
[smoker] -clover.load:
[smoker]
[smoker] -clover.classpath:
[smoker]
[smoker] -clover.setup:
[smoker]
[smoker] clover:
[smoker]
[smoker] compile-core:
[smoker]
[smoker] init:
[smoker]
[smoker] common.compile-core:
[smoker]
[smoker] common-solr.compile-core:
[smoker]
[smoker] compile-core:
[smoker]
[smoker] compile-test-framework:
[smoker]
[smoker] -check-git-state:
[smoker]
[smoker] -git-cleanroot:
[smoker]
[smoker] -copy-git-state:
[smoker]
[smoker] git-autoclean:
[smoker]
[smoker] ivy-availability-check:
[smoker]
[smoker] ivy-fail:
[smoker]
[smoker] ivy-configure:
[smoker] [ivy:configure] :: loading settings :: file = /x1/jenkins/jenkins-slave/workspace/Lucene-Solr-SmokeRelease-master/lucene/build/smokeTestRelease/tmp/unpack/solr-7.0.0/lucene/ivy-settings.xml
[smoker]
[smoker] resolve:
[smoker]
[smoker] init:
[smoker]
[smoker] compile-lucene-core:
[smoker]
[smoker] compile-codecs:
[smoker]
[smoker] -check-git-state:
[smoker]
[smoker] -git-cleanroot:
[smoker]
[smoker] -copy-git-state:
[smoker]
[smoker] git-autoclean:
[smoker]
[smoker] ivy-availability-check:
[smoker]
[smoker] ivy-fail:
[smoker]
[smoker] ivy-configure:
[smoker] [ivy:configure] :: loading settings :: file = /x1/jenkins/jenkins-slave/workspace/Lucene-Solr-SmokeRelease-master/lucene/build/smokeTestRelease/tmp/unpack/solr-7.0.0/lucene/ivy-settings.xml
[smoker]
[smoker] resolve:
[smoker]
[smoker] common.init:
[smoker]
[smoker] compile-lucene-core:
[smoker]
[smoker] init:
[smoker]
[smoker] -clover.disable:
[smoker]
[smoker] -clover.load:
[smoker]
[smoker] -clover.classpath:
[smoker]
[smoker] -clover.setup:
[smoker]
[smoker] clover:
[smoker]
[smoker] compile-core:
[smoker]
[smoker] -clover.disable:
[smoker]
[smoker] -clover.load:
[smoker]
[smoker] -clover.classpath:
[smoker]
[smoker] -clover.setup:
[smoker]
[smoker] clover:
[smoker]
[smoker] common.compile-core:
[smoker]
[smoker] compile-core:
[smoker]
[smoker] common.compile-test:
[smoker] [mkdir] Created dir: /x1/jenkins/jenkins-slave/workspace/Lucene-Solr-SmokeRelease-master/lucene/build/smokeTestRelease/tmp/unpack/solr-7.0.0/solr/build/solr-core/classes/test
[smoker] [javac] Compiling 645 source files to /x1/jenkins/jenkins-slave/workspace/Lucene-Solr-SmokeRelease-master/lucene/build/smokeTestRelease/tmp/unpack/solr-7.0.0/solr/build/solr-core/classes/test
[smoker] [javac] Note: Some input files use or override a deprecated API.
[smoker] [javac] Note: Recompile with -Xlint:deprecation for details.
[smoker] [javac] Note: Some input files use unchecked or unsafe operations.
[smoker] [javac] Note: Recompile with -Xlint:unchecked for details.
[smoker] [copy] Copying 1 file to /x1/jenkins/jenkins-slave/workspace/Lucene-Solr-SmokeRelease-master/lucene/build/smokeTestRelease/tmp/unpack/solr-7.0.0/solr/build/solr-core/classes/test
[smoker]
[smoker] common-solr.compile-test:
[smoker]
[smoker] compile-test:
[smoker]
[smoker] install-junit4-taskdef:
[smoker]
[smoker] compile-tools:
[smoker]
[smoker] -check-git-state:
[smoker]
[smoker] -git-cleanroot:
[smoker]
[smoker] -copy-git-state:
[smoker]
[smoker] git-autoclean:
[smoker]
[smoker] ivy-availability-check:
[smoker]
[smoker] ivy-fail:
[smoker]
[smoker] ivy-configure:
[smoker] [ivy:configure] :: loading settings :: file = /x1/jenkins/jenkins-slave/workspace/Lucene-Solr-SmokeRelease-master/lucene/build/smokeTestRelease/tmp/unpack/solr-7.0.0/lucene/ivy-settings.xml
[smoker]
[smoker] resolve:
[smoker]
[smoker] init:
[smoker]
[smoker] compile-core:
[smoker]
[smoker] validate:
[smoker]
[smoker] resolve-groovy:
[smoker]
[smoker] -init-totals:
[smoker]
[smoker] -test:
[smoker] [mkdir] Created dir: /x1/jenkins/jenkins-slave/workspace/Lucene-Solr-SmokeRelease-master/lucene/build/smokeTestRelease/tmp/unpack/solr-7.0.0/solr/build/solr-core/test
[smoker] [loadresource] Do not set property tests.explicitclass as its length is 0.
[smoker] [mkdir] Created dir: /x1/jenkins/jenkins-slave/workspace/Lucene-Solr-SmokeRelease-master/lucene/build/smokeTestRelease/tmp/unpack/solr-7.0.0/solr/build/solr-core/test/temp
[smoker] [mkdir] Created dir: /x1/jenkins/jenkins-slave/workspace/Lucene-Solr-SmokeRelease-master/lucene/build/smokeTestRelease/tmp/unpack/solr-7.0.0/.caches/test-stats/solr-core
[smoker] [junit4] <JUnit4> says olá! Master seed: E0932F15A334AD66
[smoker] [junit4] Executing 593 suites with 3 JVMs.
[smoker] [junit4]
[smoker] [junit4] Started J1 PID(25737@lucene1-us-west).
[smoker] [junit4] Started J2 PID(25734@lucene1-us-west).
[smoker] [junit4] Started J0 PID(25733@lucene1-us-west).
[smoker] [junit4] Suite: org.apache.solr.search.TestQueryTypes
[smoker] [junit4] Completed [1/593] on J1 in 9.39s, 1 test
[smoker] [junit4]
[smoker] [junit4] Suite: org.apache.solr.search.SortSpecParsingTest
[smoker] [junit4] Completed [2/593] on J0 in 8.76s, 2 tests
[smoker] [junit4]
[smoker] [junit4] Suite: org.apache.solr.update.processor.TolerantUpdateProcessorTest
[smoker] [junit4] Completed [3/593] on J2 in 9.56s, 11 tests
[smoker] [junit4]
[smoker] [junit4] Suite: org.apache.solr.handler.component.TestPivotHelperCode
[smoker] [junit4] Completed [4/593] on J2 in 0.35s, 3 tests
[smoker] [junit4]
[smoker] [junit4] Suite: org.apache.solr.update.processor.IgnoreCommitOptimizeUpdateProcessorFactoryTest
[smoker] [junit4] Completed [5/593] on J1 in 2.56s, 1 test
[smoker] [junit4]
[smoker] [junit4] Suite: org.apache.solr.update.DirectUpdateHandlerOptimizeTest
[smoker] [junit4] Completed [6/593] on J2 in 2.41s, 1 test
[smoker] [junit4]
[smoker] [junit4] Suite: org.apache.solr.schema.DateRangeFieldTest
[smoker] [junit4] Completed [7/593] on J2 in 1.47s, 2 tests
[smoker] [junit4]
[smoker] [junit4] Suite: org.apache.solr.cloud.TestCryptoKeys
[smoker] [junit4] IGNOR/A 0.00s J2 | TestCryptoKeys.test
[smoker] [junit4] > Assumption #1: 'slow' test group is disabled (@Slow())
[smoker] [junit4] Completed [8/593] on J2 in 0.02s, 1 test, 1 skipped
[smoker] [junit4]
[smoker] [junit4] Suite: org.apache.solr.response.TestPHPSerializedResponseWriter
[smoker] [junit4] Completed [9/593] on J2 in 0.73s, 2 tests
[smoker] [junit4]
[smoker] [junit4] Suite: org.apache.solr.cloud.OutOfBoxZkACLAndCredentialsProvidersTest
[smoker] [junit4] Completed [10/593] on J1 in 3.19s, 2 tests
[smoker] [junit4]
[smoker] [junit4] Suite: org.apache.solr.cloud.CollectionsAPIAsyncDistributedZkTest
[smoker] [junit4] IGNOR/A 0.01s J1 | CollectionsAPIAsyncDistributedZkTest.testAsyncRequests
[smoker] [junit4] > Assumption #1: 'slow' test group is disabled (@Slow())
[smoker] [junit4] IGNOR/A 0.00s J1 | CollectionsAPIAsyncDistributedZkTest.testSolrJAPICalls
[smoker] [junit4] > Assumption #1: 'slow' test group is disabled (@Slow())
[smoker] [junit4] Completed [11/593] on J1 in 0.02s, 2 tests, 2 skipped
[smoker] [junit4]
[smoker] [junit4] Suite: org.apache.solr.update.SolrIndexConfigTest
[smoker] [junit4] Completed [12/593] on J1 in 1.58s, 5 tests
[smoker] [junit4]
[smoker] [junit4] Suite: org.apache.solr.search.similarities.TestBM25SimilarityFactory
[smoker] [junit4] Completed [13/593] on J1 in 0.18s, 2 tests
[smoker] [junit4]
[smoker] [junit4] Suite: org.apache.solr.update.PeerSyncTest
[smoker] [junit4] Completed [14/593] on J0 in 7.68s, 1 test
[smoker] [junit4]
[smoker] [junit4] Suite: org.apache.solr.cloud.MultiThreadedOCPTest
[smoker] [junit4] IGNOR/A 0.01s J0 | MultiThreadedOCPTest.test
[smoker] [junit4] > Assumption #1: 'slow' test group is disabled (@Slow())
[smoker] [junit4] Completed [15/593] on J0 in 0.02s, 1 test, 1 skipped
[smoker] [junit4]
[smoker] [junit4] Suite: org.apache.solr.cloud.CollectionTooManyReplicasTest
[smoker] [junit4] IGNOR/A 0.00s J0 | CollectionTooManyReplicasTest.testDownedShards
[smoker] [junit4] > Assumption #1: 'slow' test group is disabled (@Slow())
[smoker] [junit4] IGNOR/A 0.00s J0 | CollectionTooManyReplicasTest.testAddTooManyReplicas
[smoker] [junit4] > Assumption #1: 'slow' test group is disabled (@Slow())
[smoker] [junit4] IGNOR/A 0.00s J0 | CollectionTooManyReplicasTest.testAddShard
[smoker] [junit4] > Assumption #1: 'slow' test group is disabled (@Slow())
[smoker] [junit4] Completed [16/593] on J0 in 0.00s, 3 tests, 3 skipped
[smoker] [junit4]
[smoker] [junit4] Suite: org.apache.solr.schema.ChangedSchemaMergeTest
[smoker] [junit4] Completed [17/593] on J1 in 0.75s, 2 tests
[smoker] [junit4]
[smoker] [junit4] Suite: org.apache.solr.core.TestImplicitCoreProperties
[smoker] [junit4] Completed [18/593] on J1 in 0.51s, 3 tests
[smoker] [junit4]
[smoker] [junit4] Suite: org.apache.solr.spelling.suggest.TestBlendedInfixSuggestions
[smoker] [junit4] Completed [19/593] on J0 in 1.62s, 6 tests
[smoker] [junit4]
[smoker] [junit4] Suite: org.apache.solr.update.processor.ClassificationUpdateProcessorFactoryTest
[smoker] [junit4] Completed [20/593] on J1 in 0.72s, 5 tests
[smoker] [junit4]
[smoker] [junit4] Suite: org.apache.solr.cloud.overseer.ZkStateReaderTest
[smoker] [junit4] Completed [21/593] on J2 in 4.48s, 6 tests
[smoker] [junit4]
[smoker] [junit4] Suite: org.apache.solr.core.RequestHandlersTest
[smoker] [junit4] Completed [22/593] on J2 in 1.89s, 5 tests
[smoker] [junit4]
[smoker] [junit4] Suite: org.apache.solr.search.TestSolr4Spatial
[smoker] [junit4] IGNOR/A 0.01s J0 | TestSolr4Spatial.testSortMultiVal {p0=bbox}
[smoker] [junit4] > Assumption #1: Multivalue not supported for this field
[smoker] [junit4] IGNOR/A 0.10s J0 | TestSolr4Spatial.testSortMultiVal {p0=pointvector}
[smoker] [junit4] > Assumption #1: Multivalue not supported for this field
[smoker] [junit4] Completed [23/593] on J0 in 7.48s, 54 tests, 2 skipped
[smoker] [junit4]
[smoker] [junit4] Suite: org.apache.solr.schema.BadCopyFieldTest
[smoker] [junit4] Completed [24/593] on J0 in 0.33s, 5 tests
[smoker]
[...truncated too long message...]
[smoker] [junit4] > Assumption #1: 'nightly' test group is disabled (@Nightly())
[smoker] [junit4] IGNOR/A 0.00s J2 | CdcrUpdateLogTest.testRemoveOldLogs
[smoker] [junit4] > Assumption #1: 'nightly' test group is disabled (@Nightly())
[smoker] [junit4] IGNOR/A 0.01s J2 | CdcrUpdateLogTest.testLogReaderNextOnNewTLog
[smoker] [junit4] > Assumption #1: 'nightly' test group is disabled (@Nightly())
[smoker] [junit4] IGNOR/A 0.00s J2 | CdcrUpdateLogTest.testRemoveOldLogsMultiplePointers
[smoker] [junit4] > Assumption #1: 'nightly' test group is disabled (@Nightly())
[smoker] [junit4] IGNOR/A 0.00s J2 | CdcrUpdateLogTest.testLogReaderSeek
[smoker] [junit4] > Assumption #1: 'nightly' test group is disabled (@Nightly())
[smoker] [junit4] IGNOR/A 0.00s J2 | CdcrUpdateLogTest.testLogReaderNext
[smoker] [junit4] > Assumption #1: 'nightly' test group is disabled (@Nightly())
[smoker] [junit4] IGNOR/A 0.00s J2 | CdcrUpdateLogTest.testClosingOutputStreamAfterLogReplay
[smoker] [junit4] > Assumption #1: 'nightly' test group is disabled (@Nightly())
[smoker] [junit4] IGNOR/A 0.00s J2 | CdcrUpdateLogTest.testLogReaderInitOnNewTlog
[smoker] [junit4] > Assumption #1: 'nightly' test group is disabled (@Nightly())
[smoker] [junit4] IGNOR/A 0.00s J2 | CdcrUpdateLogTest.testGetNumberOfRemainingRecords
[smoker] [junit4] > Assumption #1: 'nightly' test group is disabled (@Nightly())
[smoker] [junit4] Completed [576/593 (1!)] on J2 in 0.02s, 12 tests, 12 skipped
[smoker] [junit4]
[smoker] [junit4] Suite: org.apache.solr.update.TestExceedMaxTermLength
[smoker] [junit4] Completed [577/593 (1!)] on J2 in 0.70s, 2 tests
[smoker] [junit4]
[smoker] [junit4] Suite: org.apache.solr.update.TestDocBasedVersionConstraints
[smoker] [junit4] Completed [578/593 (1!)] on J1 in 2.65s, 6 tests
[smoker] [junit4]
[smoker] [junit4] Suite: org.apache.solr.search.stats.TestExactStatsCache
[smoker] [junit4] Completed [579/593 (1!)] on J0 in 11.58s, 1 test
[smoker] [junit4]
[smoker] [junit4] Suite: org.apache.solr.update.processor.TestNamedUpdateProcessors
[smoker] [junit4] IGNOR/A 0.00s J0 | TestNamedUpdateProcessors.test
[smoker] [junit4] > Assumption #1: 'slow' test group is disabled (@Slow())
[smoker] [junit4] Completed [580/593 (1!)] on J0 in 0.00s, 1 test, 1 skipped
[smoker] [junit4]
[smoker] [junit4] Suite: org.apache.solr.update.processor.UUIDUpdateProcessorFallbackTest
[smoker] [junit4] Completed [581/593 (1!)] on J0 in 0.28s, 1 test
[smoker] [junit4]
[smoker] [junit4] Suite: org.apache.solr.util.TestObjectReleaseTracker
[smoker] [junit4] Completed [582/593 (1!)] on J0 in 0.04s, 1 test
[smoker] [junit4]
[smoker] [junit4] Suite: org.apache.solr.util.TestRTimerTree
[smoker] [junit4] Completed [583/593 (1!)] on J0 in 0.03s, 1 test
[smoker] [junit4]
[smoker] [junit4] Suite: org.apache.solr.util.TestSolrCLIRunExample
[smoker] [junit4] IGNOR/A 0.00s J0 | TestSolrCLIRunExample.testSchemalessExample
[smoker] [junit4] > Assumption #1: 'slow' test group is disabled (@Slow())
[smoker] [junit4] IGNOR/A 0.00s J0 | TestSolrCLIRunExample.testInteractiveSolrCloudExample
[smoker] [junit4] > Assumption #1: 'slow' test group is disabled (@Slow())
[smoker] [junit4] Completed [584/593 (1!)] on J0 in 0.02s, 3 tests, 3 skipped
[smoker] [junit4]
[smoker] [junit4] Suite: org.apache.solr.util.TestTestInjection
[smoker] [junit4] Completed [585/593 (1!)] on J0 in 0.02s, 3 tests
[smoker] [junit4]
[smoker] [junit4] Suite: org.apache.solr.util.hll.BigEndianAscendingWordDeserializerTest
[smoker] [junit4] Completed [586/593 (1!)] on J0 in 1.08s, 4 tests
[smoker] [junit4]
[smoker] [junit4] Suite: org.apache.solr.util.hll.BigEndianAscendingWordSerializerTest
[smoker] [junit4] Completed [587/593 (1!)] on J0 in 0.01s, 5 tests
[smoker] [junit4]
[smoker] [junit4] Suite: org.apache.solr.util.hll.BitVectorTest
[smoker] [junit4] Completed [588/593 (1!)] on J0 in 0.01s, 4 tests
[smoker] [junit4]
[smoker] [junit4] Suite: org.apache.solr.util.hll.ExplicitHLLTest
[smoker] [junit4] Completed [589/593 (1!)] on J0 in 0.04s, 6 tests
[smoker] [junit4]
[smoker] [junit4] Suite: org.apache.solr.util.hll.FullHLLTest
[smoker] [junit4] Completed [590/593 (1!)] on J0 in 0.02s, 6 tests
[smoker] [junit4]
[smoker] [junit4] Suite: org.apache.solr.util.hll.HLLSerializationTest
[smoker] [junit4] IGNOR/A 0.00s J0 | HLLSerializationTest.manyValuesMonsterHLLSerializationTest
[smoker] [junit4] > Assumption #1: 'slow' test group is disabled (@Slow())
[smoker] [junit4] IGNOR/A 0.00s J0 | HLLSerializationTest.manyValuesHLLSerializationTest
[smoker] [junit4] > Assumption #1: 'slow' test group is disabled (@Slow())
[smoker] [junit4] IGNOR/A 0.00s J0 | HLLSerializationTest.monsterHLLSerializationTest
[smoker] [junit4] > Assumption #1: 'slow' test group is disabled (@Slow())
[smoker] [junit4] IGNOR/A 0.00s J0 | HLLSerializationTest.serializationSmokeTest
[smoker] [junit4] > Assumption #1: 'nightly' test group is disabled (@Nightly())
[smoker] [junit4] Completed [591/593 (1!)] on J0 in 0.00s, 4 tests, 4 skipped
[smoker] [junit4]
[smoker] [junit4] Suite: org.apache.solr.update.processor.DocExpirationUpdateProcessorFactoryTest
[smoker] [junit4] Completed [592/593 (1!)] on J1 in 9.30s, 5 tests
[smoker] [junit4]
[smoker] [junit4] Suite: org.apache.solr.update.TestHdfsUpdateLog
[smoker] [junit4] Completed [593/593 (1!)] on J2 in 20.66s, 1 test
[smoker] [junit4]
[smoker] [junit4]
[smoker] [junit4] Tests with failures [seed: E0932F15A334AD66]:
[smoker] [junit4] - org.apache.solr.cloud.TestCloudBackupRestore.test
[smoker] [junit4]
[smoker] [junit4]
[smoker] [junit4] JVM J0: 0.65 .. 530.15 = 529.50s
[smoker] [junit4] JVM J1: 0.42 .. 534.71 = 534.28s
[smoker] [junit4] JVM J2: 0.63 .. 544.20 = 543.56s
[smoker] [junit4] Execution time total: 9 minutes 4 seconds
[smoker] [junit4] Tests summary: 593 suites (10 ignored), 2395 tests, 1 error, 273 ignored (258 assumptions)
[smoker]
[smoker] BUILD FAILED
[smoker] /x1/jenkins/jenkins-slave/workspace/Lucene-Solr-SmokeRelease-master/lucene/build/smokeTestRelease/tmp/unpack/solr-7.0.0/solr/build.xml:233: The following error occurred while executing this line:
[smoker] /x1/jenkins/jenkins-slave/workspace/Lucene-Solr-SmokeRelease-master/lucene/build/smokeTestRelease/tmp/unpack/solr-7.0.0/solr/common-build.xml:529: The following error occurred while executing this line:
[smoker] /x1/jenkins/jenkins-slave/workspace/Lucene-Solr-SmokeRelease-master/lucene/build/smokeTestRelease/tmp/unpack/solr-7.0.0/lucene/common-build.xml:1457: The following error occurred while executing this line:
[smoker] /x1/jenkins/jenkins-slave/workspace/Lucene-Solr-SmokeRelease-master/lucene/build/smokeTestRelease/tmp/unpack/solr-7.0.0/lucene/common-build.xml:1014: There were test failures: 593 suites (10 ignored), 2395 tests, 1 error, 273 ignored (258 assumptions) [seed: E0932F15A334AD66]
[smoker]
[smoker] Total time: 9 minutes 26 seconds
[smoker]
[smoker]
[smoker] Traceback (most recent call last):
[smoker] File "/x1/jenkins/jenkins-slave/workspace/Lucene-Solr-SmokeRelease-master/dev-tools/scripts/smokeTestRelease.py", line 1414, in <module>
[smoker] main()
[smoker] File "/x1/jenkins/jenkins-slave/workspace/Lucene-Solr-SmokeRelease-master/dev-tools/scripts/smokeTestRelease.py", line 1358, in main
[smoker] smokeTest(c.java, c.url, c.revision, c.version, c.tmp_dir, c.is_signed, ' '.join(c.test_args))
[smoker] File "/x1/jenkins/jenkins-slave/workspace/Lucene-Solr-SmokeRelease-master/dev-tools/scripts/smokeTestRelease.py", line 1404, in smokeTest
[smoker] gitRevision, version, testArgs, baseURL)
[smoker] File "/x1/jenkins/jenkins-slave/workspace/Lucene-Solr-SmokeRelease-master/dev-tools/scripts/smokeTestRelease.py", line 590, in unpackAndVerify
[smoker] verifyUnpacked(java, project, artifact, unpackPath, gitRevision, version, testArgs, tmpDir, baseURL)
[smoker] File "/x1/jenkins/jenkins-slave/workspace/Lucene-Solr-SmokeRelease-master/dev-tools/scripts/smokeTestRelease.py", line 695, in verifyUnpacked
[smoker] java.run_java8('ant clean test -Dtests.slow=false %s' % testArgs, '%s/test.log' % unpackPath)
[smoker] File "/x1/jenkins/jenkins-slave/workspace/Lucene-Solr-SmokeRelease-master/dev-tools/scripts/smokeTestRelease.py", line 1180, in run_java
[smoker] run('%s; %s' % (cmd_prefix, cmd), logfile)
[smoker] File "/x1/jenkins/jenkins-slave/workspace/Lucene-Solr-SmokeRelease-master/dev-tools/scripts/smokeTestRelease.py", line 515, in run
[smoker] raise RuntimeError('command "%s" failed; see log file %s' % (command, logPath))
[smoker] RuntimeError: command "export JAVA_HOME="/home/jenkins/jenkins-slave/tools/hudson.model.JDK/latest1.8" PATH="/home/jenkins/jenkins-slave/tools/hudson.model.JDK/latest1.8/bin:$PATH" JAVACMD="/home/jenkins/jenkins-slave/tools/hudson.model.JDK/latest1.8/bin/java"; ant clean test -Dtests.slow=false -Dtests.slow=false" failed; see log file /x1/jenkins/jenkins-slave/workspace/Lucene-Solr-SmokeRelease-master/lucene/build/smokeTestRelease/tmp/unpack/solr-7.0.0/test.log
BUILD FAILED
/x1/jenkins/jenkins-slave/workspace/Lucene-Solr-SmokeRelease-master/build.xml:536: exec returned: 1
Total time: 41 minutes 45 seconds
Build step 'Invoke Ant' marked build as failure
Email was triggered for: Failure - Any
Sending email for trigger: Failure - Any
[JENKINS] Lucene-Solr-SmokeRelease-master - Build # 491 - Still
Failing
Posted by Apache Jenkins Server <je...@builds.apache.org>.
Build: https://builds.apache.org/job/Lucene-Solr-SmokeRelease-master/491/
No tests ran.
Build Log:
[...truncated 40509 lines...]
prepare-release-no-sign:
[mkdir] Created dir: /x1/jenkins/jenkins-slave/workspace/Lucene-Solr-SmokeRelease-master/lucene/build/smokeTestRelease/dist
[copy] Copying 476 files to /x1/jenkins/jenkins-slave/workspace/Lucene-Solr-SmokeRelease-master/lucene/build/smokeTestRelease/dist/lucene
[copy] Copying 245 files to /x1/jenkins/jenkins-slave/workspace/Lucene-Solr-SmokeRelease-master/lucene/build/smokeTestRelease/dist/solr
[smoker] Java 1.8 JAVA_HOME=/home/jenkins/jenkins-slave/tools/hudson.model.JDK/latest1.8
[smoker] NOTE: output encoding is UTF-8
[smoker]
[smoker] Load release URL "file:/x1/jenkins/jenkins-slave/workspace/Lucene-Solr-SmokeRelease-master/lucene/build/smokeTestRelease/dist/"...
[smoker]
[smoker] Test Lucene...
[smoker] test basics...
[smoker] get KEYS
[smoker] 0.2 MB in 0.01 sec (16.7 MB/sec)
[smoker] check changes HTML...
[smoker] download lucene-7.0.0-src.tgz...
[smoker] 28.6 MB in 0.03 sec (1041.6 MB/sec)
[smoker] verify md5/sha1 digests
[smoker] download lucene-7.0.0.tgz...
[smoker] 63.1 MB in 0.06 sec (1092.9 MB/sec)
[smoker] verify md5/sha1 digests
[smoker] download lucene-7.0.0.zip...
[smoker] 73.6 MB in 0.07 sec (1101.3 MB/sec)
[smoker] verify md5/sha1 digests
[smoker] unpack lucene-7.0.0.tgz...
[smoker] verify JAR metadata/identity/no javax.* or java.* classes...
[smoker] test demo with 1.8...
[smoker] got 6015 hits for query "lucene"
[smoker] checkindex with 1.8...
[smoker] check Lucene's javadoc JAR
[smoker] unpack lucene-7.0.0.zip...
[smoker] verify JAR metadata/identity/no javax.* or java.* classes...
[smoker] test demo with 1.8...
[smoker] got 6015 hits for query "lucene"
[smoker] checkindex with 1.8...
[smoker] check Lucene's javadoc JAR
[smoker] unpack lucene-7.0.0-src.tgz...
[smoker] make sure no JARs/WARs in src dist...
[smoker] run "ant validate"
[smoker] run tests w/ Java 8 and testArgs='-Dtests.slow=false'...
[smoker] test demo with 1.8...
[smoker] got 221 hits for query "lucene"
[smoker] checkindex with 1.8...
[smoker] generate javadocs w/ Java 8...
[smoker]
[smoker] Crawl/parse...
[smoker]
[smoker] Verify...
[smoker] confirm all releases have coverage in TestBackwardsCompatibility
[smoker] find all past Lucene releases...
[smoker] run TestBackwardsCompatibility..
[smoker] Releases that don't seem to be tested:
[smoker] 5.5.1
[smoker] Traceback (most recent call last):
[smoker] File "/x1/jenkins/jenkins-slave/workspace/Lucene-Solr-SmokeRelease-master/dev-tools/scripts/smokeTestRelease.py", line 1414, in <module>
[smoker] main()
[smoker] File "/x1/jenkins/jenkins-slave/workspace/Lucene-Solr-SmokeRelease-master/dev-tools/scripts/smokeTestRelease.py", line 1358, in main
[smoker] smokeTest(c.java, c.url, c.revision, c.version, c.tmp_dir, c.is_signed, ' '.join(c.test_args))
[smoker] File "/x1/jenkins/jenkins-slave/workspace/Lucene-Solr-SmokeRelease-master/dev-tools/scripts/smokeTestRelease.py", line 1396, in smokeTest
[smoker] unpackAndVerify(java, 'lucene', tmpDir, 'lucene-%s-src.tgz' % version, gitRevision, version, testArgs, baseURL)
[smoker] File "/x1/jenkins/jenkins-slave/workspace/Lucene-Solr-SmokeRelease-master/dev-tools/scripts/smokeTestRelease.py", line 590, in unpackAndVerify
[smoker] verifyUnpacked(java, project, artifact, unpackPath, gitRevision, version, testArgs, tmpDir, baseURL)
[smoker] File "/x1/jenkins/jenkins-slave/workspace/Lucene-Solr-SmokeRelease-master/dev-tools/scripts/smokeTestRelease.py", line 736, in verifyUnpacked
[smoker] confirmAllReleasesAreTestedForBackCompat(version, unpackPath)
[smoker] File "/x1/jenkins/jenkins-slave/workspace/Lucene-Solr-SmokeRelease-master/dev-tools/scripts/smokeTestRelease.py", line 1351, in confirmAllReleasesAreTestedForBackCompat
[smoker] raise RuntimeError('some releases are not tested by TestBackwardsCompatibility?')
[smoker] RuntimeError: some releases are not tested by TestBackwardsCompatibility?
BUILD FAILED
/x1/jenkins/jenkins-slave/workspace/Lucene-Solr-SmokeRelease-master/build.xml:536: exec returned: 1
Total time: 29 minutes 51 seconds
Build step 'Invoke Ant' marked build as failure
Email was triggered for: Failure - Any
Sending email for trigger: Failure - Any
Re: [JENKINS] Lucene-Solr-SmokeRelease-master - Build # 490 - Still Failing
Posted by Steve Rowe <sa...@gmail.com>.
I committed a fix.
--
Steve
www.lucidworks.com
> On May 16, 2016, at 6:42 PM, Apache Jenkins Server <je...@builds.apache.org> wrote:
>
> Build: https://builds.apache.org/job/Lucene-Solr-SmokeRelease-master/490/
>
> No tests ran.
>
> Build Log:
> [...truncated 40509 lines...]
> prepare-release-no-sign:
> [mkdir] Created dir: /x1/jenkins/jenkins-slave/workspace/Lucene-Solr-SmokeRelease-master/lucene/build/smokeTestRelease/dist
> [copy] Copying 476 files to /x1/jenkins/jenkins-slave/workspace/Lucene-Solr-SmokeRelease-master/lucene/build/smokeTestRelease/dist/lucene
> [copy] Copying 245 files to /x1/jenkins/jenkins-slave/workspace/Lucene-Solr-SmokeRelease-master/lucene/build/smokeTestRelease/dist/solr
> [smoker] Java 1.8 JAVA_HOME=/home/jenkins/jenkins-slave/tools/hudson.model.JDK/latest1.8
> [smoker] NOTE: output encoding is UTF-8
> [smoker]
> [smoker] Load release URL "file:/x1/jenkins/jenkins-slave/workspace/Lucene-Solr-SmokeRelease-master/lucene/build/smokeTestRelease/dist/"...
> [smoker]
> [smoker] Test Lucene...
> [smoker] test basics...
> [smoker] get KEYS
> [smoker] 0.2 MB in 0.02 sec (10.5 MB/sec)
> [smoker] check changes HTML...
> [smoker] download lucene-7.0.0-src.tgz...
> [smoker] 28.6 MB in 0.03 sec (1061.4 MB/sec)
> [smoker] verify md5/sha1 digests
> [smoker] download lucene-7.0.0.tgz...
> [smoker] 63.0 MB in 0.06 sec (1088.6 MB/sec)
> [smoker] verify md5/sha1 digests
> [smoker] download lucene-7.0.0.zip...
> [smoker] 73.6 MB in 0.07 sec (1064.8 MB/sec)
> [smoker] verify md5/sha1 digests
> [smoker] unpack lucene-7.0.0.tgz...
> [smoker] verify JAR metadata/identity/no javax.* or java.* classes...
> [smoker] test demo with 1.8...
> [smoker] got 6015 hits for query "lucene"
> [smoker] checkindex with 1.8...
> [smoker] check Lucene's javadoc JAR
> [smoker] unpack lucene-7.0.0.zip...
> [smoker] verify JAR metadata/identity/no javax.* or java.* classes...
> [smoker] test demo with 1.8...
> [smoker] got 6015 hits for query "lucene"
> [smoker] checkindex with 1.8...
> [smoker] check Lucene's javadoc JAR
> [smoker] unpack lucene-7.0.0-src.tgz...
> [smoker] Traceback (most recent call last):
> [smoker] File "/x1/jenkins/jenkins-slave/workspace/Lucene-Solr-SmokeRelease-master/dev-tools/scripts/smokeTestRelease.py", line 1414, in <module>
> [smoker] main()
> [smoker] File "/x1/jenkins/jenkins-slave/workspace/Lucene-Solr-SmokeRelease-master/dev-tools/scripts/smokeTestRelease.py", line 1358, in main
> [smoker] smokeTest(c.java, c.url, c.revision, c.version, c.tmp_dir, c.is_signed, ' '.join(c.test_args))
> [smoker] File "/x1/jenkins/jenkins-slave/workspace/Lucene-Solr-SmokeRelease-master/dev-tools/scripts/smokeTestRelease.py", line 1396, in smokeTest
> [smoker] unpackAndVerify(java, 'lucene', tmpDir, 'lucene-%s-src.tgz' % version, gitRevision, version, testArgs, baseURL)
> [smoker] File "/x1/jenkins/jenkins-slave/workspace/Lucene-Solr-SmokeRelease-master/dev-tools/scripts/smokeTestRelease.py", line 590, in unpackAndVerify
> [smoker] verifyUnpacked(java, project, artifact, unpackPath, gitRevision, version, testArgs, tmpDir, baseURL)
> [smoker] File "/x1/jenkins/jenkins-slave/workspace/Lucene-Solr-SmokeRelease-master/dev-tools/scripts/smokeTestRelease.py", line 656, in verifyUnpacked
> [smoker] raise RuntimeError('%s: %s missing from artifact %s' % (project, e, artifact))
> [smoker] RuntimeError: lucene: ivy-settings.xml missing from artifact lucene-7.0.0-src.tgz
>
> BUILD FAILED
> /x1/jenkins/jenkins-slave/workspace/Lucene-Solr-SmokeRelease-master/build.xml:536: exec returned: 1
>
> Total time: 8 minutes 0 seconds
> Build step 'Invoke Ant' marked build as failure
> Email was triggered for: Failure - Any
> Sending email for trigger: Failure - Any
>
>
>
>
> ---------------------------------------------------------------------
> To unsubscribe, e-mail: dev-unsubscribe@lucene.apache.org
> For additional commands, e-mail: dev-help@lucene.apache.org
---------------------------------------------------------------------
To unsubscribe, e-mail: dev-unsubscribe@lucene.apache.org
For additional commands, e-mail: dev-help@lucene.apache.org
[JENKINS] Lucene-Solr-SmokeRelease-master - Build # 490 - Still
Failing
Posted by Apache Jenkins Server <je...@builds.apache.org>.
Build: https://builds.apache.org/job/Lucene-Solr-SmokeRelease-master/490/
No tests ran.
Build Log:
[...truncated 40509 lines...]
prepare-release-no-sign:
[mkdir] Created dir: /x1/jenkins/jenkins-slave/workspace/Lucene-Solr-SmokeRelease-master/lucene/build/smokeTestRelease/dist
[copy] Copying 476 files to /x1/jenkins/jenkins-slave/workspace/Lucene-Solr-SmokeRelease-master/lucene/build/smokeTestRelease/dist/lucene
[copy] Copying 245 files to /x1/jenkins/jenkins-slave/workspace/Lucene-Solr-SmokeRelease-master/lucene/build/smokeTestRelease/dist/solr
[smoker] Java 1.8 JAVA_HOME=/home/jenkins/jenkins-slave/tools/hudson.model.JDK/latest1.8
[smoker] NOTE: output encoding is UTF-8
[smoker]
[smoker] Load release URL "file:/x1/jenkins/jenkins-slave/workspace/Lucene-Solr-SmokeRelease-master/lucene/build/smokeTestRelease/dist/"...
[smoker]
[smoker] Test Lucene...
[smoker] test basics...
[smoker] get KEYS
[smoker] 0.2 MB in 0.02 sec (10.5 MB/sec)
[smoker] check changes HTML...
[smoker] download lucene-7.0.0-src.tgz...
[smoker] 28.6 MB in 0.03 sec (1061.4 MB/sec)
[smoker] verify md5/sha1 digests
[smoker] download lucene-7.0.0.tgz...
[smoker] 63.0 MB in 0.06 sec (1088.6 MB/sec)
[smoker] verify md5/sha1 digests
[smoker] download lucene-7.0.0.zip...
[smoker] 73.6 MB in 0.07 sec (1064.8 MB/sec)
[smoker] verify md5/sha1 digests
[smoker] unpack lucene-7.0.0.tgz...
[smoker] verify JAR metadata/identity/no javax.* or java.* classes...
[smoker] test demo with 1.8...
[smoker] got 6015 hits for query "lucene"
[smoker] checkindex with 1.8...
[smoker] check Lucene's javadoc JAR
[smoker] unpack lucene-7.0.0.zip...
[smoker] verify JAR metadata/identity/no javax.* or java.* classes...
[smoker] test demo with 1.8...
[smoker] got 6015 hits for query "lucene"
[smoker] checkindex with 1.8...
[smoker] check Lucene's javadoc JAR
[smoker] unpack lucene-7.0.0-src.tgz...
[smoker] Traceback (most recent call last):
[smoker] File "/x1/jenkins/jenkins-slave/workspace/Lucene-Solr-SmokeRelease-master/dev-tools/scripts/smokeTestRelease.py", line 1414, in <module>
[smoker] main()
[smoker] File "/x1/jenkins/jenkins-slave/workspace/Lucene-Solr-SmokeRelease-master/dev-tools/scripts/smokeTestRelease.py", line 1358, in main
[smoker] smokeTest(c.java, c.url, c.revision, c.version, c.tmp_dir, c.is_signed, ' '.join(c.test_args))
[smoker] File "/x1/jenkins/jenkins-slave/workspace/Lucene-Solr-SmokeRelease-master/dev-tools/scripts/smokeTestRelease.py", line 1396, in smokeTest
[smoker] unpackAndVerify(java, 'lucene', tmpDir, 'lucene-%s-src.tgz' % version, gitRevision, version, testArgs, baseURL)
[smoker] File "/x1/jenkins/jenkins-slave/workspace/Lucene-Solr-SmokeRelease-master/dev-tools/scripts/smokeTestRelease.py", line 590, in unpackAndVerify
[smoker] verifyUnpacked(java, project, artifact, unpackPath, gitRevision, version, testArgs, tmpDir, baseURL)
[smoker] File "/x1/jenkins/jenkins-slave/workspace/Lucene-Solr-SmokeRelease-master/dev-tools/scripts/smokeTestRelease.py", line 656, in verifyUnpacked
[smoker] raise RuntimeError('%s: %s missing from artifact %s' % (project, e, artifact))
[smoker] RuntimeError: lucene: ivy-settings.xml missing from artifact lucene-7.0.0-src.tgz
BUILD FAILED
/x1/jenkins/jenkins-slave/workspace/Lucene-Solr-SmokeRelease-master/build.xml:536: exec returned: 1
Total time: 8 minutes 0 seconds
Build step 'Invoke Ant' marked build as failure
Email was triggered for: Failure - Any
Sending email for trigger: Failure - Any
[JENKINS] Lucene-Solr-SmokeRelease-master - Build # 489 - Still
Failing
Posted by Apache Jenkins Server <je...@builds.apache.org>.
Build: https://builds.apache.org/job/Lucene-Solr-SmokeRelease-master/489/
No tests ran.
Build Log:
[...truncated 40512 lines...]
prepare-release-no-sign:
[mkdir] Created dir: /x1/jenkins/jenkins-slave/workspace/Lucene-Solr-SmokeRelease-master/lucene/build/smokeTestRelease/dist
[copy] Copying 476 files to /x1/jenkins/jenkins-slave/workspace/Lucene-Solr-SmokeRelease-master/lucene/build/smokeTestRelease/dist/lucene
[copy] Copying 245 files to /x1/jenkins/jenkins-slave/workspace/Lucene-Solr-SmokeRelease-master/lucene/build/smokeTestRelease/dist/solr
[smoker] Java 1.8 JAVA_HOME=/home/jenkins/jenkins-slave/tools/hudson.model.JDK/latest1.8
[smoker] NOTE: output encoding is UTF-8
[smoker]
[smoker] Load release URL "file:/x1/jenkins/jenkins-slave/workspace/Lucene-Solr-SmokeRelease-master/lucene/build/smokeTestRelease/dist/"...
[smoker]
[smoker] Test Lucene...
[smoker] test basics...
[smoker] get KEYS
[smoker] 0.2 MB in 0.01 sec (21.9 MB/sec)
[smoker] check changes HTML...
[smoker] download lucene-7.0.0-src.tgz...
[smoker] 28.6 MB in 0.02 sec (1209.7 MB/sec)
[smoker] verify md5/sha1 digests
[smoker] download lucene-7.0.0.tgz...
[smoker] 63.0 MB in 0.05 sec (1192.5 MB/sec)
[smoker] verify md5/sha1 digests
[smoker] download lucene-7.0.0.zip...
[smoker] 73.6 MB in 0.06 sec (1190.1 MB/sec)
[smoker] verify md5/sha1 digests
[smoker] unpack lucene-7.0.0.tgz...
[smoker] verify JAR metadata/identity/no javax.* or java.* classes...
[smoker] test demo with 1.8...
[smoker] got 6013 hits for query "lucene"
[smoker] checkindex with 1.8...
[smoker] check Lucene's javadoc JAR
[smoker] unpack lucene-7.0.0.zip...
[smoker] verify JAR metadata/identity/no javax.* or java.* classes...
[smoker] test demo with 1.8...
[smoker] got 6013 hits for query "lucene"
[smoker] checkindex with 1.8...
[smoker] check Lucene's javadoc JAR
[smoker] unpack lucene-7.0.0-src.tgz...
[smoker] make sure no JARs/WARs in src dist...
[smoker] run "ant validate"
[smoker] run tests w/ Java 8 and testArgs='-Dtests.slow=false'...
[smoker] test demo with 1.8...
[smoker] got 221 hits for query "lucene"
[smoker] checkindex with 1.8...
[smoker] generate javadocs w/ Java 8...
[smoker]
[smoker] Crawl/parse...
[smoker]
[smoker] Verify...
[smoker] confirm all releases have coverage in TestBackwardsCompatibility
[smoker] find all past Lucene releases...
[smoker] run TestBackwardsCompatibility..
[smoker] Releases that don't seem to be tested:
[smoker] 5.5.1
[smoker] Traceback (most recent call last):
[smoker] File "/x1/jenkins/jenkins-slave/workspace/Lucene-Solr-SmokeRelease-master/dev-tools/scripts/smokeTestRelease.py", line 1414, in <module>
[smoker] main()
[smoker] File "/x1/jenkins/jenkins-slave/workspace/Lucene-Solr-SmokeRelease-master/dev-tools/scripts/smokeTestRelease.py", line 1358, in main
[smoker] smokeTest(c.java, c.url, c.revision, c.version, c.tmp_dir, c.is_signed, ' '.join(c.test_args))
[smoker] File "/x1/jenkins/jenkins-slave/workspace/Lucene-Solr-SmokeRelease-master/dev-tools/scripts/smokeTestRelease.py", line 1396, in smokeTest
[smoker] unpackAndVerify(java, 'lucene', tmpDir, 'lucene-%s-src.tgz' % version, gitRevision, version, testArgs, baseURL)
[smoker] File "/x1/jenkins/jenkins-slave/workspace/Lucene-Solr-SmokeRelease-master/dev-tools/scripts/smokeTestRelease.py", line 590, in unpackAndVerify
[smoker] verifyUnpacked(java, project, artifact, unpackPath, gitRevision, version, testArgs, tmpDir, baseURL)
[smoker] File "/x1/jenkins/jenkins-slave/workspace/Lucene-Solr-SmokeRelease-master/dev-tools/scripts/smokeTestRelease.py", line 736, in verifyUnpacked
[smoker] confirmAllReleasesAreTestedForBackCompat(version, unpackPath)
[smoker] File "/x1/jenkins/jenkins-slave/workspace/Lucene-Solr-SmokeRelease-master/dev-tools/scripts/smokeTestRelease.py", line 1351, in confirmAllReleasesAreTestedForBackCompat
[smoker] raise RuntimeError('some releases are not tested by TestBackwardsCompatibility?')
[smoker] RuntimeError: some releases are not tested by TestBackwardsCompatibility?
BUILD FAILED
/x1/jenkins/jenkins-slave/workspace/Lucene-Solr-SmokeRelease-master/build.xml:536: exec returned: 1
Total time: 29 minutes 41 seconds
Build step 'Invoke Ant' marked build as failure
Email was triggered for: Failure - Any
Sending email for trigger: Failure - Any
[JENKINS] Lucene-Solr-SmokeRelease-master - Build # 488 - Still
Failing
Posted by Apache Jenkins Server <je...@builds.apache.org>.
Build: https://builds.apache.org/job/Lucene-Solr-SmokeRelease-master/488/
No tests ran.
Build Log:
[...truncated 40519 lines...]
prepare-release-no-sign:
[mkdir] Created dir: /x1/jenkins/jenkins-slave/workspace/Lucene-Solr-SmokeRelease-master/lucene/build/smokeTestRelease/dist
[copy] Copying 476 files to /x1/jenkins/jenkins-slave/workspace/Lucene-Solr-SmokeRelease-master/lucene/build/smokeTestRelease/dist/lucene
[copy] Copying 245 files to /x1/jenkins/jenkins-slave/workspace/Lucene-Solr-SmokeRelease-master/lucene/build/smokeTestRelease/dist/solr
[smoker] Java 1.8 JAVA_HOME=/home/jenkins/jenkins-slave/tools/hudson.model.JDK/latest1.8
[smoker] NOTE: output encoding is UTF-8
[smoker]
[smoker] Load release URL "file:/x1/jenkins/jenkins-slave/workspace/Lucene-Solr-SmokeRelease-master/lucene/build/smokeTestRelease/dist/"...
[smoker]
[smoker] Test Lucene...
[smoker] test basics...
[smoker] get KEYS
[smoker] 0.2 MB in 0.01 sec (18.6 MB/sec)
[smoker] check changes HTML...
[smoker] download lucene-7.0.0-src.tgz...
[smoker] 28.6 MB in 0.03 sec (858.9 MB/sec)
[smoker] verify md5/sha1 digests
[smoker] download lucene-7.0.0.tgz...
[smoker] 63.0 MB in 0.06 sec (1058.8 MB/sec)
[smoker] verify md5/sha1 digests
[smoker] download lucene-7.0.0.zip...
[smoker] 73.5 MB in 0.09 sec (807.6 MB/sec)
[smoker] verify md5/sha1 digests
[smoker] unpack lucene-7.0.0.tgz...
[smoker] verify JAR metadata/identity/no javax.* or java.* classes...
[smoker] test demo with 1.8...
[smoker] got 6003 hits for query "lucene"
[smoker] checkindex with 1.8...
[smoker] check Lucene's javadoc JAR
[smoker] unpack lucene-7.0.0.zip...
[smoker] verify JAR metadata/identity/no javax.* or java.* classes...
[smoker] test demo with 1.8...
[smoker] got 6003 hits for query "lucene"
[smoker] checkindex with 1.8...
[smoker] check Lucene's javadoc JAR
[smoker] unpack lucene-7.0.0-src.tgz...
[smoker] make sure no JARs/WARs in src dist...
[smoker] run "ant validate"
[smoker] run tests w/ Java 8 and testArgs='-Dtests.slow=false'...
[smoker] test demo with 1.8...
[smoker] got 218 hits for query "lucene"
[smoker] checkindex with 1.8...
[smoker] generate javadocs w/ Java 8...
[smoker]
[smoker] Crawl/parse...
[smoker]
[smoker] Verify...
[smoker] confirm all releases have coverage in TestBackwardsCompatibility
[smoker] find all past Lucene releases...
[smoker] run TestBackwardsCompatibility..
[smoker] Releases that don't seem to be tested:
[smoker] 5.5.1
[smoker] Traceback (most recent call last):
[smoker] File "/x1/jenkins/jenkins-slave/workspace/Lucene-Solr-SmokeRelease-master/dev-tools/scripts/smokeTestRelease.py", line 1414, in <module>
[smoker] main()
[smoker] File "/x1/jenkins/jenkins-slave/workspace/Lucene-Solr-SmokeRelease-master/dev-tools/scripts/smokeTestRelease.py", line 1358, in main
[smoker] smokeTest(c.java, c.url, c.revision, c.version, c.tmp_dir, c.is_signed, ' '.join(c.test_args))
[smoker] File "/x1/jenkins/jenkins-slave/workspace/Lucene-Solr-SmokeRelease-master/dev-tools/scripts/smokeTestRelease.py", line 1396, in smokeTest
[smoker] unpackAndVerify(java, 'lucene', tmpDir, 'lucene-%s-src.tgz' % version, gitRevision, version, testArgs, baseURL)
[smoker] File "/x1/jenkins/jenkins-slave/workspace/Lucene-Solr-SmokeRelease-master/dev-tools/scripts/smokeTestRelease.py", line 590, in unpackAndVerify
[smoker] verifyUnpacked(java, project, artifact, unpackPath, gitRevision, version, testArgs, tmpDir, baseURL)
[smoker] File "/x1/jenkins/jenkins-slave/workspace/Lucene-Solr-SmokeRelease-master/dev-tools/scripts/smokeTestRelease.py", line 736, in verifyUnpacked
[smoker] confirmAllReleasesAreTestedForBackCompat(version, unpackPath)
[smoker] File "/x1/jenkins/jenkins-slave/workspace/Lucene-Solr-SmokeRelease-master/dev-tools/scripts/smokeTestRelease.py", line 1351, in confirmAllReleasesAreTestedForBackCompat
[smoker] raise RuntimeError('some releases are not tested by TestBackwardsCompatibility?')
[smoker] RuntimeError: some releases are not tested by TestBackwardsCompatibility?
BUILD FAILED
/x1/jenkins/jenkins-slave/workspace/Lucene-Solr-SmokeRelease-master/build.xml:536: exec returned: 1
Total time: 31 minutes 30 seconds
Build step 'Invoke Ant' marked build as failure
Email was triggered for: Failure - Any
Sending email for trigger: Failure - Any
[JENKINS] Lucene-Solr-SmokeRelease-master - Build # 487 - Still
Failing
Posted by Apache Jenkins Server <je...@builds.apache.org>.
Build: https://builds.apache.org/job/Lucene-Solr-SmokeRelease-master/487/
No tests ran.
Build Log:
[...truncated 40519 lines...]
prepare-release-no-sign:
[mkdir] Created dir: /x1/jenkins/jenkins-slave/workspace/Lucene-Solr-SmokeRelease-master/lucene/build/smokeTestRelease/dist
[copy] Copying 476 files to /x1/jenkins/jenkins-slave/workspace/Lucene-Solr-SmokeRelease-master/lucene/build/smokeTestRelease/dist/lucene
[copy] Copying 245 files to /x1/jenkins/jenkins-slave/workspace/Lucene-Solr-SmokeRelease-master/lucene/build/smokeTestRelease/dist/solr
[smoker] Java 1.8 JAVA_HOME=/home/jenkins/jenkins-slave/tools/hudson.model.JDK/latest1.8
[smoker] NOTE: output encoding is UTF-8
[smoker]
[smoker] Load release URL "file:/x1/jenkins/jenkins-slave/workspace/Lucene-Solr-SmokeRelease-master/lucene/build/smokeTestRelease/dist/"...
[smoker]
[smoker] Test Lucene...
[smoker] test basics...
[smoker] get KEYS
[smoker] 0.2 MB in 0.01 sec (16.5 MB/sec)
[smoker] check changes HTML...
[smoker] download lucene-7.0.0-src.tgz...
[smoker] 28.6 MB in 0.02 sec (1196.4 MB/sec)
[smoker] verify md5/sha1 digests
[smoker] download lucene-7.0.0.tgz...
[smoker] 63.0 MB in 0.06 sec (1099.1 MB/sec)
[smoker] verify md5/sha1 digests
[smoker] download lucene-7.0.0.zip...
[smoker] 73.5 MB in 0.06 sec (1148.5 MB/sec)
[smoker] verify md5/sha1 digests
[smoker] unpack lucene-7.0.0.tgz...
[smoker] verify JAR metadata/identity/no javax.* or java.* classes...
[smoker] test demo with 1.8...
[smoker] got 6003 hits for query "lucene"
[smoker] checkindex with 1.8...
[smoker] check Lucene's javadoc JAR
[smoker] unpack lucene-7.0.0.zip...
[smoker] verify JAR metadata/identity/no javax.* or java.* classes...
[smoker] test demo with 1.8...
[smoker] got 6003 hits for query "lucene"
[smoker] checkindex with 1.8...
[smoker] check Lucene's javadoc JAR
[smoker] unpack lucene-7.0.0-src.tgz...
[smoker] make sure no JARs/WARs in src dist...
[smoker] run "ant validate"
[smoker] run tests w/ Java 8 and testArgs='-Dtests.slow=false'...
[smoker] test demo with 1.8...
[smoker] got 218 hits for query "lucene"
[smoker] checkindex with 1.8...
[smoker] generate javadocs w/ Java 8...
[smoker]
[smoker] Crawl/parse...
[smoker]
[smoker] Verify...
[smoker] confirm all releases have coverage in TestBackwardsCompatibility
[smoker] find all past Lucene releases...
[smoker] run TestBackwardsCompatibility..
[smoker] Releases that don't seem to be tested:
[smoker] 5.5.1
[smoker] Traceback (most recent call last):
[smoker] File "/x1/jenkins/jenkins-slave/workspace/Lucene-Solr-SmokeRelease-master/dev-tools/scripts/smokeTestRelease.py", line 1414, in <module>
[smoker] main()
[smoker] File "/x1/jenkins/jenkins-slave/workspace/Lucene-Solr-SmokeRelease-master/dev-tools/scripts/smokeTestRelease.py", line 1358, in main
[smoker] smokeTest(c.java, c.url, c.revision, c.version, c.tmp_dir, c.is_signed, ' '.join(c.test_args))
[smoker] File "/x1/jenkins/jenkins-slave/workspace/Lucene-Solr-SmokeRelease-master/dev-tools/scripts/smokeTestRelease.py", line 1396, in smokeTest
[smoker] unpackAndVerify(java, 'lucene', tmpDir, 'lucene-%s-src.tgz' % version, gitRevision, version, testArgs, baseURL)
[smoker] File "/x1/jenkins/jenkins-slave/workspace/Lucene-Solr-SmokeRelease-master/dev-tools/scripts/smokeTestRelease.py", line 590, in unpackAndVerify
[smoker] verifyUnpacked(java, project, artifact, unpackPath, gitRevision, version, testArgs, tmpDir, baseURL)
[smoker] File "/x1/jenkins/jenkins-slave/workspace/Lucene-Solr-SmokeRelease-master/dev-tools/scripts/smokeTestRelease.py", line 736, in verifyUnpacked
[smoker] confirmAllReleasesAreTestedForBackCompat(version, unpackPath)
[smoker] File "/x1/jenkins/jenkins-slave/workspace/Lucene-Solr-SmokeRelease-master/dev-tools/scripts/smokeTestRelease.py", line 1351, in confirmAllReleasesAreTestedForBackCompat
[smoker] raise RuntimeError('some releases are not tested by TestBackwardsCompatibility?')
[smoker] RuntimeError: some releases are not tested by TestBackwardsCompatibility?
BUILD FAILED
/x1/jenkins/jenkins-slave/workspace/Lucene-Solr-SmokeRelease-master/build.xml:536: exec returned: 1
Total time: 29 minutes 16 seconds
Build step 'Invoke Ant' marked build as failure
Email was triggered for: Failure - Any
Sending email for trigger: Failure - Any
[JENKINS] Lucene-Solr-SmokeRelease-master - Build # 486 - Still
Failing
Posted by Apache Jenkins Server <je...@builds.apache.org>.
Build: https://builds.apache.org/job/Lucene-Solr-SmokeRelease-master/486/
No tests ran.
Build Log:
[...truncated 40521 lines...]
prepare-release-no-sign:
[mkdir] Created dir: /x1/jenkins/jenkins-slave/workspace/Lucene-Solr-SmokeRelease-master/lucene/build/smokeTestRelease/dist
[copy] Copying 476 files to /x1/jenkins/jenkins-slave/workspace/Lucene-Solr-SmokeRelease-master/lucene/build/smokeTestRelease/dist/lucene
[copy] Copying 245 files to /x1/jenkins/jenkins-slave/workspace/Lucene-Solr-SmokeRelease-master/lucene/build/smokeTestRelease/dist/solr
[smoker] Java 1.8 JAVA_HOME=/home/jenkins/jenkins-slave/tools/hudson.model.JDK/latest1.8
[smoker] NOTE: output encoding is UTF-8
[smoker]
[smoker] Load release URL "file:/x1/jenkins/jenkins-slave/workspace/Lucene-Solr-SmokeRelease-master/lucene/build/smokeTestRelease/dist/"...
[smoker]
[smoker] Test Lucene...
[smoker] test basics...
[smoker] get KEYS
[smoker] 0.2 MB in 0.01 sec (18.3 MB/sec)
[smoker] check changes HTML...
[smoker] download lucene-7.0.0-src.tgz...
[smoker] 28.6 MB in 0.03 sec (994.1 MB/sec)
[smoker] verify md5/sha1 digests
[smoker] download lucene-7.0.0.tgz...
[smoker] 63.0 MB in 0.05 sec (1167.7 MB/sec)
[smoker] verify md5/sha1 digests
[smoker] download lucene-7.0.0.zip...
[smoker] 73.5 MB in 0.06 sec (1185.2 MB/sec)
[smoker] verify md5/sha1 digests
[smoker] unpack lucene-7.0.0.tgz...
[smoker] verify JAR metadata/identity/no javax.* or java.* classes...
[smoker] test demo with 1.8...
[smoker] got 6003 hits for query "lucene"
[smoker] checkindex with 1.8...
[smoker] check Lucene's javadoc JAR
[smoker] unpack lucene-7.0.0.zip...
[smoker] verify JAR metadata/identity/no javax.* or java.* classes...
[smoker] test demo with 1.8...
[smoker] got 6003 hits for query "lucene"
[smoker] checkindex with 1.8...
[smoker] check Lucene's javadoc JAR
[smoker] unpack lucene-7.0.0-src.tgz...
[smoker] make sure no JARs/WARs in src dist...
[smoker] run "ant validate"
[smoker] run tests w/ Java 8 and testArgs='-Dtests.slow=false'...
[smoker] test demo with 1.8...
[smoker] got 218 hits for query "lucene"
[smoker] checkindex with 1.8...
[smoker] generate javadocs w/ Java 8...
[smoker]
[smoker] Crawl/parse...
[smoker]
[smoker] Verify...
[smoker] confirm all releases have coverage in TestBackwardsCompatibility
[smoker] find all past Lucene releases...
[smoker] run TestBackwardsCompatibility..
[smoker] Releases that don't seem to be tested:
[smoker] 5.5.1
[smoker] Traceback (most recent call last):
[smoker] File "/x1/jenkins/jenkins-slave/workspace/Lucene-Solr-SmokeRelease-master/dev-tools/scripts/smokeTestRelease.py", line 1414, in <module>
[smoker] main()
[smoker] File "/x1/jenkins/jenkins-slave/workspace/Lucene-Solr-SmokeRelease-master/dev-tools/scripts/smokeTestRelease.py", line 1358, in main
[smoker] smokeTest(c.java, c.url, c.revision, c.version, c.tmp_dir, c.is_signed, ' '.join(c.test_args))
[smoker] File "/x1/jenkins/jenkins-slave/workspace/Lucene-Solr-SmokeRelease-master/dev-tools/scripts/smokeTestRelease.py", line 1396, in smokeTest
[smoker] unpackAndVerify(java, 'lucene', tmpDir, 'lucene-%s-src.tgz' % version, gitRevision, version, testArgs, baseURL)
[smoker] File "/x1/jenkins/jenkins-slave/workspace/Lucene-Solr-SmokeRelease-master/dev-tools/scripts/smokeTestRelease.py", line 590, in unpackAndVerify
[smoker] verifyUnpacked(java, project, artifact, unpackPath, gitRevision, version, testArgs, tmpDir, baseURL)
[smoker] File "/x1/jenkins/jenkins-slave/workspace/Lucene-Solr-SmokeRelease-master/dev-tools/scripts/smokeTestRelease.py", line 736, in verifyUnpacked
[smoker] confirmAllReleasesAreTestedForBackCompat(version, unpackPath)
[smoker] File "/x1/jenkins/jenkins-slave/workspace/Lucene-Solr-SmokeRelease-master/dev-tools/scripts/smokeTestRelease.py", line 1351, in confirmAllReleasesAreTestedForBackCompat
[smoker] raise RuntimeError('some releases are not tested by TestBackwardsCompatibility?')
[smoker] RuntimeError: some releases are not tested by TestBackwardsCompatibility?
BUILD FAILED
/x1/jenkins/jenkins-slave/workspace/Lucene-Solr-SmokeRelease-master/build.xml:536: exec returned: 1
Total time: 30 minutes 16 seconds
Build step 'Invoke Ant' marked build as failure
Email was triggered for: Failure - Any
Sending email for trigger: Failure - Any
Re: [JENKINS] Lucene-Solr-SmokeRelease-master - Build # 485 - Still Failing
Posted by Steve Rowe <sa...@gmail.com>.
Looks like we should add functionality to addVersion.py to add unsupported versions on master, and then run it on master even when the release version is no longer supported on master. I’ll work on a patch.
> On May 7, 2016, at 3:48 AM, Apache Jenkins Server <je...@builds.apache.org> wrote:
>
> Build: https://builds.apache.org/job/Lucene-Solr-SmokeRelease-master/485/
>
> No tests ran.
>
> Build Log:
> [...truncated 40519 lines...]
> prepare-release-no-sign:
> [mkdir] Created dir: /x1/jenkins/jenkins-slave/workspace/Lucene-Solr-SmokeRelease-master/lucene/build/smokeTestRelease/dist
> [copy] Copying 476 files to /x1/jenkins/jenkins-slave/workspace/Lucene-Solr-SmokeRelease-master/lucene/build/smokeTestRelease/dist/lucene
> [copy] Copying 245 files to /x1/jenkins/jenkins-slave/workspace/Lucene-Solr-SmokeRelease-master/lucene/build/smokeTestRelease/dist/solr
> [smoker] Java 1.8 JAVA_HOME=/home/jenkins/jenkins-slave/tools/hudson.model.JDK/latest1.8
> [smoker] NOTE: output encoding is UTF-8
> [smoker]
> [smoker] Load release URL "file:/x1/jenkins/jenkins-slave/workspace/Lucene-Solr-SmokeRelease-master/lucene/build/smokeTestRelease/dist/"...
> [smoker]
> [smoker] Test Lucene...
> [smoker] test basics...
> [smoker] get KEYS
> [smoker] 0.2 MB in 0.02 sec (10.2 MB/sec)
> [smoker] check changes HTML...
> [smoker] download lucene-7.0.0-src.tgz...
> [smoker] 28.6 MB in 0.03 sec (1127.4 MB/sec)
> [smoker] verify md5/sha1 digests
> [smoker] download lucene-7.0.0.tgz...
> [smoker] 63.0 MB in 0.06 sec (1088.2 MB/sec)
> [smoker] verify md5/sha1 digests
> [smoker] download lucene-7.0.0.zip...
> [smoker] 73.5 MB in 0.07 sec (1111.1 MB/sec)
> [smoker] verify md5/sha1 digests
> [smoker] unpack lucene-7.0.0.tgz...
> [smoker] verify JAR metadata/identity/no javax.* or java.* classes...
> [smoker] test demo with 1.8...
> [smoker] got 6003 hits for query "lucene"
> [smoker] checkindex with 1.8...
> [smoker] check Lucene's javadoc JAR
> [smoker] unpack lucene-7.0.0.zip...
> [smoker] verify JAR metadata/identity/no javax.* or java.* classes...
> [smoker] test demo with 1.8...
> [smoker] got 6003 hits for query "lucene"
> [smoker] checkindex with 1.8...
> [smoker] check Lucene's javadoc JAR
> [smoker] unpack lucene-7.0.0-src.tgz...
> [smoker] make sure no JARs/WARs in src dist...
> [smoker] run "ant validate"
> [smoker] run tests w/ Java 8 and testArgs='-Dtests.slow=false'...
> [smoker] test demo with 1.8...
> [smoker] got 218 hits for query "lucene"
> [smoker] checkindex with 1.8...
> [smoker] generate javadocs w/ Java 8...
> [smoker]
> [smoker] Crawl/parse...
> [smoker]
> [smoker] Verify...
> [smoker] confirm all releases have coverage in TestBackwardsCompatibility
> [smoker] find all past Lucene releases...
> [smoker] run TestBackwardsCompatibility..
> [smoker] Releases that don't seem to be tested:
> [smoker] 5.5.1
> [smoker] Traceback (most recent call last):
> [smoker] File "/x1/jenkins/jenkins-slave/workspace/Lucene-Solr-SmokeRelease-master/dev-tools/scripts/smokeTestRelease.py", line 1414, in <module>
> [smoker] main()
> [smoker] File "/x1/jenkins/jenkins-slave/workspace/Lucene-Solr-SmokeRelease-master/dev-tools/scripts/smokeTestRelease.py", line 1358, in main
> [smoker] smokeTest(c.java, c.url, c.revision, c.version, c.tmp_dir, c.is_signed, ' '.join(c.test_args))
> [smoker] File "/x1/jenkins/jenkins-slave/workspace/Lucene-Solr-SmokeRelease-master/dev-tools/scripts/smokeTestRelease.py", line 1396, in smokeTest
> [smoker] unpackAndVerify(java, 'lucene', tmpDir, 'lucene-%s-src.tgz' % version, gitRevision, version, testArgs, baseURL)
> [smoker] File "/x1/jenkins/jenkins-slave/workspace/Lucene-Solr-SmokeRelease-master/dev-tools/scripts/smokeTestRelease.py", line 590, in unpackAndVerify
> [smoker] verifyUnpacked(java, project, artifact, unpackPath, gitRevision, version, testArgs, tmpDir, baseURL)
> [smoker] File "/x1/jenkins/jenkins-slave/workspace/Lucene-Solr-SmokeRelease-master/dev-tools/scripts/smokeTestRelease.py", line 736, in verifyUnpacked
> [smoker] confirmAllReleasesAreTestedForBackCompat(version, unpackPath)
> [smoker] File "/x1/jenkins/jenkins-slave/workspace/Lucene-Solr-SmokeRelease-master/dev-tools/scripts/smokeTestRelease.py", line 1351, in confirmAllReleasesAreTestedForBackCompat
> [smoker] raise RuntimeError('some releases are not tested by TestBackwardsCompatibility?')
> [smoker] RuntimeError: some releases are not tested by TestBackwardsCompatibility?
>
> BUILD FAILED
> /x1/jenkins/jenkins-slave/workspace/Lucene-Solr-SmokeRelease-master/build.xml:536: exec returned: 1
>
> Total time: 30 minutes 3 seconds
> Build step 'Invoke Ant' marked build as failure
> Email was triggered for: Failure - Any
> Sending email for trigger: Failure - Any
>
>
>
>
> ---------------------------------------------------------------------
> To unsubscribe, e-mail: dev-unsubscribe@lucene.apache.org
> For additional commands, e-mail: dev-help@lucene.apache.org
---------------------------------------------------------------------
To unsubscribe, e-mail: dev-unsubscribe@lucene.apache.org
For additional commands, e-mail: dev-help@lucene.apache.org
[JENKINS] Lucene-Solr-SmokeRelease-master - Build # 485 - Still
Failing
Posted by Apache Jenkins Server <je...@builds.apache.org>.
Build: https://builds.apache.org/job/Lucene-Solr-SmokeRelease-master/485/
No tests ran.
Build Log:
[...truncated 40519 lines...]
prepare-release-no-sign:
[mkdir] Created dir: /x1/jenkins/jenkins-slave/workspace/Lucene-Solr-SmokeRelease-master/lucene/build/smokeTestRelease/dist
[copy] Copying 476 files to /x1/jenkins/jenkins-slave/workspace/Lucene-Solr-SmokeRelease-master/lucene/build/smokeTestRelease/dist/lucene
[copy] Copying 245 files to /x1/jenkins/jenkins-slave/workspace/Lucene-Solr-SmokeRelease-master/lucene/build/smokeTestRelease/dist/solr
[smoker] Java 1.8 JAVA_HOME=/home/jenkins/jenkins-slave/tools/hudson.model.JDK/latest1.8
[smoker] NOTE: output encoding is UTF-8
[smoker]
[smoker] Load release URL "file:/x1/jenkins/jenkins-slave/workspace/Lucene-Solr-SmokeRelease-master/lucene/build/smokeTestRelease/dist/"...
[smoker]
[smoker] Test Lucene...
[smoker] test basics...
[smoker] get KEYS
[smoker] 0.2 MB in 0.02 sec (10.2 MB/sec)
[smoker] check changes HTML...
[smoker] download lucene-7.0.0-src.tgz...
[smoker] 28.6 MB in 0.03 sec (1127.4 MB/sec)
[smoker] verify md5/sha1 digests
[smoker] download lucene-7.0.0.tgz...
[smoker] 63.0 MB in 0.06 sec (1088.2 MB/sec)
[smoker] verify md5/sha1 digests
[smoker] download lucene-7.0.0.zip...
[smoker] 73.5 MB in 0.07 sec (1111.1 MB/sec)
[smoker] verify md5/sha1 digests
[smoker] unpack lucene-7.0.0.tgz...
[smoker] verify JAR metadata/identity/no javax.* or java.* classes...
[smoker] test demo with 1.8...
[smoker] got 6003 hits for query "lucene"
[smoker] checkindex with 1.8...
[smoker] check Lucene's javadoc JAR
[smoker] unpack lucene-7.0.0.zip...
[smoker] verify JAR metadata/identity/no javax.* or java.* classes...
[smoker] test demo with 1.8...
[smoker] got 6003 hits for query "lucene"
[smoker] checkindex with 1.8...
[smoker] check Lucene's javadoc JAR
[smoker] unpack lucene-7.0.0-src.tgz...
[smoker] make sure no JARs/WARs in src dist...
[smoker] run "ant validate"
[smoker] run tests w/ Java 8 and testArgs='-Dtests.slow=false'...
[smoker] test demo with 1.8...
[smoker] got 218 hits for query "lucene"
[smoker] checkindex with 1.8...
[smoker] generate javadocs w/ Java 8...
[smoker]
[smoker] Crawl/parse...
[smoker]
[smoker] Verify...
[smoker] confirm all releases have coverage in TestBackwardsCompatibility
[smoker] find all past Lucene releases...
[smoker] run TestBackwardsCompatibility..
[smoker] Releases that don't seem to be tested:
[smoker] 5.5.1
[smoker] Traceback (most recent call last):
[smoker] File "/x1/jenkins/jenkins-slave/workspace/Lucene-Solr-SmokeRelease-master/dev-tools/scripts/smokeTestRelease.py", line 1414, in <module>
[smoker] main()
[smoker] File "/x1/jenkins/jenkins-slave/workspace/Lucene-Solr-SmokeRelease-master/dev-tools/scripts/smokeTestRelease.py", line 1358, in main
[smoker] smokeTest(c.java, c.url, c.revision, c.version, c.tmp_dir, c.is_signed, ' '.join(c.test_args))
[smoker] File "/x1/jenkins/jenkins-slave/workspace/Lucene-Solr-SmokeRelease-master/dev-tools/scripts/smokeTestRelease.py", line 1396, in smokeTest
[smoker] unpackAndVerify(java, 'lucene', tmpDir, 'lucene-%s-src.tgz' % version, gitRevision, version, testArgs, baseURL)
[smoker] File "/x1/jenkins/jenkins-slave/workspace/Lucene-Solr-SmokeRelease-master/dev-tools/scripts/smokeTestRelease.py", line 590, in unpackAndVerify
[smoker] verifyUnpacked(java, project, artifact, unpackPath, gitRevision, version, testArgs, tmpDir, baseURL)
[smoker] File "/x1/jenkins/jenkins-slave/workspace/Lucene-Solr-SmokeRelease-master/dev-tools/scripts/smokeTestRelease.py", line 736, in verifyUnpacked
[smoker] confirmAllReleasesAreTestedForBackCompat(version, unpackPath)
[smoker] File "/x1/jenkins/jenkins-slave/workspace/Lucene-Solr-SmokeRelease-master/dev-tools/scripts/smokeTestRelease.py", line 1351, in confirmAllReleasesAreTestedForBackCompat
[smoker] raise RuntimeError('some releases are not tested by TestBackwardsCompatibility?')
[smoker] RuntimeError: some releases are not tested by TestBackwardsCompatibility?
BUILD FAILED
/x1/jenkins/jenkins-slave/workspace/Lucene-Solr-SmokeRelease-master/build.xml:536: exec returned: 1
Total time: 30 minutes 3 seconds
Build step 'Invoke Ant' marked build as failure
Email was triggered for: Failure - Any
Sending email for trigger: Failure - Any
[JENKINS] Lucene-Solr-SmokeRelease-master - Build # 484 - Still
Failing
Posted by Apache Jenkins Server <je...@builds.apache.org>.
Build: https://builds.apache.org/job/Lucene-Solr-SmokeRelease-master/484/
No tests ran.
Build Log:
[...truncated 40519 lines...]
prepare-release-no-sign:
[mkdir] Created dir: /x1/jenkins/jenkins-slave/workspace/Lucene-Solr-SmokeRelease-master/lucene/build/smokeTestRelease/dist
[copy] Copying 476 files to /x1/jenkins/jenkins-slave/workspace/Lucene-Solr-SmokeRelease-master/lucene/build/smokeTestRelease/dist/lucene
[copy] Copying 245 files to /x1/jenkins/jenkins-slave/workspace/Lucene-Solr-SmokeRelease-master/lucene/build/smokeTestRelease/dist/solr
[smoker] Java 1.8 JAVA_HOME=/home/jenkins/jenkins-slave/tools/hudson.model.JDK/latest1.8
[smoker] NOTE: output encoding is UTF-8
[smoker]
[smoker] Load release URL "file:/x1/jenkins/jenkins-slave/workspace/Lucene-Solr-SmokeRelease-master/lucene/build/smokeTestRelease/dist/"...
[smoker]
[smoker] Test Lucene...
[smoker] test basics...
[smoker] get KEYS
[smoker] 0.2 MB in 0.02 sec (6.6 MB/sec)
[smoker] check changes HTML...
[smoker] download lucene-7.0.0-src.tgz...
[smoker] 28.6 MB in 0.02 sec (1190.2 MB/sec)
[smoker] verify md5/sha1 digests
[smoker] download lucene-7.0.0.tgz...
[smoker] 63.0 MB in 0.05 sec (1188.8 MB/sec)
[smoker] verify md5/sha1 digests
[smoker] download lucene-7.0.0.zip...
[smoker] 73.5 MB in 0.07 sec (1118.8 MB/sec)
[smoker] verify md5/sha1 digests
[smoker] unpack lucene-7.0.0.tgz...
[smoker] verify JAR metadata/identity/no javax.* or java.* classes...
[smoker] test demo with 1.8...
[smoker] got 6003 hits for query "lucene"
[smoker] checkindex with 1.8...
[smoker] check Lucene's javadoc JAR
[smoker] unpack lucene-7.0.0.zip...
[smoker] verify JAR metadata/identity/no javax.* or java.* classes...
[smoker] test demo with 1.8...
[smoker] got 6003 hits for query "lucene"
[smoker] checkindex with 1.8...
[smoker] check Lucene's javadoc JAR
[smoker] unpack lucene-7.0.0-src.tgz...
[smoker] make sure no JARs/WARs in src dist...
[smoker] run "ant validate"
[smoker] run tests w/ Java 8 and testArgs='-Dtests.slow=false'...
[smoker] test demo with 1.8...
[smoker] got 218 hits for query "lucene"
[smoker] checkindex with 1.8...
[smoker] generate javadocs w/ Java 8...
[smoker]
[smoker] Crawl/parse...
[smoker]
[smoker] Verify...
[smoker] confirm all releases have coverage in TestBackwardsCompatibility
[smoker] find all past Lucene releases...
[smoker] run TestBackwardsCompatibility..
[smoker] Releases that don't seem to be tested:
[smoker] 5.5.1
[smoker] Traceback (most recent call last):
[smoker] File "/x1/jenkins/jenkins-slave/workspace/Lucene-Solr-SmokeRelease-master/dev-tools/scripts/smokeTestRelease.py", line 1414, in <module>
[smoker] main()
[smoker] File "/x1/jenkins/jenkins-slave/workspace/Lucene-Solr-SmokeRelease-master/dev-tools/scripts/smokeTestRelease.py", line 1358, in main
[smoker] smokeTest(c.java, c.url, c.revision, c.version, c.tmp_dir, c.is_signed, ' '.join(c.test_args))
[smoker] File "/x1/jenkins/jenkins-slave/workspace/Lucene-Solr-SmokeRelease-master/dev-tools/scripts/smokeTestRelease.py", line 1396, in smokeTest
[smoker] unpackAndVerify(java, 'lucene', tmpDir, 'lucene-%s-src.tgz' % version, gitRevision, version, testArgs, baseURL)
[smoker] File "/x1/jenkins/jenkins-slave/workspace/Lucene-Solr-SmokeRelease-master/dev-tools/scripts/smokeTestRelease.py", line 590, in unpackAndVerify
[smoker] verifyUnpacked(java, project, artifact, unpackPath, gitRevision, version, testArgs, tmpDir, baseURL)
[smoker] File "/x1/jenkins/jenkins-slave/workspace/Lucene-Solr-SmokeRelease-master/dev-tools/scripts/smokeTestRelease.py", line 736, in verifyUnpacked
[smoker] confirmAllReleasesAreTestedForBackCompat(version, unpackPath)
[smoker] File "/x1/jenkins/jenkins-slave/workspace/Lucene-Solr-SmokeRelease-master/dev-tools/scripts/smokeTestRelease.py", line 1351, in confirmAllReleasesAreTestedForBackCompat
[smoker] raise RuntimeError('some releases are not tested by TestBackwardsCompatibility?')
[smoker] RuntimeError: some releases are not tested by TestBackwardsCompatibility?
BUILD FAILED
/x1/jenkins/jenkins-slave/workspace/Lucene-Solr-SmokeRelease-master/build.xml:536: exec returned: 1
Total time: 29 minutes 56 seconds
Build step 'Invoke Ant' marked build as failure
Email was triggered for: Failure - Any
Sending email for trigger: Failure - Any