You are viewing a plain text version of this content. The canonical link for it is here.
Posted to builds@beam.apache.org by Apache Jenkins Server <je...@builds.apache.org> on 2021/03/17 12:34:16 UTC

Build failed in Jenkins: beam_PostCommit_XVR_Spark #2065

See <https://ci-beam.apache.org/job/beam_PostCommit_XVR_Spark/2065/display/redirect?page=changes>

Changes:

[noreply] Merge pull request #14252 from Add types to FileMatching

[noreply] [BEAM-11969] Adds an option for setting row-group size in ParquetIO


------------------------------------------
[...truncated 840.75 KB...]
root: DEBUG: Sending SIGINT to job_server
root: DEBUG: Unhandled type_constraint: Union[]
root: DEBUG: Unhandled type_constraint: Union[]
root: DEBUG: Unhandled type_constraint: Union[]
root: DEBUG: Unhandled type_constraint: Union[]
root: WARNING: Make sure that locally built Python SDK docker image has Python 3.6 interpreter.
root: INFO: Default Python SDK image for environment is apache/beam_python3.6_sdk:2.30.0.dev
root: INFO: No image given, using default Python SDK image
root: WARNING: Make sure that locally built Python SDK docker image has Python 3.6 interpreter.
root: INFO: Default Python SDK image for environment is apache/beam_python3.6_sdk:2.30.0.dev
root: INFO: Python SDK container image set to "apache/beam_python3.6_sdk:2.30.0.dev" for Docker environment
apache_beam.runners.portability.fn_api_runner.translations: INFO: ==================== <function lift_combiners at 0x7f8796f45158> ====================
apache_beam.runners.portability.fn_api_runner.translations: DEBUG: 40 [1, 1, 1, 1, 1, 1, 1, 1, 1, 1, 1, 1, 1, 1, 1, 1, 1, 1, 1, 1, 1, 1, 1, 1, 1, 1, 1, 1, 1, 1, 1, 1, 1, 1, 1, 1, 1, 1, 1, 1]
apache_beam.runners.portability.fn_api_runner.translations: DEBUG: Stages: ['ref_AppliedPTransform_Create enrich/Impulse_3\n  Create enrich/Impulse:beam:transform:impulse:v1\n  must follow: \n  downstream_side_inputs: <unknown>', 'ref_AppliedPTransform_Create enrich/FlatMap(<lambda at core.py:2971>)_4\n  Create enrich/FlatMap(<lambda at core.py:2971>):beam:transform:pardo:v1\n  must follow: \n  downstream_side_inputs: <unknown>', 'ref_AppliedPTransform_Create enrich/MaybeReshuffle/Reshuffle/AddRandomKeys_7\n  Create enrich/MaybeReshuffle/Reshuffle/AddRandomKeys:beam:transform:pardo:v1\n  must follow: \n  downstream_side_inputs: <unknown>', 'ref_AppliedPTransform_Create enrich/MaybeReshuffle/Reshuffle/ReshufflePerKey/Map(reify_timestamps)_9\n  Create enrich/MaybeReshuffle/Reshuffle/ReshufflePerKey/Map(reify_timestamps):beam:transform:pardo:v1\n  must follow: \n  downstream_side_inputs: <unknown>', 'ref_AppliedPTransform_Create enrich/MaybeReshuffle/Reshuffle/ReshufflePerKey/GroupByKey_10\n  Create enrich/MaybeReshuffle/Reshuffle/ReshufflePerKey/GroupByKey:beam:transform:group_by_key:v1\n  must follow: \n  downstream_side_inputs: <unknown>', 'ref_AppliedPTransform_Create enrich/MaybeReshuffle/Reshuffle/ReshufflePerKey/FlatMap(restore_timestamps)_11\n  Create enrich/MaybeReshuffle/Reshuffle/ReshufflePerKey/FlatMap(restore_timestamps):beam:transform:pardo:v1\n  must follow: \n  downstream_side_inputs: <unknown>', 'ref_AppliedPTransform_Create enrich/MaybeReshuffle/Reshuffle/RemoveRandomKeys_12\n  Create enrich/MaybeReshuffle/Reshuffle/RemoveRandomKeys:beam:transform:pardo:v1\n  must follow: \n  downstream_side_inputs: <unknown>', 'ref_AppliedPTransform_Create enrich/Map(decode)_13\n  Create enrich/Map(decode):beam:transform:pardo:v1\n  must follow: \n  downstream_side_inputs: <unknown>', 'ref_AppliedPTransform_Create simple/Impulse_15\n  Create simple/Impulse:beam:transform:impulse:v1\n  must follow: \n  downstream_side_inputs: <unknown>', 'ref_AppliedPTransform_Create simple/FlatMap(<lambda at core.py:2971>)_16\n  Create simple/FlatMap(<lambda at core.py:2971>):beam:transform:pardo:v1\n  must follow: \n  downstream_side_inputs: <unknown>', 'ref_AppliedPTransform_Create simple/MaybeReshuffle/Reshuffle/AddRandomKeys_19\n  Create simple/MaybeReshuffle/Reshuffle/AddRandomKeys:beam:transform:pardo:v1\n  must follow: \n  downstream_side_inputs: <unknown>', 'ref_AppliedPTransform_Create simple/MaybeReshuffle/Reshuffle/ReshufflePerKey/Map(reify_timestamps)_21\n  Create simple/MaybeReshuffle/Reshuffle/ReshufflePerKey/Map(reify_timestamps):beam:transform:pardo:v1\n  must follow: \n  downstream_side_inputs: <unknown>', 'ref_AppliedPTransform_Create simple/MaybeReshuffle/Reshuffle/ReshufflePerKey/GroupByKey_22\n  Create simple/MaybeReshuffle/Reshuffle/ReshufflePerKey/GroupByKey:beam:transform:group_by_key:v1\n  must follow: \n  downstream_side_inputs: <unknown>', 'ref_AppliedPTransform_Create simple/MaybeReshuffle/Reshuffle/ReshufflePerKey/FlatMap(restore_timestamps)_23\n  Create simple/MaybeReshuffle/Reshuffle/ReshufflePerKey/FlatMap(restore_timestamps):beam:transform:pardo:v1\n  must follow: \n  downstream_side_inputs: <unknown>', 'ref_AppliedPTransform_Create simple/MaybeReshuffle/Reshuffle/RemoveRandomKeys_24\n  Create simple/MaybeReshuffle/Reshuffle/RemoveRandomKeys:beam:transform:pardo:v1\n  must follow: \n  downstream_side_inputs: <unknown>', 'ref_AppliedPTransform_Create simple/Map(decode)_25\n  Create simple/Map(decode):beam:transform:pardo:v1\n  must follow: \n  downstream_side_inputs: <unknown>', 'external_7SqlTransform(beam:external:java:sql:v1)/BeamCoGBKJoinRel_95/left_TimestampCombiner/Flatten.PCollections\n  SqlTransform(beam:external:java:sql:v1)/BeamCoGBKJoinRel_95/left_TimestampCombiner/Flatten.PCollections:beam:transform:flatten:v1\n  must follow: \n  downstream_side_inputs: <unknown>', 'external_7SqlTransform(beam:external:java:sql:v1)/BeamCoGBKJoinRel_95/right_TimestampCombiner/Flatten.PCollections\n  SqlTransform(beam:external:java:sql:v1)/BeamCoGBKJoinRel_95/right_TimestampCombiner/Flatten.PCollections:beam:transform:flatten:v1\n  must follow: \n  downstream_side_inputs: <unknown>', 'external_7SqlTransform(beam:external:java:sql:v1)/BeamCoGBKJoinRel_95/Join.Impl/CoGroup.ExpandCrossProduct/extractKeylhs/ParMultiDo(Anonymous)\n  SqlTransform(beam:external:java:sql:v1)/BeamCoGBKJoinRel_95/Join.Impl/CoGroup.ExpandCrossProduct/extractKeylhs/ParMultiDo(Anonymous):beam:transform:pardo:v1\n  must follow: \n  downstream_side_inputs: <unknown>', 'external_7SqlTransform(beam:external:java:sql:v1)/BeamCoGBKJoinRel_95/Join.Impl/CoGroup.ExpandCrossProduct/extractKeyrhs/ParMultiDo(Anonymous)\n  SqlTransform(beam:external:java:sql:v1)/BeamCoGBKJoinRel_95/Join.Impl/CoGroup.ExpandCrossProduct/extractKeyrhs/ParMultiDo(Anonymous):beam:transform:pardo:v1\n  must follow: \n  downstream_side_inputs: <unknown>', 'external_7SqlTransform(beam:external:java:sql:v1)/BeamCoGBKJoinRel_95/Join.Impl/CoGroup.ExpandCrossProduct/CoGroupByKey/MakeUnionTable0/ParMultiDo(ConstructUnionTable)\n  SqlTransform(beam:external:java:sql:v1)/BeamCoGBKJoinRel_95/Join.Impl/CoGroup.ExpandCrossProduct/CoGroupByKey/MakeUnionTable0/ParMultiDo(ConstructUnionTable):beam:transform:pardo:v1\n  must follow: \n  downstream_side_inputs: <unknown>', 'external_7SqlTransform(beam:external:java:sql:v1)/BeamCoGBKJoinRel_95/Join.Impl/CoGroup.ExpandCrossProduct/CoGroupByKey/MakeUnionTable1/ParMultiDo(ConstructUnionTable)\n  SqlTransform(beam:external:java:sql:v1)/BeamCoGBKJoinRel_95/Join.Impl/CoGroup.ExpandCrossProduct/CoGroupByKey/MakeUnionTable1/ParMultiDo(ConstructUnionTable):beam:transform:pardo:v1\n  must follow: \n  downstream_side_inputs: <unknown>', 'external_7SqlTransform(beam:external:java:sql:v1)/BeamCoGBKJoinRel_95/Join.Impl/CoGroup.ExpandCrossProduct/CoGroupByKey/Flatten\n  SqlTransform(beam:external:java:sql:v1)/BeamCoGBKJoinRel_95/Join.Impl/CoGroup.ExpandCrossProduct/CoGroupByKey/Flatten:beam:transform:flatten:v1\n  must follow: \n  downstream_side_inputs: <unknown>', 'external_7SqlTransform(beam:external:java:sql:v1)/BeamCoGBKJoinRel_95/Join.Impl/CoGroup.ExpandCrossProduct/CoGroupByKey/GBK\n  SqlTransform(beam:external:java:sql:v1)/BeamCoGBKJoinRel_95/Join.Impl/CoGroup.ExpandCrossProduct/CoGroupByKey/GBK:beam:transform:group_by_key:v1\n  must follow: \n  downstream_side_inputs: <unknown>', 'external_7SqlTransform(beam:external:java:sql:v1)/BeamCoGBKJoinRel_95/Join.Impl/CoGroup.ExpandCrossProduct/CoGroupByKey/ConstructCoGbkResultFn/ParMultiDo(ConstructCoGbkResult)\n  SqlTransform(beam:external:java:sql:v1)/BeamCoGBKJoinRel_95/Join.Impl/CoGroup.ExpandCrossProduct/CoGroupByKey/ConstructCoGbkResultFn/ParMultiDo(ConstructCoGbkResult):beam:transform:pardo:v1\n  must follow: \n  downstream_side_inputs: <unknown>', 'external_7SqlTransform(beam:external:java:sql:v1)/BeamCoGBKJoinRel_95/Join.Impl/CoGroup.ExpandCrossProduct/ParDo(ConvertCoGbkResult)/ParMultiDo(ConvertCoGbkResult)\n  SqlTransform(beam:external:java:sql:v1)/BeamCoGBKJoinRel_95/Join.Impl/CoGroup.ExpandCrossProduct/ParDo(ConvertCoGbkResult)/ParMultiDo(ConvertCoGbkResult):beam:transform:pardo:v1\n  must follow: \n  downstream_side_inputs: <unknown>', 'external_7SqlTransform(beam:external:java:sql:v1)/BeamCoGBKJoinRel_95/Select.Fields/ParDo(Select)/ParMultiDo(Select)\n  SqlTransform(beam:external:java:sql:v1)/BeamCoGBKJoinRel_95/Select.Fields/ParDo(Select)/ParMultiDo(Select):beam:transform:pardo:v1\n  must follow: \n  downstream_side_inputs: <unknown>', 'external_7SqlTransform(beam:external:java:sql:v1)/BeamCalcRel_96/ParDo(Calc)/ParMultiDo(Calc)\n  SqlTransform(beam:external:java:sql:v1)/BeamCalcRel_96/ParDo(Calc)/ParMultiDo(Calc):beam:transform:pardo:v1\n  must follow: \n  downstream_side_inputs: <unknown>', 'ref_AppliedPTransform_assert_that/Create/Impulse_29\n  assert_that/Create/Impulse:beam:transform:impulse:v1\n  must follow: \n  downstream_side_inputs: <unknown>', 'ref_AppliedPTransform_assert_that/Create/FlatMap(<lambda at core.py:2971>)_30\n  assert_that/Create/FlatMap(<lambda at core.py:2971>):beam:transform:pardo:v1\n  must follow: \n  downstream_side_inputs: <unknown>', 'ref_AppliedPTransform_assert_that/Create/Map(decode)_32\n  assert_that/Create/Map(decode):beam:transform:pardo:v1\n  must follow: \n  downstream_side_inputs: <unknown>', 'ref_AppliedPTransform_assert_that/WindowInto(WindowIntoFn)_33\n  assert_that/WindowInto(WindowIntoFn):beam:transform:window_into:v1\n  must follow: \n  downstream_side_inputs: <unknown>', 'ref_AppliedPTransform_assert_that/ToVoidKey_34\n  assert_that/ToVoidKey:beam:transform:pardo:v1\n  must follow: \n  downstream_side_inputs: <unknown>', 'ref_AppliedPTransform_assert_that/Group/pair_with_0_36\n  assert_that/Group/pair_with_0:beam:transform:pardo:v1\n  must follow: \n  downstream_side_inputs: <unknown>', 'ref_AppliedPTransform_assert_that/Group/pair_with_1_37\n  assert_that/Group/pair_with_1:beam:transform:pardo:v1\n  must follow: \n  downstream_side_inputs: <unknown>', 'ref_AppliedPTransform_assert_that/Group/Flatten_38\n  assert_that/Group/Flatten:beam:transform:flatten:v1\n  must follow: \n  downstream_side_inputs: <unknown>', 'ref_AppliedPTransform_assert_that/Group/GroupByKey_39\n  assert_that/Group/GroupByKey:beam:transform:group_by_key:v1\n  must follow: \n  downstream_side_inputs: <unknown>', 'ref_AppliedPTransform_assert_that/Group/Map(_merge_tagged_vals_under_key)_40\n  assert_that/Group/Map(_merge_tagged_vals_under_key):beam:transform:pardo:v1\n  must follow: \n  downstream_side_inputs: <unknown>', 'ref_AppliedPTransform_assert_that/Unkey_41\n  assert_that/Unkey:beam:transform:pardo:v1\n  must follow: \n  downstream_side_inputs: <unknown>', 'ref_AppliedPTransform_assert_that/Match_42\n  assert_that/Match:beam:transform:pardo:v1\n  must follow: \n  downstream_side_inputs: <unknown>']
apache_beam.runners.portability.fn_api_runner.translations: INFO: ==================== <function sort_stages at 0x7f8796f45840> ====================
apache_beam.runners.portability.fn_api_runner.translations: DEBUG: 40 [1, 1, 1, 1, 1, 1, 1, 1, 1, 1, 1, 1, 1, 1, 1, 1, 1, 1, 1, 1, 1, 1, 1, 1, 1, 1, 1, 1, 1, 1, 1, 1, 1, 1, 1, 1, 1, 1, 1, 1]
apache_beam.runners.portability.fn_api_runner.translations: DEBUG: Stages: ['ref_AppliedPTransform_Create enrich/Impulse_3\n  Create enrich/Impulse:beam:transform:impulse:v1\n  must follow: \n  downstream_side_inputs: <unknown>', 'ref_AppliedPTransform_Create enrich/FlatMap(<lambda at core.py:2971>)_4\n  Create enrich/FlatMap(<lambda at core.py:2971>):beam:transform:pardo:v1\n  must follow: \n  downstream_side_inputs: <unknown>', 'ref_AppliedPTransform_Create enrich/MaybeReshuffle/Reshuffle/AddRandomKeys_7\n  Create enrich/MaybeReshuffle/Reshuffle/AddRandomKeys:beam:transform:pardo:v1\n  must follow: \n  downstream_side_inputs: <unknown>', 'ref_AppliedPTransform_Create enrich/MaybeReshuffle/Reshuffle/ReshufflePerKey/Map(reify_timestamps)_9\n  Create enrich/MaybeReshuffle/Reshuffle/ReshufflePerKey/Map(reify_timestamps):beam:transform:pardo:v1\n  must follow: \n  downstream_side_inputs: <unknown>', 'ref_AppliedPTransform_Create enrich/MaybeReshuffle/Reshuffle/ReshufflePerKey/GroupByKey_10\n  Create enrich/MaybeReshuffle/Reshuffle/ReshufflePerKey/GroupByKey:beam:transform:group_by_key:v1\n  must follow: \n  downstream_side_inputs: <unknown>', 'ref_AppliedPTransform_Create enrich/MaybeReshuffle/Reshuffle/ReshufflePerKey/FlatMap(restore_timestamps)_11\n  Create enrich/MaybeReshuffle/Reshuffle/ReshufflePerKey/FlatMap(restore_timestamps):beam:transform:pardo:v1\n  must follow: \n  downstream_side_inputs: <unknown>', 'ref_AppliedPTransform_Create enrich/MaybeReshuffle/Reshuffle/RemoveRandomKeys_12\n  Create enrich/MaybeReshuffle/Reshuffle/RemoveRandomKeys:beam:transform:pardo:v1\n  must follow: \n  downstream_side_inputs: <unknown>', 'ref_AppliedPTransform_Create enrich/Map(decode)_13\n  Create enrich/Map(decode):beam:transform:pardo:v1\n  must follow: \n  downstream_side_inputs: <unknown>', 'ref_AppliedPTransform_Create simple/Impulse_15\n  Create simple/Impulse:beam:transform:impulse:v1\n  must follow: \n  downstream_side_inputs: <unknown>', 'ref_AppliedPTransform_Create simple/FlatMap(<lambda at core.py:2971>)_16\n  Create simple/FlatMap(<lambda at core.py:2971>):beam:transform:pardo:v1\n  must follow: \n  downstream_side_inputs: <unknown>', 'ref_AppliedPTransform_Create simple/MaybeReshuffle/Reshuffle/AddRandomKeys_19\n  Create simple/MaybeReshuffle/Reshuffle/AddRandomKeys:beam:transform:pardo:v1\n  must follow: \n  downstream_side_inputs: <unknown>', 'ref_AppliedPTransform_Create simple/MaybeReshuffle/Reshuffle/ReshufflePerKey/Map(reify_timestamps)_21\n  Create simple/MaybeReshuffle/Reshuffle/ReshufflePerKey/Map(reify_timestamps):beam:transform:pardo:v1\n  must follow: \n  downstream_side_inputs: <unknown>', 'ref_AppliedPTransform_Create simple/MaybeReshuffle/Reshuffle/ReshufflePerKey/GroupByKey_22\n  Create simple/MaybeReshuffle/Reshuffle/ReshufflePerKey/GroupByKey:beam:transform:group_by_key:v1\n  must follow: \n  downstream_side_inputs: <unknown>', 'ref_AppliedPTransform_Create simple/MaybeReshuffle/Reshuffle/ReshufflePerKey/FlatMap(restore_timestamps)_23\n  Create simple/MaybeReshuffle/Reshuffle/ReshufflePerKey/FlatMap(restore_timestamps):beam:transform:pardo:v1\n  must follow: \n  downstream_side_inputs: <unknown>', 'ref_AppliedPTransform_Create simple/MaybeReshuffle/Reshuffle/RemoveRandomKeys_24\n  Create simple/MaybeReshuffle/Reshuffle/RemoveRandomKeys:beam:transform:pardo:v1\n  must follow: \n  downstream_side_inputs: <unknown>', 'ref_AppliedPTransform_Create simple/Map(decode)_25\n  Create simple/Map(decode):beam:transform:pardo:v1\n  must follow: \n  downstream_side_inputs: <unknown>', 'external_7SqlTransform(beam:external:java:sql:v1)/BeamCoGBKJoinRel_95/left_TimestampCombiner/Flatten.PCollections\n  SqlTransform(beam:external:java:sql:v1)/BeamCoGBKJoinRel_95/left_TimestampCombiner/Flatten.PCollections:beam:transform:flatten:v1\n  must follow: \n  downstream_side_inputs: <unknown>', 'external_7SqlTransform(beam:external:java:sql:v1)/BeamCoGBKJoinRel_95/right_TimestampCombiner/Flatten.PCollections\n  SqlTransform(beam:external:java:sql:v1)/BeamCoGBKJoinRel_95/right_TimestampCombiner/Flatten.PCollections:beam:transform:flatten:v1\n  must follow: \n  downstream_side_inputs: <unknown>', 'external_7SqlTransform(beam:external:java:sql:v1)/BeamCoGBKJoinRel_95/Join.Impl/CoGroup.ExpandCrossProduct/extractKeylhs/ParMultiDo(Anonymous)\n  SqlTransform(beam:external:java:sql:v1)/BeamCoGBKJoinRel_95/Join.Impl/CoGroup.ExpandCrossProduct/extractKeylhs/ParMultiDo(Anonymous):beam:transform:pardo:v1\n  must follow: \n  downstream_side_inputs: <unknown>', 'external_7SqlTransform(beam:external:java:sql:v1)/BeamCoGBKJoinRel_95/Join.Impl/CoGroup.ExpandCrossProduct/extractKeyrhs/ParMultiDo(Anonymous)\n  SqlTransform(beam:external:java:sql:v1)/BeamCoGBKJoinRel_95/Join.Impl/CoGroup.ExpandCrossProduct/extractKeyrhs/ParMultiDo(Anonymous):beam:transform:pardo:v1\n  must follow: \n  downstream_side_inputs: <unknown>', 'external_7SqlTransform(beam:external:java:sql:v1)/BeamCoGBKJoinRel_95/Join.Impl/CoGroup.ExpandCrossProduct/CoGroupByKey/MakeUnionTable0/ParMultiDo(ConstructUnionTable)\n  SqlTransform(beam:external:java:sql:v1)/BeamCoGBKJoinRel_95/Join.Impl/CoGroup.ExpandCrossProduct/CoGroupByKey/MakeUnionTable0/ParMultiDo(ConstructUnionTable):beam:transform:pardo:v1\n  must follow: \n  downstream_side_inputs: <unknown>', 'external_7SqlTransform(beam:external:java:sql:v1)/BeamCoGBKJoinRel_95/Join.Impl/CoGroup.ExpandCrossProduct/CoGroupByKey/MakeUnionTable1/ParMultiDo(ConstructUnionTable)\n  SqlTransform(beam:external:java:sql:v1)/BeamCoGBKJoinRel_95/Join.Impl/CoGroup.ExpandCrossProduct/CoGroupByKey/MakeUnionTable1/ParMultiDo(ConstructUnionTable):beam:transform:pardo:v1\n  must follow: \n  downstream_side_inputs: <unknown>', 'external_7SqlTransform(beam:external:java:sql:v1)/BeamCoGBKJoinRel_95/Join.Impl/CoGroup.ExpandCrossProduct/CoGroupByKey/Flatten\n  SqlTransform(beam:external:java:sql:v1)/BeamCoGBKJoinRel_95/Join.Impl/CoGroup.ExpandCrossProduct/CoGroupByKey/Flatten:beam:transform:flatten:v1\n  must follow: \n  downstream_side_inputs: <unknown>', 'external_7SqlTransform(beam:external:java:sql:v1)/BeamCoGBKJoinRel_95/Join.Impl/CoGroup.ExpandCrossProduct/CoGroupByKey/GBK\n  SqlTransform(beam:external:java:sql:v1)/BeamCoGBKJoinRel_95/Join.Impl/CoGroup.ExpandCrossProduct/CoGroupByKey/GBK:beam:transform:group_by_key:v1\n  must follow: \n  downstream_side_inputs: <unknown>', 'external_7SqlTransform(beam:external:java:sql:v1)/BeamCoGBKJoinRel_95/Join.Impl/CoGroup.ExpandCrossProduct/CoGroupByKey/ConstructCoGbkResultFn/ParMultiDo(ConstructCoGbkResult)\n  SqlTransform(beam:external:java:sql:v1)/BeamCoGBKJoinRel_95/Join.Impl/CoGroup.ExpandCrossProduct/CoGroupByKey/ConstructCoGbkResultFn/ParMultiDo(ConstructCoGbkResult):beam:transform:pardo:v1\n  must follow: \n  downstream_side_inputs: <unknown>', 'external_7SqlTransform(beam:external:java:sql:v1)/BeamCoGBKJoinRel_95/Join.Impl/CoGroup.ExpandCrossProduct/ParDo(ConvertCoGbkResult)/ParMultiDo(ConvertCoGbkResult)\n  SqlTransform(beam:external:java:sql:v1)/BeamCoGBKJoinRel_95/Join.Impl/CoGroup.ExpandCrossProduct/ParDo(ConvertCoGbkResult)/ParMultiDo(ConvertCoGbkResult):beam:transform:pardo:v1\n  must follow: \n  downstream_side_inputs: <unknown>', 'external_7SqlTransform(beam:external:java:sql:v1)/BeamCoGBKJoinRel_95/Select.Fields/ParDo(Select)/ParMultiDo(Select)\n  SqlTransform(beam:external:java:sql:v1)/BeamCoGBKJoinRel_95/Select.Fields/ParDo(Select)/ParMultiDo(Select):beam:transform:pardo:v1\n  must follow: \n  downstream_side_inputs: <unknown>', 'external_7SqlTransform(beam:external:java:sql:v1)/BeamCalcRel_96/ParDo(Calc)/ParMultiDo(Calc)\n  SqlTransform(beam:external:java:sql:v1)/BeamCalcRel_96/ParDo(Calc)/ParMultiDo(Calc):beam:transform:pardo:v1\n  must follow: \n  downstream_side_inputs: <unknown>', 'ref_AppliedPTransform_assert_that/Create/Impulse_29\n  assert_that/Create/Impulse:beam:transform:impulse:v1\n  must follow: \n  downstream_side_inputs: <unknown>', 'ref_AppliedPTransform_assert_that/Create/FlatMap(<lambda at core.py:2971>)_30\n  assert_that/Create/FlatMap(<lambda at core.py:2971>):beam:transform:pardo:v1\n  must follow: \n  downstream_side_inputs: <unknown>', 'ref_AppliedPTransform_assert_that/Create/Map(decode)_32\n  assert_that/Create/Map(decode):beam:transform:pardo:v1\n  must follow: \n  downstream_side_inputs: <unknown>', 'ref_AppliedPTransform_assert_that/WindowInto(WindowIntoFn)_33\n  assert_that/WindowInto(WindowIntoFn):beam:transform:window_into:v1\n  must follow: \n  downstream_side_inputs: <unknown>', 'ref_AppliedPTransform_assert_that/ToVoidKey_34\n  assert_that/ToVoidKey:beam:transform:pardo:v1\n  must follow: \n  downstream_side_inputs: <unknown>', 'ref_AppliedPTransform_assert_that/Group/pair_with_0_36\n  assert_that/Group/pair_with_0:beam:transform:pardo:v1\n  must follow: \n  downstream_side_inputs: <unknown>', 'ref_AppliedPTransform_assert_that/Group/pair_with_1_37\n  assert_that/Group/pair_with_1:beam:transform:pardo:v1\n  must follow: \n  downstream_side_inputs: <unknown>', 'ref_AppliedPTransform_assert_that/Group/Flatten_38\n  assert_that/Group/Flatten:beam:transform:flatten:v1\n  must follow: \n  downstream_side_inputs: <unknown>', 'ref_AppliedPTransform_assert_that/Group/GroupByKey_39\n  assert_that/Group/GroupByKey:beam:transform:group_by_key:v1\n  must follow: \n  downstream_side_inputs: <unknown>', 'ref_AppliedPTransform_assert_that/Group/Map(_merge_tagged_vals_under_key)_40\n  assert_that/Group/Map(_merge_tagged_vals_under_key):beam:transform:pardo:v1\n  must follow: \n  downstream_side_inputs: <unknown>', 'ref_AppliedPTransform_assert_that/Unkey_41\n  assert_that/Unkey:beam:transform:pardo:v1\n  must follow: \n  downstream_side_inputs: <unknown>', 'ref_AppliedPTransform_assert_that/Match_42\n  assert_that/Match:beam:transform:pardo:v1\n  must follow: \n  downstream_side_inputs: <unknown>']
--------------------- >> end captured logging << ---------------------

======================================================================
ERROR: test_windowing_before_sql (apache_beam.transforms.sql_test.SqlTransformTest)
----------------------------------------------------------------------
Traceback (most recent call last):
  File "<https://ci-beam.apache.org/job/beam_PostCommit_XVR_Spark/ws/src/sdks/python/apache_beam/transforms/sql_test.py",> line 179, in test_windowing_before_sql
    assert_that(out, equal_to([(1, ), (1, ), (1, )]))
  File "<https://ci-beam.apache.org/job/beam_PostCommit_XVR_Spark/ws/src/sdks/python/apache_beam/pipeline.py",> line 582, in __exit__
    self.result = self.run()
  File "<https://ci-beam.apache.org/job/beam_PostCommit_XVR_Spark/ws/src/sdks/python/apache_beam/testing/test_pipeline.py",> line 112, in run
    False if self.not_use_test_runner_api else test_runner_api))
  File "<https://ci-beam.apache.org/job/beam_PostCommit_XVR_Spark/ws/src/sdks/python/apache_beam/pipeline.py",> line 561, in run
    return self.runner.run_pipeline(self, self._options)
  File "<https://ci-beam.apache.org/job/beam_PostCommit_XVR_Spark/ws/src/sdks/python/apache_beam/runners/portability/portable_runner.py",> line 440, in run_pipeline
    job_service_handle = self.create_job_service(options)
  File "<https://ci-beam.apache.org/job/beam_PostCommit_XVR_Spark/ws/src/sdks/python/apache_beam/runners/portability/portable_runner.py",> line 320, in create_job_service
    return self.create_job_service_handle(server.start(), options)
  File "<https://ci-beam.apache.org/job/beam_PostCommit_XVR_Spark/ws/src/sdks/python/apache_beam/runners/portability/job_server.py",> line 56, in start
    grpc.channel_ready_future(channel).result(timeout=self._timeout)
  File "<https://ci-beam.apache.org/job/beam_PostCommit_XVR_Spark/ws/src/build/gradleenv/1922375555/lib/python3.6/site-packages/grpc/_utilities.py",> line 140, in result
    self._block(timeout)
  File "<https://ci-beam.apache.org/job/beam_PostCommit_XVR_Spark/ws/src/build/gradleenv/1922375555/lib/python3.6/site-packages/grpc/_utilities.py",> line 86, in _block
    raise grpc.FutureTimeoutError()
grpc.FutureTimeoutError: 
-------------------- >> begin captured logging << --------------------
apache_beam.utils.subprocess_server: INFO: Using pre-built snapshot at <https://ci-beam.apache.org/job/beam_PostCommit_XVR_Spark/ws/src/sdks/java/extensions/sql/expansion-service/build/libs/beam-sdks-java-extensions-sql-expansion-service-2.30.0-SNAPSHOT.jar>
apache_beam.utils.subprocess_server: INFO: Starting service with ['java' '-jar' '<https://ci-beam.apache.org/job/beam_PostCommit_XVR_Spark/ws/src/sdks/java/extensions/sql/expansion-service/build/libs/beam-sdks-java-extensions-sql-expansion-service-2.30.0-SNAPSHOT.jar'> '53995']
root: DEBUG: Waiting for grpc channel to be ready at localhost:53995.
apache_beam.utils.subprocess_server: INFO: b'Starting expansion service at localhost:53995'
root: DEBUG: Waiting for grpc channel to be ready at localhost:53995.
apache_beam.utils.subprocess_server: INFO: b'Mar 17, 2021 12:31:49 PM org.apache.beam.sdk.expansion.service.ExpansionService loadRegisteredTransforms'
apache_beam.utils.subprocess_server: INFO: b'INFO: Registering external transforms: [beam:external:java:sql:v1, beam:external:java:generate_sequence:v1]'
apache_beam.utils.subprocess_server: INFO: b'\tbeam:external:java:sql:v1: org.apache.beam.sdk.expansion.service.ExpansionService$ExternalTransformRegistrarLoader$$Lambda$3/1130478920@5680a178'
apache_beam.utils.subprocess_server: INFO: b'\tbeam:external:java:generate_sequence:v1: org.apache.beam.sdk.expansion.service.ExpansionService$ExternalTransformRegistrarLoader$$Lambda$3/1130478920@5fdef03a'
root: DEBUG: Waiting for grpc channel to be ready at localhost:53995.
root: DEBUG: Waiting for grpc channel to be ready at localhost:53995.
root: DEBUG: Waiting for grpc channel to be ready at localhost:53995.
root: DEBUG: Waiting for grpc channel to be ready at localhost:53995.
apache_beam.utils.subprocess_server: INFO: b'Mar 17, 2021 12:31:50 PM org.apache.beam.sdk.expansion.service.ExpansionService expand'
apache_beam.utils.subprocess_server: INFO: b"INFO: Expanding 'SqlTransform(beam:external:java:sql:v1)' with URN 'beam:external:java:sql:v1'"
apache_beam.utils.subprocess_server: INFO: b'Mar 17, 2021 12:31:51 PM org.apache.beam.sdk.expansion.service.ExpansionService$ExternalTransformRegistrarLoader payloadToConfig'
apache_beam.utils.subprocess_server: INFO: b"WARNING: Configuration class 'org.apache.beam.sdk.extensions.sql.expansion.ExternalSqlTransformRegistrar$Configuration' has no schema registered. Attempting to construct with setter approach."
apache_beam.utils.subprocess_server: INFO: b'Mar 17, 2021 12:31:52 PM org.apache.beam.sdk.extensions.sql.impl.CalciteQueryPlanner convertToBeamRel'
apache_beam.utils.subprocess_server: INFO: b'INFO: SQL:'
apache_beam.utils.subprocess_server: INFO: b'SELECT COUNT(*) AS `count`'
apache_beam.utils.subprocess_server: INFO: b'FROM `beam`.`PCOLLECTION` AS `PCOLLECTION`'
apache_beam.utils.subprocess_server: INFO: b'Mar 17, 2021 12:31:52 PM org.apache.beam.sdk.extensions.sql.impl.CalciteQueryPlanner convertToBeamRel'
apache_beam.utils.subprocess_server: INFO: b'INFO: SQLPlan>'
apache_beam.utils.subprocess_server: INFO: b'LogicalAggregate(group=[{}], count=[COUNT()])'
apache_beam.utils.subprocess_server: INFO: b'  LogicalProject($f0=[0])'
apache_beam.utils.subprocess_server: INFO: b'    BeamIOSourceRel(table=[[beam, PCOLLECTION]])'
apache_beam.utils.subprocess_server: INFO: b''
apache_beam.utils.subprocess_server: INFO: b'Mar 17, 2021 12:31:53 PM org.apache.beam.sdk.extensions.sql.impl.CalciteQueryPlanner convertToBeamRel'
apache_beam.utils.subprocess_server: INFO: b'INFO: BEAMPlan>'
apache_beam.utils.subprocess_server: INFO: b'BeamAggregationRel(group=[{}], count=[COUNT()])'
apache_beam.utils.subprocess_server: INFO: b'  BeamIOSourceRel(table=[[beam, PCOLLECTION]])'
apache_beam.utils.subprocess_server: INFO: b''
root: DEBUG: Sending SIGINT to job_server
root: DEBUG: Unhandled type_constraint: Union[]
root: DEBUG: Unhandled type_constraint: Union[]
root: DEBUG: Unhandled type_constraint: Union[]
root: DEBUG: Unhandled type_constraint: Union[]
root: WARNING: Make sure that locally built Python SDK docker image has Python 3.6 interpreter.
root: INFO: Default Python SDK image for environment is apache/beam_python3.6_sdk:2.30.0.dev
root: INFO: No image given, using default Python SDK image
root: WARNING: Make sure that locally built Python SDK docker image has Python 3.6 interpreter.
root: INFO: Default Python SDK image for environment is apache/beam_python3.6_sdk:2.30.0.dev
root: INFO: Python SDK container image set to "apache/beam_python3.6_sdk:2.30.0.dev" for Docker environment
apache_beam.runners.portability.fn_api_runner.translations: INFO: ==================== <function lift_combiners at 0x7f8796f45158> ====================
apache_beam.runners.portability.fn_api_runner.translations: DEBUG: 27 [1, 1, 1, 1, 1, 1, 1, 1, 1, 1, 1, 1, 1, 1, 1, 1, 1, 1, 1, 1, 1, 1, 1, 1, 1, 1, 1]
apache_beam.runners.portability.fn_api_runner.translations: DEBUG: Stages: ['ref_AppliedPTransform_Create/Impulse_3\n  Create/Impulse:beam:transform:impulse:v1\n  must follow: \n  downstream_side_inputs: <unknown>', 'ref_AppliedPTransform_Create/FlatMap(<lambda at core.py:2971>)_4\n  Create/FlatMap(<lambda at core.py:2971>):beam:transform:pardo:v1\n  must follow: \n  downstream_side_inputs: <unknown>', 'ref_AppliedPTransform_Create/MaybeReshuffle/Reshuffle/AddRandomKeys_7\n  Create/MaybeReshuffle/Reshuffle/AddRandomKeys:beam:transform:pardo:v1\n  must follow: \n  downstream_side_inputs: <unknown>', 'ref_AppliedPTransform_Create/MaybeReshuffle/Reshuffle/ReshufflePerKey/Map(reify_timestamps)_9\n  Create/MaybeReshuffle/Reshuffle/ReshufflePerKey/Map(reify_timestamps):beam:transform:pardo:v1\n  must follow: \n  downstream_side_inputs: <unknown>', 'ref_AppliedPTransform_Create/MaybeReshuffle/Reshuffle/ReshufflePerKey/GroupByKey_10\n  Create/MaybeReshuffle/Reshuffle/ReshufflePerKey/GroupByKey:beam:transform:group_by_key:v1\n  must follow: \n  downstream_side_inputs: <unknown>', 'ref_AppliedPTransform_Create/MaybeReshuffle/Reshuffle/ReshufflePerKey/FlatMap(restore_timestamps)_11\n  Create/MaybeReshuffle/Reshuffle/ReshufflePerKey/FlatMap(restore_timestamps):beam:transform:pardo:v1\n  must follow: \n  downstream_side_inputs: <unknown>', 'ref_AppliedPTransform_Create/MaybeReshuffle/Reshuffle/RemoveRandomKeys_12\n  Create/MaybeReshuffle/Reshuffle/RemoveRandomKeys:beam:transform:pardo:v1\n  must follow: \n  downstream_side_inputs: <unknown>', 'ref_AppliedPTransform_Create/Map(decode)_13\n  Create/Map(decode):beam:transform:pardo:v1\n  must follow: \n  downstream_side_inputs: <unknown>', 'ref_AppliedPTransform_Map(<lambda at sql_test.py:174>)_14\n  Map(<lambda at sql_test.py:174>):beam:transform:pardo:v1\n  must follow: \n  downstream_side_inputs: <unknown>', 'ref_AppliedPTransform_WindowInto(WindowIntoFn)_15\n  WindowInto(WindowIntoFn):beam:transform:window_into:v1\n  must follow: \n  downstream_side_inputs: <unknown>', 'external_8SqlTransform(beam:external:java:sql:v1)/BeamAggregationRel_40/Group.CombineFieldsByFields/ToKvs/selectKeys/AddKeys/Map/ParMultiDo(Anonymous)\n  SqlTransform(beam:external:java:sql:v1)/BeamAggregationRel_40/Group.CombineFieldsByFields/ToKvs/selectKeys/AddKeys/Map/ParMultiDo(Anonymous):beam:transform:pardo:v1\n  must follow: \n  downstream_side_inputs: <unknown>', 'external_8SqlTransform(beam:external:java:sql:v1)/BeamAggregationRel_40/Group.CombineFieldsByFields/ToKvs/GroupByKey\n  SqlTransform(beam:external:java:sql:v1)/BeamAggregationRel_40/Group.CombineFieldsByFields/ToKvs/GroupByKey:beam:transform:group_by_key:v1\n  must follow: \n  downstream_side_inputs: <unknown>', 'external_8SqlTransform(beam:external:java:sql:v1)/BeamAggregationRel_40/Group.CombineFieldsByFields/Combine/ParDo(Anonymous)/ParMultiDo(Anonymous)\n  SqlTransform(beam:external:java:sql:v1)/BeamAggregationRel_40/Group.CombineFieldsByFields/Combine/ParDo(Anonymous)/ParMultiDo(Anonymous):beam:transform:pardo:v1\n  must follow: \n  downstream_side_inputs: <unknown>', 'external_8SqlTransform(beam:external:java:sql:v1)/BeamAggregationRel_40/Group.CombineFieldsByFields/ToRow/ParMultiDo(Anonymous)\n  SqlTransform(beam:external:java:sql:v1)/BeamAggregationRel_40/Group.CombineFieldsByFields/ToRow/ParMultiDo(Anonymous):beam:transform:pardo:v1\n  must follow: \n  downstream_side_inputs: <unknown>', 'external_8SqlTransform(beam:external:java:sql:v1)/BeamAggregationRel_40/mergeRecord/ParMultiDo(Anonymous)\n  SqlTransform(beam:external:java:sql:v1)/BeamAggregationRel_40/mergeRecord/ParMultiDo(Anonymous):beam:transform:pardo:v1\n  must follow: \n  downstream_side_inputs: <unknown>', 'ref_AppliedPTransform_assert_that/Create/Impulse_19\n  assert_that/Create/Impulse:beam:transform:impulse:v1\n  must follow: \n  downstream_side_inputs: <unknown>', 'ref_AppliedPTransform_assert_that/Create/FlatMap(<lambda at core.py:2971>)_20\n  assert_that/Create/FlatMap(<lambda at core.py:2971>):beam:transform:pardo:v1\n  must follow: \n  downstream_side_inputs: <unknown>', 'ref_AppliedPTransform_assert_that/Create/Map(decode)_22\n  assert_that/Create/Map(decode):beam:transform:pardo:v1\n  must follow: \n  downstream_side_inputs: <unknown>', 'ref_AppliedPTransform_assert_that/WindowInto(WindowIntoFn)_23\n  assert_that/WindowInto(WindowIntoFn):beam:transform:window_into:v1\n  must follow: \n  downstream_side_inputs: <unknown>', 'ref_AppliedPTransform_assert_that/ToVoidKey_24\n  assert_that/ToVoidKey:beam:transform:pardo:v1\n  must follow: \n  downstream_side_inputs: <unknown>', 'ref_AppliedPTransform_assert_that/Group/pair_with_0_26\n  assert_that/Group/pair_with_0:beam:transform:pardo:v1\n  must follow: \n  downstream_side_inputs: <unknown>', 'ref_AppliedPTransform_assert_that/Group/pair_with_1_27\n  assert_that/Group/pair_with_1:beam:transform:pardo:v1\n  must follow: \n  downstream_side_inputs: <unknown>', 'ref_AppliedPTransform_assert_that/Group/Flatten_28\n  assert_that/Group/Flatten:beam:transform:flatten:v1\n  must follow: \n  downstream_side_inputs: <unknown>', 'ref_AppliedPTransform_assert_that/Group/GroupByKey_29\n  assert_that/Group/GroupByKey:beam:transform:group_by_key:v1\n  must follow: \n  downstream_side_inputs: <unknown>', 'ref_AppliedPTransform_assert_that/Group/Map(_merge_tagged_vals_under_key)_30\n  assert_that/Group/Map(_merge_tagged_vals_under_key):beam:transform:pardo:v1\n  must follow: \n  downstream_side_inputs: <unknown>', 'ref_AppliedPTransform_assert_that/Unkey_31\n  assert_that/Unkey:beam:transform:pardo:v1\n  must follow: \n  downstream_side_inputs: <unknown>', 'ref_AppliedPTransform_assert_that/Match_32\n  assert_that/Match:beam:transform:pardo:v1\n  must follow: \n  downstream_side_inputs: <unknown>']
apache_beam.runners.portability.fn_api_runner.translations: INFO: ==================== <function sort_stages at 0x7f8796f45840> ====================
apache_beam.runners.portability.fn_api_runner.translations: DEBUG: 27 [1, 1, 1, 1, 1, 1, 1, 1, 1, 1, 1, 1, 1, 1, 1, 1, 1, 1, 1, 1, 1, 1, 1, 1, 1, 1, 1]
apache_beam.runners.portability.fn_api_runner.translations: DEBUG: Stages: ['ref_AppliedPTransform_Create/Impulse_3\n  Create/Impulse:beam:transform:impulse:v1\n  must follow: \n  downstream_side_inputs: <unknown>', 'ref_AppliedPTransform_Create/FlatMap(<lambda at core.py:2971>)_4\n  Create/FlatMap(<lambda at core.py:2971>):beam:transform:pardo:v1\n  must follow: \n  downstream_side_inputs: <unknown>', 'ref_AppliedPTransform_Create/MaybeReshuffle/Reshuffle/AddRandomKeys_7\n  Create/MaybeReshuffle/Reshuffle/AddRandomKeys:beam:transform:pardo:v1\n  must follow: \n  downstream_side_inputs: <unknown>', 'ref_AppliedPTransform_Create/MaybeReshuffle/Reshuffle/ReshufflePerKey/Map(reify_timestamps)_9\n  Create/MaybeReshuffle/Reshuffle/ReshufflePerKey/Map(reify_timestamps):beam:transform:pardo:v1\n  must follow: \n  downstream_side_inputs: <unknown>', 'ref_AppliedPTransform_Create/MaybeReshuffle/Reshuffle/ReshufflePerKey/GroupByKey_10\n  Create/MaybeReshuffle/Reshuffle/ReshufflePerKey/GroupByKey:beam:transform:group_by_key:v1\n  must follow: \n  downstream_side_inputs: <unknown>', 'ref_AppliedPTransform_Create/MaybeReshuffle/Reshuffle/ReshufflePerKey/FlatMap(restore_timestamps)_11\n  Create/MaybeReshuffle/Reshuffle/ReshufflePerKey/FlatMap(restore_timestamps):beam:transform:pardo:v1\n  must follow: \n  downstream_side_inputs: <unknown>', 'ref_AppliedPTransform_Create/MaybeReshuffle/Reshuffle/RemoveRandomKeys_12\n  Create/MaybeReshuffle/Reshuffle/RemoveRandomKeys:beam:transform:pardo:v1\n  must follow: \n  downstream_side_inputs: <unknown>', 'ref_AppliedPTransform_Create/Map(decode)_13\n  Create/Map(decode):beam:transform:pardo:v1\n  must follow: \n  downstream_side_inputs: <unknown>', 'ref_AppliedPTransform_Map(<lambda at sql_test.py:174>)_14\n  Map(<lambda at sql_test.py:174>):beam:transform:pardo:v1\n  must follow: \n  downstream_side_inputs: <unknown>', 'ref_AppliedPTransform_WindowInto(WindowIntoFn)_15\n  WindowInto(WindowIntoFn):beam:transform:window_into:v1\n  must follow: \n  downstream_side_inputs: <unknown>', 'external_8SqlTransform(beam:external:java:sql:v1)/BeamAggregationRel_40/Group.CombineFieldsByFields/ToKvs/selectKeys/AddKeys/Map/ParMultiDo(Anonymous)\n  SqlTransform(beam:external:java:sql:v1)/BeamAggregationRel_40/Group.CombineFieldsByFields/ToKvs/selectKeys/AddKeys/Map/ParMultiDo(Anonymous):beam:transform:pardo:v1\n  must follow: \n  downstream_side_inputs: <unknown>', 'external_8SqlTransform(beam:external:java:sql:v1)/BeamAggregationRel_40/Group.CombineFieldsByFields/ToKvs/GroupByKey\n  SqlTransform(beam:external:java:sql:v1)/BeamAggregationRel_40/Group.CombineFieldsByFields/ToKvs/GroupByKey:beam:transform:group_by_key:v1\n  must follow: \n  downstream_side_inputs: <unknown>', 'external_8SqlTransform(beam:external:java:sql:v1)/BeamAggregationRel_40/Group.CombineFieldsByFields/Combine/ParDo(Anonymous)/ParMultiDo(Anonymous)\n  SqlTransform(beam:external:java:sql:v1)/BeamAggregationRel_40/Group.CombineFieldsByFields/Combine/ParDo(Anonymous)/ParMultiDo(Anonymous):beam:transform:pardo:v1\n  must follow: \n  downstream_side_inputs: <unknown>', 'external_8SqlTransform(beam:external:java:sql:v1)/BeamAggregationRel_40/Group.CombineFieldsByFields/ToRow/ParMultiDo(Anonymous)\n  SqlTransform(beam:external:java:sql:v1)/BeamAggregationRel_40/Group.CombineFieldsByFields/ToRow/ParMultiDo(Anonymous):beam:transform:pardo:v1\n  must follow: \n  downstream_side_inputs: <unknown>', 'external_8SqlTransform(beam:external:java:sql:v1)/BeamAggregationRel_40/mergeRecord/ParMultiDo(Anonymous)\n  SqlTransform(beam:external:java:sql:v1)/BeamAggregationRel_40/mergeRecord/ParMultiDo(Anonymous):beam:transform:pardo:v1\n  must follow: \n  downstream_side_inputs: <unknown>', 'ref_AppliedPTransform_assert_that/Create/Impulse_19\n  assert_that/Create/Impulse:beam:transform:impulse:v1\n  must follow: \n  downstream_side_inputs: <unknown>', 'ref_AppliedPTransform_assert_that/Create/FlatMap(<lambda at core.py:2971>)_20\n  assert_that/Create/FlatMap(<lambda at core.py:2971>):beam:transform:pardo:v1\n  must follow: \n  downstream_side_inputs: <unknown>', 'ref_AppliedPTransform_assert_that/Create/Map(decode)_22\n  assert_that/Create/Map(decode):beam:transform:pardo:v1\n  must follow: \n  downstream_side_inputs: <unknown>', 'ref_AppliedPTransform_assert_that/WindowInto(WindowIntoFn)_23\n  assert_that/WindowInto(WindowIntoFn):beam:transform:window_into:v1\n  must follow: \n  downstream_side_inputs: <unknown>', 'ref_AppliedPTransform_assert_that/ToVoidKey_24\n  assert_that/ToVoidKey:beam:transform:pardo:v1\n  must follow: \n  downstream_side_inputs: <unknown>', 'ref_AppliedPTransform_assert_that/Group/pair_with_0_26\n  assert_that/Group/pair_with_0:beam:transform:pardo:v1\n  must follow: \n  downstream_side_inputs: <unknown>', 'ref_AppliedPTransform_assert_that/Group/pair_with_1_27\n  assert_that/Group/pair_with_1:beam:transform:pardo:v1\n  must follow: \n  downstream_side_inputs: <unknown>', 'ref_AppliedPTransform_assert_that/Group/Flatten_28\n  assert_that/Group/Flatten:beam:transform:flatten:v1\n  must follow: \n  downstream_side_inputs: <unknown>', 'ref_AppliedPTransform_assert_that/Group/GroupByKey_29\n  assert_that/Group/GroupByKey:beam:transform:group_by_key:v1\n  must follow: \n  downstream_side_inputs: <unknown>', 'ref_AppliedPTransform_assert_that/Group/Map(_merge_tagged_vals_under_key)_30\n  assert_that/Group/Map(_merge_tagged_vals_under_key):beam:transform:pardo:v1\n  must follow: \n  downstream_side_inputs: <unknown>', 'ref_AppliedPTransform_assert_that/Unkey_31\n  assert_that/Unkey:beam:transform:pardo:v1\n  must follow: \n  downstream_side_inputs: <unknown>', 'ref_AppliedPTransform_assert_that/Match_32\n  assert_that/Match:beam:transform:pardo:v1\n  must follow: \n  downstream_side_inputs: <unknown>']
--------------------- >> end captured logging << ---------------------

======================================================================
ERROR: test_zetasql_generate_data (apache_beam.transforms.sql_test.SqlTransformTest)
----------------------------------------------------------------------
Traceback (most recent call last):
  File "<https://ci-beam.apache.org/job/beam_PostCommit_XVR_Spark/ws/src/sdks/python/apache_beam/transforms/sql_test.py",> line 164, in test_zetasql_generate_data
    assert_that(out, equal_to([(1, "foo", 3.14)]))
  File "<https://ci-beam.apache.org/job/beam_PostCommit_XVR_Spark/ws/src/sdks/python/apache_beam/pipeline.py",> line 582, in __exit__
    self.result = self.run()
  File "<https://ci-beam.apache.org/job/beam_PostCommit_XVR_Spark/ws/src/sdks/python/apache_beam/testing/test_pipeline.py",> line 112, in run
    False if self.not_use_test_runner_api else test_runner_api))
  File "<https://ci-beam.apache.org/job/beam_PostCommit_XVR_Spark/ws/src/sdks/python/apache_beam/pipeline.py",> line 561, in run
    return self.runner.run_pipeline(self, self._options)
  File "<https://ci-beam.apache.org/job/beam_PostCommit_XVR_Spark/ws/src/sdks/python/apache_beam/runners/portability/portable_runner.py",> line 440, in run_pipeline
    job_service_handle = self.create_job_service(options)
  File "<https://ci-beam.apache.org/job/beam_PostCommit_XVR_Spark/ws/src/sdks/python/apache_beam/runners/portability/portable_runner.py",> line 320, in create_job_service
    return self.create_job_service_handle(server.start(), options)
  File "<https://ci-beam.apache.org/job/beam_PostCommit_XVR_Spark/ws/src/sdks/python/apache_beam/runners/portability/job_server.py",> line 56, in start
    grpc.channel_ready_future(channel).result(timeout=self._timeout)
  File "<https://ci-beam.apache.org/job/beam_PostCommit_XVR_Spark/ws/src/build/gradleenv/1922375555/lib/python3.6/site-packages/grpc/_utilities.py",> line 140, in result
    self._block(timeout)
  File "<https://ci-beam.apache.org/job/beam_PostCommit_XVR_Spark/ws/src/build/gradleenv/1922375555/lib/python3.6/site-packages/grpc/_utilities.py",> line 86, in _block
    raise grpc.FutureTimeoutError()
grpc.FutureTimeoutError: 
-------------------- >> begin captured logging << --------------------
apache_beam.utils.subprocess_server: INFO: Using pre-built snapshot at <https://ci-beam.apache.org/job/beam_PostCommit_XVR_Spark/ws/src/sdks/java/extensions/sql/expansion-service/build/libs/beam-sdks-java-extensions-sql-expansion-service-2.30.0-SNAPSHOT.jar>
apache_beam.utils.subprocess_server: INFO: Starting service with ['java' '-jar' '<https://ci-beam.apache.org/job/beam_PostCommit_XVR_Spark/ws/src/sdks/java/extensions/sql/expansion-service/build/libs/beam-sdks-java-extensions-sql-expansion-service-2.30.0-SNAPSHOT.jar'> '56505']
root: DEBUG: Waiting for grpc channel to be ready at localhost:56505.
apache_beam.utils.subprocess_server: INFO: b'Starting expansion service at localhost:56505'
root: DEBUG: Waiting for grpc channel to be ready at localhost:56505.
apache_beam.utils.subprocess_server: INFO: b'Mar 17, 2021 12:32:57 PM org.apache.beam.sdk.expansion.service.ExpansionService loadRegisteredTransforms'
apache_beam.utils.subprocess_server: INFO: b'INFO: Registering external transforms: [beam:external:java:sql:v1, beam:external:java:generate_sequence:v1]'
apache_beam.utils.subprocess_server: INFO: b'\tbeam:external:java:sql:v1: org.apache.beam.sdk.expansion.service.ExpansionService$ExternalTransformRegistrarLoader$$Lambda$3/1130478920@5680a178'
apache_beam.utils.subprocess_server: INFO: b'\tbeam:external:java:generate_sequence:v1: org.apache.beam.sdk.expansion.service.ExpansionService$ExternalTransformRegistrarLoader$$Lambda$3/1130478920@5fdef03a'
root: DEBUG: Waiting for grpc channel to be ready at localhost:56505.
root: DEBUG: Waiting for grpc channel to be ready at localhost:56505.
root: DEBUG: Waiting for grpc channel to be ready at localhost:56505.
root: DEBUG: Waiting for grpc channel to be ready at localhost:56505.
apache_beam.utils.subprocess_server: INFO: b'Mar 17, 2021 12:32:58 PM org.apache.beam.sdk.expansion.service.ExpansionService expand'
apache_beam.utils.subprocess_server: INFO: b"INFO: Expanding 'SqlTransform(beam:external:java:sql:v1)' with URN 'beam:external:java:sql:v1'"
apache_beam.utils.subprocess_server: INFO: b'Mar 17, 2021 12:32:59 PM org.apache.beam.sdk.expansion.service.ExpansionService$ExternalTransformRegistrarLoader payloadToConfig'
apache_beam.utils.subprocess_server: INFO: b"WARNING: Configuration class 'org.apache.beam.sdk.extensions.sql.expansion.ExternalSqlTransformRegistrar$Configuration' has no schema registered. Attempting to construct with setter approach."
apache_beam.utils.subprocess_server: INFO: b'Mar 17, 2021 12:33:03 PM org.apache.beam.sdk.extensions.sql.zetasql.ZetaSQLQueryPlanner convertToBeamRelInternal'
apache_beam.utils.subprocess_server: INFO: b'INFO: BEAMPlan>'
apache_beam.utils.subprocess_server: INFO: b"BeamZetaSqlCalcRel(expr#0=[{inputs}], expr#1=[1:BIGINT], expr#2=['foo':VARCHAR], expr#3=[3.1400000000000001243E0:DOUBLE], int=[$t1], str=[$t2], flt=[$t3])"
apache_beam.utils.subprocess_server: INFO: b'  BeamValuesRel(tuples=[[{ 0 }]])'
apache_beam.utils.subprocess_server: INFO: b''
root: DEBUG: Sending SIGINT to job_server
root: DEBUG: Unhandled type_constraint: Union[]
root: DEBUG: Unhandled type_constraint: Union[]
root: DEBUG: Unhandled type_constraint: Union[]
root: DEBUG: Unhandled type_constraint: Union[]
root: WARNING: Make sure that locally built Python SDK docker image has Python 3.6 interpreter.
root: INFO: Default Python SDK image for environment is apache/beam_python3.6_sdk:2.30.0.dev
root: INFO: No image given, using default Python SDK image
root: WARNING: Make sure that locally built Python SDK docker image has Python 3.6 interpreter.
root: INFO: Default Python SDK image for environment is apache/beam_python3.6_sdk:2.30.0.dev
root: INFO: Python SDK container image set to "apache/beam_python3.6_sdk:2.30.0.dev" for Docker environment
apache_beam.runners.portability.fn_api_runner.translations: INFO: ==================== <function lift_combiners at 0x7f8796f45158> ====================
apache_beam.runners.portability.fn_api_runner.translations: DEBUG: 16 [1, 1, 1, 1, 1, 1, 1, 1, 1, 1, 1, 1, 1, 1, 1, 1]
apache_beam.runners.portability.fn_api_runner.translations: DEBUG: Stages: ['external_9SqlTransform(beam:external:java:sql:v1)/BeamValuesRel_13/Create.Values/Read(CreateSource)/Impulse\n  SqlTransform(beam:external:java:sql:v1)/BeamValuesRel_13/Create.Values/Read(CreateSource)/Impulse:beam:transform:impulse:v1\n  must follow: \n  downstream_side_inputs: <unknown>', 'external_9SqlTransform(beam:external:java:sql:v1)/BeamValuesRel_13/Create.Values/Read(CreateSource)/ParDo(OutputSingleSource)/ParMultiDo(OutputSingleSource)\n  SqlTransform(beam:external:java:sql:v1)/BeamValuesRel_13/Create.Values/Read(CreateSource)/ParDo(OutputSingleSource)/ParMultiDo(OutputSingleSource):beam:transform:pardo:v1\n  must follow: \n  downstream_side_inputs: <unknown>', 'external_9SqlTransform(beam:external:java:sql:v1)/BeamValuesRel_13/Create.Values/Read(CreateSource)/ParDo(BoundedSourceAsSDFWrapper)/ParMultiDo(BoundedSourceAsSDFWrapper)\n  SqlTransform(beam:external:java:sql:v1)/BeamValuesRel_13/Create.Values/Read(CreateSource)/ParDo(BoundedSourceAsSDFWrapper)/ParMultiDo(BoundedSourceAsSDFWrapper):beam:transform:pardo:v1\n  must follow: \n  downstream_side_inputs: <unknown>', 'external_9SqlTransform(beam:external:java:sql:v1)/BeamZetaSqlCalcRel_17/ParDo(Calc)/ParMultiDo(Calc)\n  SqlTransform(beam:external:java:sql:v1)/BeamZetaSqlCalcRel_17/ParDo(Calc)/ParMultiDo(Calc):beam:transform:pardo:v1\n  must follow: \n  downstream_side_inputs: <unknown>', 'ref_AppliedPTransform_assert_that/Create/Impulse_5\n  assert_that/Create/Impulse:beam:transform:impulse:v1\n  must follow: \n  downstream_side_inputs: <unknown>', 'ref_AppliedPTransform_assert_that/Create/FlatMap(<lambda at core.py:2971>)_6\n  assert_that/Create/FlatMap(<lambda at core.py:2971>):beam:transform:pardo:v1\n  must follow: \n  downstream_side_inputs: <unknown>', 'ref_AppliedPTransform_assert_that/Create/Map(decode)_8\n  assert_that/Create/Map(decode):beam:transform:pardo:v1\n  must follow: \n  downstream_side_inputs: <unknown>', 'ref_AppliedPTransform_assert_that/WindowInto(WindowIntoFn)_9\n  assert_that/WindowInto(WindowIntoFn):beam:transform:window_into:v1\n  must follow: \n  downstream_side_inputs: <unknown>', 'ref_AppliedPTransform_assert_that/ToVoidKey_10\n  assert_that/ToVoidKey:beam:transform:pardo:v1\n  must follow: \n  downstream_side_inputs: <unknown>', 'ref_AppliedPTransform_assert_that/Group/pair_with_0_12\n  assert_that/Group/pair_with_0:beam:transform:pardo:v1\n  must follow: \n  downstream_side_inputs: <unknown>', 'ref_AppliedPTransform_assert_that/Group/pair_with_1_13\n  assert_that/Group/pair_with_1:beam:transform:pardo:v1\n  must follow: \n  downstream_side_inputs: <unknown>', 'ref_AppliedPTransform_assert_that/Group/Flatten_14\n  assert_that/Group/Flatten:beam:transform:flatten:v1\n  must follow: \n  downstream_side_inputs: <unknown>', 'ref_AppliedPTransform_assert_that/Group/GroupByKey_15\n  assert_that/Group/GroupByKey:beam:transform:group_by_key:v1\n  must follow: \n  downstream_side_inputs: <unknown>', 'ref_AppliedPTransform_assert_that/Group/Map(_merge_tagged_vals_under_key)_16\n  assert_that/Group/Map(_merge_tagged_vals_under_key):beam:transform:pardo:v1\n  must follow: \n  downstream_side_inputs: <unknown>', 'ref_AppliedPTransform_assert_that/Unkey_17\n  assert_that/Unkey:beam:transform:pardo:v1\n  must follow: \n  downstream_side_inputs: <unknown>', 'ref_AppliedPTransform_assert_that/Match_18\n  assert_that/Match:beam:transform:pardo:v1\n  must follow: \n  downstream_side_inputs: <unknown>']
apache_beam.runners.portability.fn_api_runner.translations: INFO: ==================== <function sort_stages at 0x7f8796f45840> ====================
apache_beam.runners.portability.fn_api_runner.translations: DEBUG: 16 [1, 1, 1, 1, 1, 1, 1, 1, 1, 1, 1, 1, 1, 1, 1, 1]
apache_beam.runners.portability.fn_api_runner.translations: DEBUG: Stages: ['external_9SqlTransform(beam:external:java:sql:v1)/BeamValuesRel_13/Create.Values/Read(CreateSource)/Impulse\n  SqlTransform(beam:external:java:sql:v1)/BeamValuesRel_13/Create.Values/Read(CreateSource)/Impulse:beam:transform:impulse:v1\n  must follow: \n  downstream_side_inputs: <unknown>', 'external_9SqlTransform(beam:external:java:sql:v1)/BeamValuesRel_13/Create.Values/Read(CreateSource)/ParDo(OutputSingleSource)/ParMultiDo(OutputSingleSource)\n  SqlTransform(beam:external:java:sql:v1)/BeamValuesRel_13/Create.Values/Read(CreateSource)/ParDo(OutputSingleSource)/ParMultiDo(OutputSingleSource):beam:transform:pardo:v1\n  must follow: \n  downstream_side_inputs: <unknown>', 'external_9SqlTransform(beam:external:java:sql:v1)/BeamValuesRel_13/Create.Values/Read(CreateSource)/ParDo(BoundedSourceAsSDFWrapper)/ParMultiDo(BoundedSourceAsSDFWrapper)\n  SqlTransform(beam:external:java:sql:v1)/BeamValuesRel_13/Create.Values/Read(CreateSource)/ParDo(BoundedSourceAsSDFWrapper)/ParMultiDo(BoundedSourceAsSDFWrapper):beam:transform:pardo:v1\n  must follow: \n  downstream_side_inputs: <unknown>', 'external_9SqlTransform(beam:external:java:sql:v1)/BeamZetaSqlCalcRel_17/ParDo(Calc)/ParMultiDo(Calc)\n  SqlTransform(beam:external:java:sql:v1)/BeamZetaSqlCalcRel_17/ParDo(Calc)/ParMultiDo(Calc):beam:transform:pardo:v1\n  must follow: \n  downstream_side_inputs: <unknown>', 'ref_AppliedPTransform_assert_that/Create/Impulse_5\n  assert_that/Create/Impulse:beam:transform:impulse:v1\n  must follow: \n  downstream_side_inputs: <unknown>', 'ref_AppliedPTransform_assert_that/Create/FlatMap(<lambda at core.py:2971>)_6\n  assert_that/Create/FlatMap(<lambda at core.py:2971>):beam:transform:pardo:v1\n  must follow: \n  downstream_side_inputs: <unknown>', 'ref_AppliedPTransform_assert_that/Create/Map(decode)_8\n  assert_that/Create/Map(decode):beam:transform:pardo:v1\n  must follow: \n  downstream_side_inputs: <unknown>', 'ref_AppliedPTransform_assert_that/WindowInto(WindowIntoFn)_9\n  assert_that/WindowInto(WindowIntoFn):beam:transform:window_into:v1\n  must follow: \n  downstream_side_inputs: <unknown>', 'ref_AppliedPTransform_assert_that/ToVoidKey_10\n  assert_that/ToVoidKey:beam:transform:pardo:v1\n  must follow: \n  downstream_side_inputs: <unknown>', 'ref_AppliedPTransform_assert_that/Group/pair_with_0_12\n  assert_that/Group/pair_with_0:beam:transform:pardo:v1\n  must follow: \n  downstream_side_inputs: <unknown>', 'ref_AppliedPTransform_assert_that/Group/pair_with_1_13\n  assert_that/Group/pair_with_1:beam:transform:pardo:v1\n  must follow: \n  downstream_side_inputs: <unknown>', 'ref_AppliedPTransform_assert_that/Group/Flatten_14\n  assert_that/Group/Flatten:beam:transform:flatten:v1\n  must follow: \n  downstream_side_inputs: <unknown>', 'ref_AppliedPTransform_assert_that/Group/GroupByKey_15\n  assert_that/Group/GroupByKey:beam:transform:group_by_key:v1\n  must follow: \n  downstream_side_inputs: <unknown>', 'ref_AppliedPTransform_assert_that/Group/Map(_merge_tagged_vals_under_key)_16\n  assert_that/Group/Map(_merge_tagged_vals_under_key):beam:transform:pardo:v1\n  must follow: \n  downstream_side_inputs: <unknown>', 'ref_AppliedPTransform_assert_that/Unkey_17\n  assert_that/Unkey:beam:transform:pardo:v1\n  must follow: \n  downstream_side_inputs: <unknown>', 'ref_AppliedPTransform_assert_that/Match_18\n  assert_that/Match:beam:transform:pardo:v1\n  must follow: \n  downstream_side_inputs: <unknown>']
--------------------- >> end captured logging << ---------------------

----------------------------------------------------------------------
XML: nosetests-xlangSqlValidateRunner.xml
----------------------------------------------------------------------
XML: <https://ci-beam.apache.org/job/beam_PostCommit_XVR_Spark/ws/src/sdks/python/nosetests.xml>
----------------------------------------------------------------------
Ran 9 tests in 638.485s

FAILED (errors=9)

> Task :runners:spark:2:job-server:validatesCrossLanguageRunnerPythonUsingSql FAILED
> Task :runners:spark:2:job-server:validatesCrossLanguageRunnerCleanup
> Task :runners:spark:2:job-server:sparkJobServerCleanup

FAILURE: Build completed with 6 failures.

1: Task failed with an exception.
-----------
* What went wrong:
Execution failed for task ':runners:spark:2:job-server:validatesCrossLanguageRunnerJavaUsingJava'.
> There were failing tests. See the report at: file://<https://ci-beam.apache.org/job/beam_PostCommit_XVR_Spark/ws/src/runners/spark/2/job-server/build/reports/tests/validatesCrossLanguageRunnerJavaUsingJava/index.html>

* Try:
Run with --stacktrace option to get the stack trace. Run with --info or --debug option to get more log output. Run with --scan to get full insights.
==============================================================================

2: Task failed with an exception.
-----------
* What went wrong:
Execution failed for task ':runners:spark:2:job-server:validatesCrossLanguageRunnerJavaUsingPython'.
> There were failing tests. See the report at: file://<https://ci-beam.apache.org/job/beam_PostCommit_XVR_Spark/ws/src/runners/spark/2/job-server/build/reports/tests/validatesCrossLanguageRunnerJavaUsingPython/index.html>

* Try:
Run with --stacktrace option to get the stack trace. Run with --info or --debug option to get more log output. Run with --scan to get full insights.
==============================================================================

3: Task failed with an exception.
-----------
* What went wrong:
Execution failed for task ':runners:spark:2:job-server:validatesCrossLanguageRunnerJavaUsingPythonOnly'.
> There were failing tests. See the report at: file://<https://ci-beam.apache.org/job/beam_PostCommit_XVR_Spark/ws/src/runners/spark/2/job-server/build/reports/tests/validatesCrossLanguageRunnerJavaUsingPythonOnly/index.html>

* Try:
Run with --stacktrace option to get the stack trace. Run with --info or --debug option to get more log output. Run with --scan to get full insights.
==============================================================================

4: Task failed with an exception.
-----------
* What went wrong:
Execution failed for task ':runners:spark:2:job-server:validatesCrossLanguageRunnerPythonUsingJava'.
> Process 'command 'sh'' finished with non-zero exit value 1

* Try:
Run with --stacktrace option to get the stack trace. Run with --info or --debug option to get more log output. Run with --scan to get full insights.
==============================================================================

5: Task failed with an exception.
-----------
* What went wrong:
Execution failed for task ':runners:spark:2:job-server:validatesCrossLanguageRunnerPythonUsingPython'.
> Process 'command 'sh'' finished with non-zero exit value 1

* Try:
Run with --stacktrace option to get the stack trace. Run with --info or --debug option to get more log output. Run with --scan to get full insights.
==============================================================================

6: Task failed with an exception.
-----------
* What went wrong:
Execution failed for task ':runners:spark:2:job-server:validatesCrossLanguageRunnerPythonUsingSql'.
> Process 'command 'sh'' finished with non-zero exit value 1

* Try:
Run with --stacktrace option to get the stack trace. Run with --info or --debug option to get more log output. Run with --scan to get full insights.
==============================================================================

* Get more help at https://help.gradle.org

Deprecated Gradle features were used in this build, making it incompatible with Gradle 7.0.
Use '--warning-mode all' to show the individual deprecation warnings.
See https://docs.gradle.org/6.8/userguide/command_line_interface.html#sec:command_line_warnings

BUILD FAILED in 33m 37s
201 actionable tasks: 148 executed, 49 from cache, 4 up-to-date
Gradle was unable to watch the file system for changes. The inotify watches limit is too low.

Publishing build scan...
https://gradle.com/s/l7vuib5bpcylg

Build step 'Invoke Gradle script' changed build result to FAILURE
Build step 'Invoke Gradle script' marked build as failure

---------------------------------------------------------------------
To unsubscribe, e-mail: builds-unsubscribe@beam.apache.org
For additional commands, e-mail: builds-help@beam.apache.org


Jenkins build is back to normal : beam_PostCommit_XVR_Spark #2069

Posted by Apache Jenkins Server <je...@builds.apache.org>.
See <https://ci-beam.apache.org/job/beam_PostCommit_XVR_Spark/2069/display/redirect?page=changes>


---------------------------------------------------------------------
To unsubscribe, e-mail: builds-unsubscribe@beam.apache.org
For additional commands, e-mail: builds-help@beam.apache.org


Build failed in Jenkins: beam_PostCommit_XVR_Spark #2068

Posted by Apache Jenkins Server <je...@builds.apache.org>.
See <https://ci-beam.apache.org/job/beam_PostCommit_XVR_Spark/2068/display/redirect?page=changes>

Changes:

[Kyle Weaver] Add example of Spark rest URL.

[zyichi] [BEAM-11979] Ignore not serializable filter fields in python MongoDBIO

[Kenneth Knowles] Add script to tag a commit for building RC

[Kenneth Knowles] Adjust build_release_candidate.sh to use existing tag

[Kenneth Knowles] Update instructions to include tagging an RC commit

[Robert Bradshaw] Better error for missing java.

[noreply] Revert "Add License file for the Go SDK  for pkg.go.dev"


------------------------------------------
[...truncated 1.38 MB...]
    return self.runner.run_pipeline(self, self._options)
  File "<https://ci-beam.apache.org/job/beam_PostCommit_XVR_Spark/ws/src/sdks/python/apache_beam/runners/portability/portable_runner.py",> line 440, in run_pipeline
    job_service_handle = self.create_job_service(options)
  File "<https://ci-beam.apache.org/job/beam_PostCommit_XVR_Spark/ws/src/sdks/python/apache_beam/runners/portability/portable_runner.py",> line 320, in create_job_service
    return self.create_job_service_handle(server.start(), options)
  File "<https://ci-beam.apache.org/job/beam_PostCommit_XVR_Spark/ws/src/sdks/python/apache_beam/runners/portability/job_server.py",> line 56, in start
    grpc.channel_ready_future(channel).result(timeout=self._timeout)
  File "<https://ci-beam.apache.org/job/beam_PostCommit_XVR_Spark/ws/src/build/gradleenv/1922375555/lib/python3.6/site-packages/grpc/_utilities.py",> line 140, in result
    self._block(timeout)
  File "<https://ci-beam.apache.org/job/beam_PostCommit_XVR_Spark/ws/src/build/gradleenv/1922375555/lib/python3.6/site-packages/grpc/_utilities.py",> line 86, in _block
    raise grpc.FutureTimeoutError()
grpc.FutureTimeoutError: 
-------------------- >> begin captured logging << --------------------
apache_beam.utils.subprocess_server: INFO: Using pre-built snapshot at <https://ci-beam.apache.org/job/beam_PostCommit_XVR_Spark/ws/src/sdks/java/extensions/sql/expansion-service/build/libs/beam-sdks-java-extensions-sql-expansion-service-2.30.0-SNAPSHOT.jar>
apache_beam.utils.subprocess_server: INFO: Starting service with ['java' '-jar' '<https://ci-beam.apache.org/job/beam_PostCommit_XVR_Spark/ws/src/sdks/java/extensions/sql/expansion-service/build/libs/beam-sdks-java-extensions-sql-expansion-service-2.30.0-SNAPSHOT.jar'> '49673']
root: DEBUG: Waiting for grpc channel to be ready at localhost:49673.
apache_beam.utils.subprocess_server: INFO: b'Starting expansion service at localhost:49673'
root: DEBUG: Waiting for grpc channel to be ready at localhost:49673.
apache_beam.utils.subprocess_server: INFO: b'Mar 18, 2021 6:42:38 AM org.apache.beam.sdk.expansion.service.ExpansionService loadRegisteredTransforms'
apache_beam.utils.subprocess_server: INFO: b'INFO: Registering external transforms: [beam:external:java:sql:v1, beam:external:java:generate_sequence:v1]'
apache_beam.utils.subprocess_server: INFO: b'\tbeam:external:java:sql:v1: org.apache.beam.sdk.expansion.service.ExpansionService$ExternalTransformRegistrarLoader$$Lambda$3/1130478920@5680a178'
apache_beam.utils.subprocess_server: INFO: b'\tbeam:external:java:generate_sequence:v1: org.apache.beam.sdk.expansion.service.ExpansionService$ExternalTransformRegistrarLoader$$Lambda$3/1130478920@5fdef03a'
root: DEBUG: Waiting for grpc channel to be ready at localhost:49673.
root: DEBUG: Waiting for grpc channel to be ready at localhost:49673.
root: DEBUG: Waiting for grpc channel to be ready at localhost:49673.
root: DEBUG: Waiting for grpc channel to be ready at localhost:49673.
apache_beam.utils.subprocess_server: INFO: b'Mar 18, 2021 6:42:39 AM org.apache.beam.sdk.expansion.service.ExpansionService expand'
apache_beam.utils.subprocess_server: INFO: b"INFO: Expanding 'SqlTransform(beam:external:java:sql:v1)' with URN 'beam:external:java:sql:v1'"
apache_beam.utils.subprocess_server: INFO: b'Mar 18, 2021 6:42:39 AM org.apache.beam.sdk.expansion.service.ExpansionService$ExternalTransformRegistrarLoader payloadToConfig'
apache_beam.utils.subprocess_server: INFO: b"WARNING: Configuration class 'org.apache.beam.sdk.extensions.sql.expansion.ExternalSqlTransformRegistrar$Configuration' has no schema registered. Attempting to construct with setter approach."
apache_beam.utils.subprocess_server: INFO: b'Mar 18, 2021 6:42:41 AM org.apache.beam.sdk.extensions.sql.impl.CalciteQueryPlanner convertToBeamRel'
apache_beam.utils.subprocess_server: INFO: b'INFO: SQL:'
apache_beam.utils.subprocess_server: INFO: b'SELECT COUNT(*) AS `count`'
apache_beam.utils.subprocess_server: INFO: b'FROM `beam`.`PCOLLECTION` AS `PCOLLECTION`'
apache_beam.utils.subprocess_server: INFO: b'Mar 18, 2021 6:42:41 AM org.apache.beam.sdk.extensions.sql.impl.CalciteQueryPlanner convertToBeamRel'
apache_beam.utils.subprocess_server: INFO: b'INFO: SQLPlan>'
apache_beam.utils.subprocess_server: INFO: b'LogicalAggregate(group=[{}], count=[COUNT()])'
apache_beam.utils.subprocess_server: INFO: b'  LogicalProject($f0=[0])'
apache_beam.utils.subprocess_server: INFO: b'    BeamIOSourceRel(table=[[beam, PCOLLECTION]])'
apache_beam.utils.subprocess_server: INFO: b''
apache_beam.utils.subprocess_server: INFO: b'Mar 18, 2021 6:42:42 AM org.apache.beam.sdk.extensions.sql.impl.CalciteQueryPlanner convertToBeamRel'
apache_beam.utils.subprocess_server: INFO: b'INFO: BEAMPlan>'
apache_beam.utils.subprocess_server: INFO: b'BeamAggregationRel(group=[{}], count=[COUNT()])'
apache_beam.utils.subprocess_server: INFO: b'  BeamIOSourceRel(table=[[beam, PCOLLECTION]])'
apache_beam.utils.subprocess_server: INFO: b''
root: DEBUG: Sending SIGINT to job_server
root: DEBUG: Unhandled type_constraint: Union[]
root: DEBUG: Unhandled type_constraint: Union[]
root: DEBUG: Unhandled type_constraint: Union[]
root: DEBUG: Unhandled type_constraint: Union[]
root: WARNING: Make sure that locally built Python SDK docker image has Python 3.6 interpreter.
root: INFO: Default Python SDK image for environment is apache/beam_python3.6_sdk:2.30.0.dev
root: INFO: No image given, using default Python SDK image
root: WARNING: Make sure that locally built Python SDK docker image has Python 3.6 interpreter.
root: INFO: Default Python SDK image for environment is apache/beam_python3.6_sdk:2.30.0.dev
root: INFO: Python SDK container image set to "apache/beam_python3.6_sdk:2.30.0.dev" for Docker environment
apache_beam.runners.portability.fn_api_runner.translations: INFO: ==================== <function lift_combiners at 0x7fd1cb464c80> ====================
apache_beam.runners.portability.fn_api_runner.translations: DEBUG: 27 [1, 1, 1, 1, 1, 1, 1, 1, 1, 1, 1, 1, 1, 1, 1, 1, 1, 1, 1, 1, 1, 1, 1, 1, 1, 1, 1]
apache_beam.runners.portability.fn_api_runner.translations: DEBUG: Stages: ['ref_AppliedPTransform_Create/Impulse_3\n  Create/Impulse:beam:transform:impulse:v1\n  must follow: \n  downstream_side_inputs: <unknown>', 'ref_AppliedPTransform_Create/FlatMap(<lambda at core.py:2971>)_4\n  Create/FlatMap(<lambda at core.py:2971>):beam:transform:pardo:v1\n  must follow: \n  downstream_side_inputs: <unknown>', 'ref_AppliedPTransform_Create/MaybeReshuffle/Reshuffle/AddRandomKeys_7\n  Create/MaybeReshuffle/Reshuffle/AddRandomKeys:beam:transform:pardo:v1\n  must follow: \n  downstream_side_inputs: <unknown>', 'ref_AppliedPTransform_Create/MaybeReshuffle/Reshuffle/ReshufflePerKey/Map(reify_timestamps)_9\n  Create/MaybeReshuffle/Reshuffle/ReshufflePerKey/Map(reify_timestamps):beam:transform:pardo:v1\n  must follow: \n  downstream_side_inputs: <unknown>', 'ref_AppliedPTransform_Create/MaybeReshuffle/Reshuffle/ReshufflePerKey/GroupByKey_10\n  Create/MaybeReshuffle/Reshuffle/ReshufflePerKey/GroupByKey:beam:transform:group_by_key:v1\n  must follow: \n  downstream_side_inputs: <unknown>', 'ref_AppliedPTransform_Create/MaybeReshuffle/Reshuffle/ReshufflePerKey/FlatMap(restore_timestamps)_11\n  Create/MaybeReshuffle/Reshuffle/ReshufflePerKey/FlatMap(restore_timestamps):beam:transform:pardo:v1\n  must follow: \n  downstream_side_inputs: <unknown>', 'ref_AppliedPTransform_Create/MaybeReshuffle/Reshuffle/RemoveRandomKeys_12\n  Create/MaybeReshuffle/Reshuffle/RemoveRandomKeys:beam:transform:pardo:v1\n  must follow: \n  downstream_side_inputs: <unknown>', 'ref_AppliedPTransform_Create/Map(decode)_13\n  Create/Map(decode):beam:transform:pardo:v1\n  must follow: \n  downstream_side_inputs: <unknown>', 'ref_AppliedPTransform_Map(<lambda at sql_test.py:174>)_14\n  Map(<lambda at sql_test.py:174>):beam:transform:pardo:v1\n  must follow: \n  downstream_side_inputs: <unknown>', 'ref_AppliedPTransform_WindowInto(WindowIntoFn)_15\n  WindowInto(WindowIntoFn):beam:transform:window_into:v1\n  must follow: \n  downstream_side_inputs: <unknown>', 'external_8SqlTransform(beam:external:java:sql:v1)/BeamAggregationRel_40/Group.CombineFieldsByFields/ToKvs/selectKeys/AddKeys/Map/ParMultiDo(Anonymous)\n  SqlTransform(beam:external:java:sql:v1)/BeamAggregationRel_40/Group.CombineFieldsByFields/ToKvs/selectKeys/AddKeys/Map/ParMultiDo(Anonymous):beam:transform:pardo:v1\n  must follow: \n  downstream_side_inputs: <unknown>', 'external_8SqlTransform(beam:external:java:sql:v1)/BeamAggregationRel_40/Group.CombineFieldsByFields/ToKvs/GroupByKey\n  SqlTransform(beam:external:java:sql:v1)/BeamAggregationRel_40/Group.CombineFieldsByFields/ToKvs/GroupByKey:beam:transform:group_by_key:v1\n  must follow: \n  downstream_side_inputs: <unknown>', 'external_8SqlTransform(beam:external:java:sql:v1)/BeamAggregationRel_40/Group.CombineFieldsByFields/Combine/ParDo(Anonymous)/ParMultiDo(Anonymous)\n  SqlTransform(beam:external:java:sql:v1)/BeamAggregationRel_40/Group.CombineFieldsByFields/Combine/ParDo(Anonymous)/ParMultiDo(Anonymous):beam:transform:pardo:v1\n  must follow: \n  downstream_side_inputs: <unknown>', 'external_8SqlTransform(beam:external:java:sql:v1)/BeamAggregationRel_40/Group.CombineFieldsByFields/ToRow/ParMultiDo(Anonymous)\n  SqlTransform(beam:external:java:sql:v1)/BeamAggregationRel_40/Group.CombineFieldsByFields/ToRow/ParMultiDo(Anonymous):beam:transform:pardo:v1\n  must follow: \n  downstream_side_inputs: <unknown>', 'external_8SqlTransform(beam:external:java:sql:v1)/BeamAggregationRel_40/mergeRecord/ParMultiDo(Anonymous)\n  SqlTransform(beam:external:java:sql:v1)/BeamAggregationRel_40/mergeRecord/ParMultiDo(Anonymous):beam:transform:pardo:v1\n  must follow: \n  downstream_side_inputs: <unknown>', 'ref_AppliedPTransform_assert_that/Create/Impulse_19\n  assert_that/Create/Impulse:beam:transform:impulse:v1\n  must follow: \n  downstream_side_inputs: <unknown>', 'ref_AppliedPTransform_assert_that/Create/FlatMap(<lambda at core.py:2971>)_20\n  assert_that/Create/FlatMap(<lambda at core.py:2971>):beam:transform:pardo:v1\n  must follow: \n  downstream_side_inputs: <unknown>', 'ref_AppliedPTransform_assert_that/Create/Map(decode)_22\n  assert_that/Create/Map(decode):beam:transform:pardo:v1\n  must follow: \n  downstream_side_inputs: <unknown>', 'ref_AppliedPTransform_assert_that/WindowInto(WindowIntoFn)_23\n  assert_that/WindowInto(WindowIntoFn):beam:transform:window_into:v1\n  must follow: \n  downstream_side_inputs: <unknown>', 'ref_AppliedPTransform_assert_that/ToVoidKey_24\n  assert_that/ToVoidKey:beam:transform:pardo:v1\n  must follow: \n  downstream_side_inputs: <unknown>', 'ref_AppliedPTransform_assert_that/Group/pair_with_0_26\n  assert_that/Group/pair_with_0:beam:transform:pardo:v1\n  must follow: \n  downstream_side_inputs: <unknown>', 'ref_AppliedPTransform_assert_that/Group/pair_with_1_27\n  assert_that/Group/pair_with_1:beam:transform:pardo:v1\n  must follow: \n  downstream_side_inputs: <unknown>', 'ref_AppliedPTransform_assert_that/Group/Flatten_28\n  assert_that/Group/Flatten:beam:transform:flatten:v1\n  must follow: \n  downstream_side_inputs: <unknown>', 'ref_AppliedPTransform_assert_that/Group/GroupByKey_29\n  assert_that/Group/GroupByKey:beam:transform:group_by_key:v1\n  must follow: \n  downstream_side_inputs: <unknown>', 'ref_AppliedPTransform_assert_that/Group/Map(_merge_tagged_vals_under_key)_30\n  assert_that/Group/Map(_merge_tagged_vals_under_key):beam:transform:pardo:v1\n  must follow: \n  downstream_side_inputs: <unknown>', 'ref_AppliedPTransform_assert_that/Unkey_31\n  assert_that/Unkey:beam:transform:pardo:v1\n  must follow: \n  downstream_side_inputs: <unknown>', 'ref_AppliedPTransform_assert_that/Match_32\n  assert_that/Match:beam:transform:pardo:v1\n  must follow: \n  downstream_side_inputs: <unknown>']
apache_beam.runners.portability.fn_api_runner.translations: INFO: ==================== <function sort_stages at 0x7fd1cb466400> ====================
apache_beam.runners.portability.fn_api_runner.translations: DEBUG: 27 [1, 1, 1, 1, 1, 1, 1, 1, 1, 1, 1, 1, 1, 1, 1, 1, 1, 1, 1, 1, 1, 1, 1, 1, 1, 1, 1]
apache_beam.runners.portability.fn_api_runner.translations: DEBUG: Stages: ['ref_AppliedPTransform_Create/Impulse_3\n  Create/Impulse:beam:transform:impulse:v1\n  must follow: \n  downstream_side_inputs: <unknown>', 'ref_AppliedPTransform_Create/FlatMap(<lambda at core.py:2971>)_4\n  Create/FlatMap(<lambda at core.py:2971>):beam:transform:pardo:v1\n  must follow: \n  downstream_side_inputs: <unknown>', 'ref_AppliedPTransform_Create/MaybeReshuffle/Reshuffle/AddRandomKeys_7\n  Create/MaybeReshuffle/Reshuffle/AddRandomKeys:beam:transform:pardo:v1\n  must follow: \n  downstream_side_inputs: <unknown>', 'ref_AppliedPTransform_Create/MaybeReshuffle/Reshuffle/ReshufflePerKey/Map(reify_timestamps)_9\n  Create/MaybeReshuffle/Reshuffle/ReshufflePerKey/Map(reify_timestamps):beam:transform:pardo:v1\n  must follow: \n  downstream_side_inputs: <unknown>', 'ref_AppliedPTransform_Create/MaybeReshuffle/Reshuffle/ReshufflePerKey/GroupByKey_10\n  Create/MaybeReshuffle/Reshuffle/ReshufflePerKey/GroupByKey:beam:transform:group_by_key:v1\n  must follow: \n  downstream_side_inputs: <unknown>', 'ref_AppliedPTransform_Create/MaybeReshuffle/Reshuffle/ReshufflePerKey/FlatMap(restore_timestamps)_11\n  Create/MaybeReshuffle/Reshuffle/ReshufflePerKey/FlatMap(restore_timestamps):beam:transform:pardo:v1\n  must follow: \n  downstream_side_inputs: <unknown>', 'ref_AppliedPTransform_Create/MaybeReshuffle/Reshuffle/RemoveRandomKeys_12\n  Create/MaybeReshuffle/Reshuffle/RemoveRandomKeys:beam:transform:pardo:v1\n  must follow: \n  downstream_side_inputs: <unknown>', 'ref_AppliedPTransform_Create/Map(decode)_13\n  Create/Map(decode):beam:transform:pardo:v1\n  must follow: \n  downstream_side_inputs: <unknown>', 'ref_AppliedPTransform_Map(<lambda at sql_test.py:174>)_14\n  Map(<lambda at sql_test.py:174>):beam:transform:pardo:v1\n  must follow: \n  downstream_side_inputs: <unknown>', 'ref_AppliedPTransform_WindowInto(WindowIntoFn)_15\n  WindowInto(WindowIntoFn):beam:transform:window_into:v1\n  must follow: \n  downstream_side_inputs: <unknown>', 'external_8SqlTransform(beam:external:java:sql:v1)/BeamAggregationRel_40/Group.CombineFieldsByFields/ToKvs/selectKeys/AddKeys/Map/ParMultiDo(Anonymous)\n  SqlTransform(beam:external:java:sql:v1)/BeamAggregationRel_40/Group.CombineFieldsByFields/ToKvs/selectKeys/AddKeys/Map/ParMultiDo(Anonymous):beam:transform:pardo:v1\n  must follow: \n  downstream_side_inputs: <unknown>', 'external_8SqlTransform(beam:external:java:sql:v1)/BeamAggregationRel_40/Group.CombineFieldsByFields/ToKvs/GroupByKey\n  SqlTransform(beam:external:java:sql:v1)/BeamAggregationRel_40/Group.CombineFieldsByFields/ToKvs/GroupByKey:beam:transform:group_by_key:v1\n  must follow: \n  downstream_side_inputs: <unknown>', 'external_8SqlTransform(beam:external:java:sql:v1)/BeamAggregationRel_40/Group.CombineFieldsByFields/Combine/ParDo(Anonymous)/ParMultiDo(Anonymous)\n  SqlTransform(beam:external:java:sql:v1)/BeamAggregationRel_40/Group.CombineFieldsByFields/Combine/ParDo(Anonymous)/ParMultiDo(Anonymous):beam:transform:pardo:v1\n  must follow: \n  downstream_side_inputs: <unknown>', 'external_8SqlTransform(beam:external:java:sql:v1)/BeamAggregationRel_40/Group.CombineFieldsByFields/ToRow/ParMultiDo(Anonymous)\n  SqlTransform(beam:external:java:sql:v1)/BeamAggregationRel_40/Group.CombineFieldsByFields/ToRow/ParMultiDo(Anonymous):beam:transform:pardo:v1\n  must follow: \n  downstream_side_inputs: <unknown>', 'external_8SqlTransform(beam:external:java:sql:v1)/BeamAggregationRel_40/mergeRecord/ParMultiDo(Anonymous)\n  SqlTransform(beam:external:java:sql:v1)/BeamAggregationRel_40/mergeRecord/ParMultiDo(Anonymous):beam:transform:pardo:v1\n  must follow: \n  downstream_side_inputs: <unknown>', 'ref_AppliedPTransform_assert_that/Create/Impulse_19\n  assert_that/Create/Impulse:beam:transform:impulse:v1\n  must follow: \n  downstream_side_inputs: <unknown>', 'ref_AppliedPTransform_assert_that/Create/FlatMap(<lambda at core.py:2971>)_20\n  assert_that/Create/FlatMap(<lambda at core.py:2971>):beam:transform:pardo:v1\n  must follow: \n  downstream_side_inputs: <unknown>', 'ref_AppliedPTransform_assert_that/Create/Map(decode)_22\n  assert_that/Create/Map(decode):beam:transform:pardo:v1\n  must follow: \n  downstream_side_inputs: <unknown>', 'ref_AppliedPTransform_assert_that/WindowInto(WindowIntoFn)_23\n  assert_that/WindowInto(WindowIntoFn):beam:transform:window_into:v1\n  must follow: \n  downstream_side_inputs: <unknown>', 'ref_AppliedPTransform_assert_that/ToVoidKey_24\n  assert_that/ToVoidKey:beam:transform:pardo:v1\n  must follow: \n  downstream_side_inputs: <unknown>', 'ref_AppliedPTransform_assert_that/Group/pair_with_0_26\n  assert_that/Group/pair_with_0:beam:transform:pardo:v1\n  must follow: \n  downstream_side_inputs: <unknown>', 'ref_AppliedPTransform_assert_that/Group/pair_with_1_27\n  assert_that/Group/pair_with_1:beam:transform:pardo:v1\n  must follow: \n  downstream_side_inputs: <unknown>', 'ref_AppliedPTransform_assert_that/Group/Flatten_28\n  assert_that/Group/Flatten:beam:transform:flatten:v1\n  must follow: \n  downstream_side_inputs: <unknown>', 'ref_AppliedPTransform_assert_that/Group/GroupByKey_29\n  assert_that/Group/GroupByKey:beam:transform:group_by_key:v1\n  must follow: \n  downstream_side_inputs: <unknown>', 'ref_AppliedPTransform_assert_that/Group/Map(_merge_tagged_vals_under_key)_30\n  assert_that/Group/Map(_merge_tagged_vals_under_key):beam:transform:pardo:v1\n  must follow: \n  downstream_side_inputs: <unknown>', 'ref_AppliedPTransform_assert_that/Unkey_31\n  assert_that/Unkey:beam:transform:pardo:v1\n  must follow: \n  downstream_side_inputs: <unknown>', 'ref_AppliedPTransform_assert_that/Match_32\n  assert_that/Match:beam:transform:pardo:v1\n  must follow: \n  downstream_side_inputs: <unknown>']
--------------------- >> end captured logging << ---------------------

======================================================================
ERROR: test_zetasql_generate_data (apache_beam.transforms.sql_test.SqlTransformTest)
----------------------------------------------------------------------
Traceback (most recent call last):
  File "<https://ci-beam.apache.org/job/beam_PostCommit_XVR_Spark/ws/src/sdks/python/apache_beam/transforms/sql_test.py",> line 164, in test_zetasql_generate_data
    assert_that(out, equal_to([(1, "foo", 3.14)]))
  File "<https://ci-beam.apache.org/job/beam_PostCommit_XVR_Spark/ws/src/sdks/python/apache_beam/pipeline.py",> line 582, in __exit__
    self.result = self.run()
  File "<https://ci-beam.apache.org/job/beam_PostCommit_XVR_Spark/ws/src/sdks/python/apache_beam/testing/test_pipeline.py",> line 112, in run
    False if self.not_use_test_runner_api else test_runner_api))
  File "<https://ci-beam.apache.org/job/beam_PostCommit_XVR_Spark/ws/src/sdks/python/apache_beam/pipeline.py",> line 561, in run
    return self.runner.run_pipeline(self, self._options)
  File "<https://ci-beam.apache.org/job/beam_PostCommit_XVR_Spark/ws/src/sdks/python/apache_beam/runners/portability/portable_runner.py",> line 440, in run_pipeline
    job_service_handle = self.create_job_service(options)
  File "<https://ci-beam.apache.org/job/beam_PostCommit_XVR_Spark/ws/src/sdks/python/apache_beam/runners/portability/portable_runner.py",> line 320, in create_job_service
    return self.create_job_service_handle(server.start(), options)
  File "<https://ci-beam.apache.org/job/beam_PostCommit_XVR_Spark/ws/src/sdks/python/apache_beam/runners/portability/job_server.py",> line 56, in start
    grpc.channel_ready_future(channel).result(timeout=self._timeout)
  File "<https://ci-beam.apache.org/job/beam_PostCommit_XVR_Spark/ws/src/build/gradleenv/1922375555/lib/python3.6/site-packages/grpc/_utilities.py",> line 140, in result
    self._block(timeout)
  File "<https://ci-beam.apache.org/job/beam_PostCommit_XVR_Spark/ws/src/build/gradleenv/1922375555/lib/python3.6/site-packages/grpc/_utilities.py",> line 86, in _block
    raise grpc.FutureTimeoutError()
grpc.FutureTimeoutError: 
-------------------- >> begin captured logging << --------------------
apache_beam.utils.subprocess_server: INFO: Using pre-built snapshot at <https://ci-beam.apache.org/job/beam_PostCommit_XVR_Spark/ws/src/sdks/java/extensions/sql/expansion-service/build/libs/beam-sdks-java-extensions-sql-expansion-service-2.30.0-SNAPSHOT.jar>
apache_beam.utils.subprocess_server: INFO: Starting service with ['java' '-jar' '<https://ci-beam.apache.org/job/beam_PostCommit_XVR_Spark/ws/src/sdks/java/extensions/sql/expansion-service/build/libs/beam-sdks-java-extensions-sql-expansion-service-2.30.0-SNAPSHOT.jar'> '42391']
root: DEBUG: Waiting for grpc channel to be ready at localhost:42391.
apache_beam.utils.subprocess_server: INFO: b'Starting expansion service at localhost:42391'
root: DEBUG: Waiting for grpc channel to be ready at localhost:42391.
apache_beam.utils.subprocess_server: INFO: b'Mar 18, 2021 6:43:46 AM org.apache.beam.sdk.expansion.service.ExpansionService loadRegisteredTransforms'
apache_beam.utils.subprocess_server: INFO: b'INFO: Registering external transforms: [beam:external:java:sql:v1, beam:external:java:generate_sequence:v1]'
apache_beam.utils.subprocess_server: INFO: b'\tbeam:external:java:sql:v1: org.apache.beam.sdk.expansion.service.ExpansionService$ExternalTransformRegistrarLoader$$Lambda$3/1130478920@5680a178'
apache_beam.utils.subprocess_server: INFO: b'\tbeam:external:java:generate_sequence:v1: org.apache.beam.sdk.expansion.service.ExpansionService$ExternalTransformRegistrarLoader$$Lambda$3/1130478920@5fdef03a'
root: DEBUG: Waiting for grpc channel to be ready at localhost:42391.
root: DEBUG: Waiting for grpc channel to be ready at localhost:42391.
root: DEBUG: Waiting for grpc channel to be ready at localhost:42391.
root: DEBUG: Waiting for grpc channel to be ready at localhost:42391.
apache_beam.utils.subprocess_server: INFO: b'Mar 18, 2021 6:43:47 AM org.apache.beam.sdk.expansion.service.ExpansionService expand'
apache_beam.utils.subprocess_server: INFO: b"INFO: Expanding 'SqlTransform(beam:external:java:sql:v1)' with URN 'beam:external:java:sql:v1'"
apache_beam.utils.subprocess_server: INFO: b'Mar 18, 2021 6:43:48 AM org.apache.beam.sdk.expansion.service.ExpansionService$ExternalTransformRegistrarLoader payloadToConfig'
apache_beam.utils.subprocess_server: INFO: b"WARNING: Configuration class 'org.apache.beam.sdk.extensions.sql.expansion.ExternalSqlTransformRegistrar$Configuration' has no schema registered. Attempting to construct with setter approach."
apache_beam.utils.subprocess_server: INFO: b'Mar 18, 2021 6:43:52 AM org.apache.beam.sdk.extensions.sql.zetasql.ZetaSQLQueryPlanner convertToBeamRelInternal'
apache_beam.utils.subprocess_server: INFO: b'INFO: BEAMPlan>'
apache_beam.utils.subprocess_server: INFO: b"BeamZetaSqlCalcRel(expr#0=[{inputs}], expr#1=[1:BIGINT], expr#2=['foo':VARCHAR], expr#3=[3.1400000000000001243E0:DOUBLE], int=[$t1], str=[$t2], flt=[$t3])"
apache_beam.utils.subprocess_server: INFO: b'  BeamValuesRel(tuples=[[{ 0 }]])'
apache_beam.utils.subprocess_server: INFO: b''
root: DEBUG: Sending SIGINT to job_server
root: DEBUG: Unhandled type_constraint: Union[]
root: DEBUG: Unhandled type_constraint: Union[]
root: DEBUG: Unhandled type_constraint: Union[]
root: DEBUG: Unhandled type_constraint: Union[]
root: WARNING: Make sure that locally built Python SDK docker image has Python 3.6 interpreter.
root: INFO: Default Python SDK image for environment is apache/beam_python3.6_sdk:2.30.0.dev
root: INFO: No image given, using default Python SDK image
root: WARNING: Make sure that locally built Python SDK docker image has Python 3.6 interpreter.
root: INFO: Default Python SDK image for environment is apache/beam_python3.6_sdk:2.30.0.dev
root: INFO: Python SDK container image set to "apache/beam_python3.6_sdk:2.30.0.dev" for Docker environment
apache_beam.runners.portability.fn_api_runner.translations: INFO: ==================== <function lift_combiners at 0x7fd1cb464c80> ====================
apache_beam.runners.portability.fn_api_runner.translations: DEBUG: 16 [1, 1, 1, 1, 1, 1, 1, 1, 1, 1, 1, 1, 1, 1, 1, 1]
apache_beam.runners.portability.fn_api_runner.translations: DEBUG: Stages: ['external_9SqlTransform(beam:external:java:sql:v1)/BeamValuesRel_13/Create.Values/Read(CreateSource)/Impulse\n  SqlTransform(beam:external:java:sql:v1)/BeamValuesRel_13/Create.Values/Read(CreateSource)/Impulse:beam:transform:impulse:v1\n  must follow: \n  downstream_side_inputs: <unknown>', 'external_9SqlTransform(beam:external:java:sql:v1)/BeamValuesRel_13/Create.Values/Read(CreateSource)/ParDo(OutputSingleSource)/ParMultiDo(OutputSingleSource)\n  SqlTransform(beam:external:java:sql:v1)/BeamValuesRel_13/Create.Values/Read(CreateSource)/ParDo(OutputSingleSource)/ParMultiDo(OutputSingleSource):beam:transform:pardo:v1\n  must follow: \n  downstream_side_inputs: <unknown>', 'external_9SqlTransform(beam:external:java:sql:v1)/BeamValuesRel_13/Create.Values/Read(CreateSource)/ParDo(BoundedSourceAsSDFWrapper)/ParMultiDo(BoundedSourceAsSDFWrapper)\n  SqlTransform(beam:external:java:sql:v1)/BeamValuesRel_13/Create.Values/Read(CreateSource)/ParDo(BoundedSourceAsSDFWrapper)/ParMultiDo(BoundedSourceAsSDFWrapper):beam:transform:pardo:v1\n  must follow: \n  downstream_side_inputs: <unknown>', 'external_9SqlTransform(beam:external:java:sql:v1)/BeamZetaSqlCalcRel_17/ParDo(Calc)/ParMultiDo(Calc)\n  SqlTransform(beam:external:java:sql:v1)/BeamZetaSqlCalcRel_17/ParDo(Calc)/ParMultiDo(Calc):beam:transform:pardo:v1\n  must follow: \n  downstream_side_inputs: <unknown>', 'ref_AppliedPTransform_assert_that/Create/Impulse_5\n  assert_that/Create/Impulse:beam:transform:impulse:v1\n  must follow: \n  downstream_side_inputs: <unknown>', 'ref_AppliedPTransform_assert_that/Create/FlatMap(<lambda at core.py:2971>)_6\n  assert_that/Create/FlatMap(<lambda at core.py:2971>):beam:transform:pardo:v1\n  must follow: \n  downstream_side_inputs: <unknown>', 'ref_AppliedPTransform_assert_that/Create/Map(decode)_8\n  assert_that/Create/Map(decode):beam:transform:pardo:v1\n  must follow: \n  downstream_side_inputs: <unknown>', 'ref_AppliedPTransform_assert_that/WindowInto(WindowIntoFn)_9\n  assert_that/WindowInto(WindowIntoFn):beam:transform:window_into:v1\n  must follow: \n  downstream_side_inputs: <unknown>', 'ref_AppliedPTransform_assert_that/ToVoidKey_10\n  assert_that/ToVoidKey:beam:transform:pardo:v1\n  must follow: \n  downstream_side_inputs: <unknown>', 'ref_AppliedPTransform_assert_that/Group/pair_with_0_12\n  assert_that/Group/pair_with_0:beam:transform:pardo:v1\n  must follow: \n  downstream_side_inputs: <unknown>', 'ref_AppliedPTransform_assert_that/Group/pair_with_1_13\n  assert_that/Group/pair_with_1:beam:transform:pardo:v1\n  must follow: \n  downstream_side_inputs: <unknown>', 'ref_AppliedPTransform_assert_that/Group/Flatten_14\n  assert_that/Group/Flatten:beam:transform:flatten:v1\n  must follow: \n  downstream_side_inputs: <unknown>', 'ref_AppliedPTransform_assert_that/Group/GroupByKey_15\n  assert_that/Group/GroupByKey:beam:transform:group_by_key:v1\n  must follow: \n  downstream_side_inputs: <unknown>', 'ref_AppliedPTransform_assert_that/Group/Map(_merge_tagged_vals_under_key)_16\n  assert_that/Group/Map(_merge_tagged_vals_under_key):beam:transform:pardo:v1\n  must follow: \n  downstream_side_inputs: <unknown>', 'ref_AppliedPTransform_assert_that/Unkey_17\n  assert_that/Unkey:beam:transform:pardo:v1\n  must follow: \n  downstream_side_inputs: <unknown>', 'ref_AppliedPTransform_assert_that/Match_18\n  assert_that/Match:beam:transform:pardo:v1\n  must follow: \n  downstream_side_inputs: <unknown>']
apache_beam.runners.portability.fn_api_runner.translations: INFO: ==================== <function sort_stages at 0x7fd1cb466400> ====================
apache_beam.runners.portability.fn_api_runner.translations: DEBUG: 16 [1, 1, 1, 1, 1, 1, 1, 1, 1, 1, 1, 1, 1, 1, 1, 1]
apache_beam.runners.portability.fn_api_runner.translations: DEBUG: Stages: ['external_9SqlTransform(beam:external:java:sql:v1)/BeamValuesRel_13/Create.Values/Read(CreateSource)/Impulse\n  SqlTransform(beam:external:java:sql:v1)/BeamValuesRel_13/Create.Values/Read(CreateSource)/Impulse:beam:transform:impulse:v1\n  must follow: \n  downstream_side_inputs: <unknown>', 'external_9SqlTransform(beam:external:java:sql:v1)/BeamValuesRel_13/Create.Values/Read(CreateSource)/ParDo(OutputSingleSource)/ParMultiDo(OutputSingleSource)\n  SqlTransform(beam:external:java:sql:v1)/BeamValuesRel_13/Create.Values/Read(CreateSource)/ParDo(OutputSingleSource)/ParMultiDo(OutputSingleSource):beam:transform:pardo:v1\n  must follow: \n  downstream_side_inputs: <unknown>', 'external_9SqlTransform(beam:external:java:sql:v1)/BeamValuesRel_13/Create.Values/Read(CreateSource)/ParDo(BoundedSourceAsSDFWrapper)/ParMultiDo(BoundedSourceAsSDFWrapper)\n  SqlTransform(beam:external:java:sql:v1)/BeamValuesRel_13/Create.Values/Read(CreateSource)/ParDo(BoundedSourceAsSDFWrapper)/ParMultiDo(BoundedSourceAsSDFWrapper):beam:transform:pardo:v1\n  must follow: \n  downstream_side_inputs: <unknown>', 'external_9SqlTransform(beam:external:java:sql:v1)/BeamZetaSqlCalcRel_17/ParDo(Calc)/ParMultiDo(Calc)\n  SqlTransform(beam:external:java:sql:v1)/BeamZetaSqlCalcRel_17/ParDo(Calc)/ParMultiDo(Calc):beam:transform:pardo:v1\n  must follow: \n  downstream_side_inputs: <unknown>', 'ref_AppliedPTransform_assert_that/Create/Impulse_5\n  assert_that/Create/Impulse:beam:transform:impulse:v1\n  must follow: \n  downstream_side_inputs: <unknown>', 'ref_AppliedPTransform_assert_that/Create/FlatMap(<lambda at core.py:2971>)_6\n  assert_that/Create/FlatMap(<lambda at core.py:2971>):beam:transform:pardo:v1\n  must follow: \n  downstream_side_inputs: <unknown>', 'ref_AppliedPTransform_assert_that/Create/Map(decode)_8\n  assert_that/Create/Map(decode):beam:transform:pardo:v1\n  must follow: \n  downstream_side_inputs: <unknown>', 'ref_AppliedPTransform_assert_that/WindowInto(WindowIntoFn)_9\n  assert_that/WindowInto(WindowIntoFn):beam:transform:window_into:v1\n  must follow: \n  downstream_side_inputs: <unknown>', 'ref_AppliedPTransform_assert_that/ToVoidKey_10\n  assert_that/ToVoidKey:beam:transform:pardo:v1\n  must follow: \n  downstream_side_inputs: <unknown>', 'ref_AppliedPTransform_assert_that/Group/pair_with_0_12\n  assert_that/Group/pair_with_0:beam:transform:pardo:v1\n  must follow: \n  downstream_side_inputs: <unknown>', 'ref_AppliedPTransform_assert_that/Group/pair_with_1_13\n  assert_that/Group/pair_with_1:beam:transform:pardo:v1\n  must follow: \n  downstream_side_inputs: <unknown>', 'ref_AppliedPTransform_assert_that/Group/Flatten_14\n  assert_that/Group/Flatten:beam:transform:flatten:v1\n  must follow: \n  downstream_side_inputs: <unknown>', 'ref_AppliedPTransform_assert_that/Group/GroupByKey_15\n  assert_that/Group/GroupByKey:beam:transform:group_by_key:v1\n  must follow: \n  downstream_side_inputs: <unknown>', 'ref_AppliedPTransform_assert_that/Group/Map(_merge_tagged_vals_under_key)_16\n  assert_that/Group/Map(_merge_tagged_vals_under_key):beam:transform:pardo:v1\n  must follow: \n  downstream_side_inputs: <unknown>', 'ref_AppliedPTransform_assert_that/Unkey_17\n  assert_that/Unkey:beam:transform:pardo:v1\n  must follow: \n  downstream_side_inputs: <unknown>', 'ref_AppliedPTransform_assert_that/Match_18\n  assert_that/Match:beam:transform:pardo:v1\n  must follow: \n  downstream_side_inputs: <unknown>']
--------------------- >> end captured logging << ---------------------

----------------------------------------------------------------------
XML: nosetests-xlangSqlValidateRunner.xml
----------------------------------------------------------------------
XML: <https://ci-beam.apache.org/job/beam_PostCommit_XVR_Spark/ws/src/sdks/python/nosetests.xml>
----------------------------------------------------------------------
Ran 9 tests in 624.319s

FAILED (errors=9)

> Task :runners:spark:2:job-server:validatesCrossLanguageRunnerPythonUsingSql FAILED
> Task :runners:spark:2:job-server:validatesCrossLanguageRunnerCleanup
> Task :runners:spark:2:job-server:sparkJobServerCleanup

FAILURE: Build completed with 9 failures.

1: Task failed with an exception.
-----------
* What went wrong:
Execution failed for task ':runners:spark:3:job-server:validatesCrossLanguageRunnerJavaUsingJava'.
> There were failing tests. See the report at: file://<https://ci-beam.apache.org/job/beam_PostCommit_XVR_Spark/ws/src/runners/spark/3/job-server/build/reports/tests/validatesCrossLanguageRunnerJavaUsingJava/index.html>

* Try:
Run with --stacktrace option to get the stack trace. Run with --info or --debug option to get more log output. Run with --scan to get full insights.
==============================================================================

2: Task failed with an exception.
-----------
* What went wrong:
Execution failed for task ':runners:spark:3:job-server:validatesCrossLanguageRunnerJavaUsingPython'.
> There were failing tests. See the report at: file://<https://ci-beam.apache.org/job/beam_PostCommit_XVR_Spark/ws/src/runners/spark/3/job-server/build/reports/tests/validatesCrossLanguageRunnerJavaUsingPython/index.html>

* Try:
Run with --stacktrace option to get the stack trace. Run with --info or --debug option to get more log output. Run with --scan to get full insights.
==============================================================================

3: Task failed with an exception.
-----------
* What went wrong:
Execution failed for task ':runners:spark:3:job-server:validatesCrossLanguageRunnerJavaUsingPythonOnly'.
> There were failing tests. See the report at: file://<https://ci-beam.apache.org/job/beam_PostCommit_XVR_Spark/ws/src/runners/spark/3/job-server/build/reports/tests/validatesCrossLanguageRunnerJavaUsingPythonOnly/index.html>

* Try:
Run with --stacktrace option to get the stack trace. Run with --info or --debug option to get more log output. Run with --scan to get full insights.
==============================================================================

4: Task failed with an exception.
-----------
* What went wrong:
Execution failed for task ':runners:spark:3:job-server:validatesCrossLanguageRunnerPythonUsingJava'.
> Process 'command 'sh'' finished with non-zero exit value 1

* Try:
Run with --stacktrace option to get the stack trace. Run with --info or --debug option to get more log output. Run with --scan to get full insights.
==============================================================================

5: Task failed with an exception.
-----------
* What went wrong:
Execution failed for task ':runners:spark:3:job-server:validatesCrossLanguageRunnerPythonUsingPython'.
> Process 'command 'sh'' finished with non-zero exit value 1

* Try:
Run with --stacktrace option to get the stack trace. Run with --info or --debug option to get more log output. Run with --scan to get full insights.
==============================================================================

6: Task failed with an exception.
-----------
* What went wrong:
Execution failed for task ':runners:spark:3:job-server:validatesCrossLanguageRunnerPythonUsingSql'.
> Process 'command 'sh'' finished with non-zero exit value 1

* Try:
Run with --stacktrace option to get the stack trace. Run with --info or --debug option to get more log output. Run with --scan to get full insights.
==============================================================================

7: Task failed with an exception.
-----------
* What went wrong:
Execution failed for task ':runners:spark:2:job-server:validatesCrossLanguageRunnerPythonUsingJava'.
> Process 'command 'sh'' finished with non-zero exit value 1

* Try:
Run with --stacktrace option to get the stack trace. Run with --info or --debug option to get more log output. Run with --scan to get full insights.
==============================================================================

8: Task failed with an exception.
-----------
* What went wrong:
Execution failed for task ':runners:spark:2:job-server:validatesCrossLanguageRunnerPythonUsingPython'.
> Process 'command 'sh'' finished with non-zero exit value 1

* Try:
Run with --stacktrace option to get the stack trace. Run with --info or --debug option to get more log output. Run with --scan to get full insights.
==============================================================================

9: Task failed with an exception.
-----------
* What went wrong:
Execution failed for task ':runners:spark:2:job-server:validatesCrossLanguageRunnerPythonUsingSql'.
> Process 'command 'sh'' finished with non-zero exit value 1

* Try:
Run with --stacktrace option to get the stack trace. Run with --info or --debug option to get more log output. Run with --scan to get full insights.
==============================================================================

* Get more help at https://help.gradle.org

Deprecated Gradle features were used in this build, making it incompatible with Gradle 7.0.
Use '--warning-mode all' to show the individual deprecation warnings.
See https://docs.gradle.org/6.8/userguide/command_line_interface.html#sec:command_line_warnings

BUILD FAILED in 44m 28s
201 actionable tasks: 151 executed, 46 from cache, 4 up-to-date
Gradle was unable to watch the file system for changes. The inotify watches limit is too low.

Publishing build scan...
https://gradle.com/s/v27u2uwl5y3fe

Build step 'Invoke Gradle script' changed build result to FAILURE
Build step 'Invoke Gradle script' marked build as failure


---------------------------------------------------------------------
To unsubscribe, e-mail: builds-unsubscribe@beam.apache.org
For additional commands, e-mail: builds-help@beam.apache.org


Build failed in Jenkins: beam_PostCommit_XVR_Spark #2067

Posted by Apache Jenkins Server <je...@builds.apache.org>.
See <https://ci-beam.apache.org/job/beam_PostCommit_XVR_Spark/2067/display/redirect?page=changes>

Changes:

[noreply] [BEAM-10937] Tour of Beam: Reading and writing data notebook (#14045)

[Kenneth Knowles] Keep dev/SNAPSHOT version on release branch; set to non-SNAPSHOT version

[Kenneth Knowles] Update instructions for cutting release branch


------------------------------------------
[...truncated 654.10 KB...]
root: INFO: Python SDK container image set to "apache/beam_python3.6_sdk:2.30.0.dev" for Docker environment
apache_beam.runners.portability.fn_api_runner.translations: INFO: ==================== <function lift_combiners at 0x7fa0aed02d90> ====================
apache_beam.runners.portability.fn_api_runner.translations: DEBUG: 40 [1, 1, 1, 1, 1, 1, 1, 1, 1, 1, 1, 1, 1, 1, 1, 1, 1, 1, 1, 1, 1, 1, 1, 1, 1, 1, 1, 1, 1, 1, 1, 1, 1, 1, 1, 1, 1, 1, 1, 1]
apache_beam.runners.portability.fn_api_runner.translations: DEBUG: Stages: ['ref_AppliedPTransform_Create enrich/Impulse_3\n  Create enrich/Impulse:beam:transform:impulse:v1\n  must follow: \n  downstream_side_inputs: <unknown>', 'ref_AppliedPTransform_Create enrich/FlatMap(<lambda at core.py:2971>)_4\n  Create enrich/FlatMap(<lambda at core.py:2971>):beam:transform:pardo:v1\n  must follow: \n  downstream_side_inputs: <unknown>', 'ref_AppliedPTransform_Create enrich/MaybeReshuffle/Reshuffle/AddRandomKeys_7\n  Create enrich/MaybeReshuffle/Reshuffle/AddRandomKeys:beam:transform:pardo:v1\n  must follow: \n  downstream_side_inputs: <unknown>', 'ref_AppliedPTransform_Create enrich/MaybeReshuffle/Reshuffle/ReshufflePerKey/Map(reify_timestamps)_9\n  Create enrich/MaybeReshuffle/Reshuffle/ReshufflePerKey/Map(reify_timestamps):beam:transform:pardo:v1\n  must follow: \n  downstream_side_inputs: <unknown>', 'ref_AppliedPTransform_Create enrich/MaybeReshuffle/Reshuffle/ReshufflePerKey/GroupByKey_10\n  Create enrich/MaybeReshuffle/Reshuffle/ReshufflePerKey/GroupByKey:beam:transform:group_by_key:v1\n  must follow: \n  downstream_side_inputs: <unknown>', 'ref_AppliedPTransform_Create enrich/MaybeReshuffle/Reshuffle/ReshufflePerKey/FlatMap(restore_timestamps)_11\n  Create enrich/MaybeReshuffle/Reshuffle/ReshufflePerKey/FlatMap(restore_timestamps):beam:transform:pardo:v1\n  must follow: \n  downstream_side_inputs: <unknown>', 'ref_AppliedPTransform_Create enrich/MaybeReshuffle/Reshuffle/RemoveRandomKeys_12\n  Create enrich/MaybeReshuffle/Reshuffle/RemoveRandomKeys:beam:transform:pardo:v1\n  must follow: \n  downstream_side_inputs: <unknown>', 'ref_AppliedPTransform_Create enrich/Map(decode)_13\n  Create enrich/Map(decode):beam:transform:pardo:v1\n  must follow: \n  downstream_side_inputs: <unknown>', 'ref_AppliedPTransform_Create simple/Impulse_15\n  Create simple/Impulse:beam:transform:impulse:v1\n  must follow: \n  downstream_side_inputs: <unknown>', 'ref_AppliedPTransform_Create simple/FlatMap(<lambda at core.py:2971>)_16\n  Create simple/FlatMap(<lambda at core.py:2971>):beam:transform:pardo:v1\n  must follow: \n  downstream_side_inputs: <unknown>', 'ref_AppliedPTransform_Create simple/MaybeReshuffle/Reshuffle/AddRandomKeys_19\n  Create simple/MaybeReshuffle/Reshuffle/AddRandomKeys:beam:transform:pardo:v1\n  must follow: \n  downstream_side_inputs: <unknown>', 'ref_AppliedPTransform_Create simple/MaybeReshuffle/Reshuffle/ReshufflePerKey/Map(reify_timestamps)_21\n  Create simple/MaybeReshuffle/Reshuffle/ReshufflePerKey/Map(reify_timestamps):beam:transform:pardo:v1\n  must follow: \n  downstream_side_inputs: <unknown>', 'ref_AppliedPTransform_Create simple/MaybeReshuffle/Reshuffle/ReshufflePerKey/GroupByKey_22\n  Create simple/MaybeReshuffle/Reshuffle/ReshufflePerKey/GroupByKey:beam:transform:group_by_key:v1\n  must follow: \n  downstream_side_inputs: <unknown>', 'ref_AppliedPTransform_Create simple/MaybeReshuffle/Reshuffle/ReshufflePerKey/FlatMap(restore_timestamps)_23\n  Create simple/MaybeReshuffle/Reshuffle/ReshufflePerKey/FlatMap(restore_timestamps):beam:transform:pardo:v1\n  must follow: \n  downstream_side_inputs: <unknown>', 'ref_AppliedPTransform_Create simple/MaybeReshuffle/Reshuffle/RemoveRandomKeys_24\n  Create simple/MaybeReshuffle/Reshuffle/RemoveRandomKeys:beam:transform:pardo:v1\n  must follow: \n  downstream_side_inputs: <unknown>', 'ref_AppliedPTransform_Create simple/Map(decode)_25\n  Create simple/Map(decode):beam:transform:pardo:v1\n  must follow: \n  downstream_side_inputs: <unknown>', 'external_7SqlTransform(beam:external:java:sql:v1)/BeamCoGBKJoinRel_95/left_TimestampCombiner/Flatten.PCollections\n  SqlTransform(beam:external:java:sql:v1)/BeamCoGBKJoinRel_95/left_TimestampCombiner/Flatten.PCollections:beam:transform:flatten:v1\n  must follow: \n  downstream_side_inputs: <unknown>', 'external_7SqlTransform(beam:external:java:sql:v1)/BeamCoGBKJoinRel_95/right_TimestampCombiner/Flatten.PCollections\n  SqlTransform(beam:external:java:sql:v1)/BeamCoGBKJoinRel_95/right_TimestampCombiner/Flatten.PCollections:beam:transform:flatten:v1\n  must follow: \n  downstream_side_inputs: <unknown>', 'external_7SqlTransform(beam:external:java:sql:v1)/BeamCoGBKJoinRel_95/Join.Impl/CoGroup.ExpandCrossProduct/extractKeylhs/ParMultiDo(Anonymous)\n  SqlTransform(beam:external:java:sql:v1)/BeamCoGBKJoinRel_95/Join.Impl/CoGroup.ExpandCrossProduct/extractKeylhs/ParMultiDo(Anonymous):beam:transform:pardo:v1\n  must follow: \n  downstream_side_inputs: <unknown>', 'external_7SqlTransform(beam:external:java:sql:v1)/BeamCoGBKJoinRel_95/Join.Impl/CoGroup.ExpandCrossProduct/extractKeyrhs/ParMultiDo(Anonymous)\n  SqlTransform(beam:external:java:sql:v1)/BeamCoGBKJoinRel_95/Join.Impl/CoGroup.ExpandCrossProduct/extractKeyrhs/ParMultiDo(Anonymous):beam:transform:pardo:v1\n  must follow: \n  downstream_side_inputs: <unknown>', 'external_7SqlTransform(beam:external:java:sql:v1)/BeamCoGBKJoinRel_95/Join.Impl/CoGroup.ExpandCrossProduct/CoGroupByKey/MakeUnionTable0/ParMultiDo(ConstructUnionTable)\n  SqlTransform(beam:external:java:sql:v1)/BeamCoGBKJoinRel_95/Join.Impl/CoGroup.ExpandCrossProduct/CoGroupByKey/MakeUnionTable0/ParMultiDo(ConstructUnionTable):beam:transform:pardo:v1\n  must follow: \n  downstream_side_inputs: <unknown>', 'external_7SqlTransform(beam:external:java:sql:v1)/BeamCoGBKJoinRel_95/Join.Impl/CoGroup.ExpandCrossProduct/CoGroupByKey/MakeUnionTable1/ParMultiDo(ConstructUnionTable)\n  SqlTransform(beam:external:java:sql:v1)/BeamCoGBKJoinRel_95/Join.Impl/CoGroup.ExpandCrossProduct/CoGroupByKey/MakeUnionTable1/ParMultiDo(ConstructUnionTable):beam:transform:pardo:v1\n  must follow: \n  downstream_side_inputs: <unknown>', 'external_7SqlTransform(beam:external:java:sql:v1)/BeamCoGBKJoinRel_95/Join.Impl/CoGroup.ExpandCrossProduct/CoGroupByKey/Flatten\n  SqlTransform(beam:external:java:sql:v1)/BeamCoGBKJoinRel_95/Join.Impl/CoGroup.ExpandCrossProduct/CoGroupByKey/Flatten:beam:transform:flatten:v1\n  must follow: \n  downstream_side_inputs: <unknown>', 'external_7SqlTransform(beam:external:java:sql:v1)/BeamCoGBKJoinRel_95/Join.Impl/CoGroup.ExpandCrossProduct/CoGroupByKey/GBK\n  SqlTransform(beam:external:java:sql:v1)/BeamCoGBKJoinRel_95/Join.Impl/CoGroup.ExpandCrossProduct/CoGroupByKey/GBK:beam:transform:group_by_key:v1\n  must follow: \n  downstream_side_inputs: <unknown>', 'external_7SqlTransform(beam:external:java:sql:v1)/BeamCoGBKJoinRel_95/Join.Impl/CoGroup.ExpandCrossProduct/CoGroupByKey/ConstructCoGbkResultFn/ParMultiDo(ConstructCoGbkResult)\n  SqlTransform(beam:external:java:sql:v1)/BeamCoGBKJoinRel_95/Join.Impl/CoGroup.ExpandCrossProduct/CoGroupByKey/ConstructCoGbkResultFn/ParMultiDo(ConstructCoGbkResult):beam:transform:pardo:v1\n  must follow: \n  downstream_side_inputs: <unknown>', 'external_7SqlTransform(beam:external:java:sql:v1)/BeamCoGBKJoinRel_95/Join.Impl/CoGroup.ExpandCrossProduct/ParDo(ConvertCoGbkResult)/ParMultiDo(ConvertCoGbkResult)\n  SqlTransform(beam:external:java:sql:v1)/BeamCoGBKJoinRel_95/Join.Impl/CoGroup.ExpandCrossProduct/ParDo(ConvertCoGbkResult)/ParMultiDo(ConvertCoGbkResult):beam:transform:pardo:v1\n  must follow: \n  downstream_side_inputs: <unknown>', 'external_7SqlTransform(beam:external:java:sql:v1)/BeamCoGBKJoinRel_95/Select.Fields/ParDo(Select)/ParMultiDo(Select)\n  SqlTransform(beam:external:java:sql:v1)/BeamCoGBKJoinRel_95/Select.Fields/ParDo(Select)/ParMultiDo(Select):beam:transform:pardo:v1\n  must follow: \n  downstream_side_inputs: <unknown>', 'external_7SqlTransform(beam:external:java:sql:v1)/BeamCalcRel_96/ParDo(Calc)/ParMultiDo(Calc)\n  SqlTransform(beam:external:java:sql:v1)/BeamCalcRel_96/ParDo(Calc)/ParMultiDo(Calc):beam:transform:pardo:v1\n  must follow: \n  downstream_side_inputs: <unknown>', 'ref_AppliedPTransform_assert_that/Create/Impulse_29\n  assert_that/Create/Impulse:beam:transform:impulse:v1\n  must follow: \n  downstream_side_inputs: <unknown>', 'ref_AppliedPTransform_assert_that/Create/FlatMap(<lambda at core.py:2971>)_30\n  assert_that/Create/FlatMap(<lambda at core.py:2971>):beam:transform:pardo:v1\n  must follow: \n  downstream_side_inputs: <unknown>', 'ref_AppliedPTransform_assert_that/Create/Map(decode)_32\n  assert_that/Create/Map(decode):beam:transform:pardo:v1\n  must follow: \n  downstream_side_inputs: <unknown>', 'ref_AppliedPTransform_assert_that/WindowInto(WindowIntoFn)_33\n  assert_that/WindowInto(WindowIntoFn):beam:transform:window_into:v1\n  must follow: \n  downstream_side_inputs: <unknown>', 'ref_AppliedPTransform_assert_that/ToVoidKey_34\n  assert_that/ToVoidKey:beam:transform:pardo:v1\n  must follow: \n  downstream_side_inputs: <unknown>', 'ref_AppliedPTransform_assert_that/Group/pair_with_0_36\n  assert_that/Group/pair_with_0:beam:transform:pardo:v1\n  must follow: \n  downstream_side_inputs: <unknown>', 'ref_AppliedPTransform_assert_that/Group/pair_with_1_37\n  assert_that/Group/pair_with_1:beam:transform:pardo:v1\n  must follow: \n  downstream_side_inputs: <unknown>', 'ref_AppliedPTransform_assert_that/Group/Flatten_38\n  assert_that/Group/Flatten:beam:transform:flatten:v1\n  must follow: \n  downstream_side_inputs: <unknown>', 'ref_AppliedPTransform_assert_that/Group/GroupByKey_39\n  assert_that/Group/GroupByKey:beam:transform:group_by_key:v1\n  must follow: \n  downstream_side_inputs: <unknown>', 'ref_AppliedPTransform_assert_that/Group/Map(_merge_tagged_vals_under_key)_40\n  assert_that/Group/Map(_merge_tagged_vals_under_key):beam:transform:pardo:v1\n  must follow: \n  downstream_side_inputs: <unknown>', 'ref_AppliedPTransform_assert_that/Unkey_41\n  assert_that/Unkey:beam:transform:pardo:v1\n  must follow: \n  downstream_side_inputs: <unknown>', 'ref_AppliedPTransform_assert_that/Match_42\n  assert_that/Match:beam:transform:pardo:v1\n  must follow: \n  downstream_side_inputs: <unknown>']
apache_beam.runners.portability.fn_api_runner.translations: INFO: ==================== <function sort_stages at 0x7fa0aed03510> ====================
apache_beam.runners.portability.fn_api_runner.translations: DEBUG: 40 [1, 1, 1, 1, 1, 1, 1, 1, 1, 1, 1, 1, 1, 1, 1, 1, 1, 1, 1, 1, 1, 1, 1, 1, 1, 1, 1, 1, 1, 1, 1, 1, 1, 1, 1, 1, 1, 1, 1, 1]
apache_beam.runners.portability.fn_api_runner.translations: DEBUG: Stages: ['ref_AppliedPTransform_Create enrich/Impulse_3\n  Create enrich/Impulse:beam:transform:impulse:v1\n  must follow: \n  downstream_side_inputs: <unknown>', 'ref_AppliedPTransform_Create enrich/FlatMap(<lambda at core.py:2971>)_4\n  Create enrich/FlatMap(<lambda at core.py:2971>):beam:transform:pardo:v1\n  must follow: \n  downstream_side_inputs: <unknown>', 'ref_AppliedPTransform_Create enrich/MaybeReshuffle/Reshuffle/AddRandomKeys_7\n  Create enrich/MaybeReshuffle/Reshuffle/AddRandomKeys:beam:transform:pardo:v1\n  must follow: \n  downstream_side_inputs: <unknown>', 'ref_AppliedPTransform_Create enrich/MaybeReshuffle/Reshuffle/ReshufflePerKey/Map(reify_timestamps)_9\n  Create enrich/MaybeReshuffle/Reshuffle/ReshufflePerKey/Map(reify_timestamps):beam:transform:pardo:v1\n  must follow: \n  downstream_side_inputs: <unknown>', 'ref_AppliedPTransform_Create enrich/MaybeReshuffle/Reshuffle/ReshufflePerKey/GroupByKey_10\n  Create enrich/MaybeReshuffle/Reshuffle/ReshufflePerKey/GroupByKey:beam:transform:group_by_key:v1\n  must follow: \n  downstream_side_inputs: <unknown>', 'ref_AppliedPTransform_Create enrich/MaybeReshuffle/Reshuffle/ReshufflePerKey/FlatMap(restore_timestamps)_11\n  Create enrich/MaybeReshuffle/Reshuffle/ReshufflePerKey/FlatMap(restore_timestamps):beam:transform:pardo:v1\n  must follow: \n  downstream_side_inputs: <unknown>', 'ref_AppliedPTransform_Create enrich/MaybeReshuffle/Reshuffle/RemoveRandomKeys_12\n  Create enrich/MaybeReshuffle/Reshuffle/RemoveRandomKeys:beam:transform:pardo:v1\n  must follow: \n  downstream_side_inputs: <unknown>', 'ref_AppliedPTransform_Create enrich/Map(decode)_13\n  Create enrich/Map(decode):beam:transform:pardo:v1\n  must follow: \n  downstream_side_inputs: <unknown>', 'ref_AppliedPTransform_Create simple/Impulse_15\n  Create simple/Impulse:beam:transform:impulse:v1\n  must follow: \n  downstream_side_inputs: <unknown>', 'ref_AppliedPTransform_Create simple/FlatMap(<lambda at core.py:2971>)_16\n  Create simple/FlatMap(<lambda at core.py:2971>):beam:transform:pardo:v1\n  must follow: \n  downstream_side_inputs: <unknown>', 'ref_AppliedPTransform_Create simple/MaybeReshuffle/Reshuffle/AddRandomKeys_19\n  Create simple/MaybeReshuffle/Reshuffle/AddRandomKeys:beam:transform:pardo:v1\n  must follow: \n  downstream_side_inputs: <unknown>', 'ref_AppliedPTransform_Create simple/MaybeReshuffle/Reshuffle/ReshufflePerKey/Map(reify_timestamps)_21\n  Create simple/MaybeReshuffle/Reshuffle/ReshufflePerKey/Map(reify_timestamps):beam:transform:pardo:v1\n  must follow: \n  downstream_side_inputs: <unknown>', 'ref_AppliedPTransform_Create simple/MaybeReshuffle/Reshuffle/ReshufflePerKey/GroupByKey_22\n  Create simple/MaybeReshuffle/Reshuffle/ReshufflePerKey/GroupByKey:beam:transform:group_by_key:v1\n  must follow: \n  downstream_side_inputs: <unknown>', 'ref_AppliedPTransform_Create simple/MaybeReshuffle/Reshuffle/ReshufflePerKey/FlatMap(restore_timestamps)_23\n  Create simple/MaybeReshuffle/Reshuffle/ReshufflePerKey/FlatMap(restore_timestamps):beam:transform:pardo:v1\n  must follow: \n  downstream_side_inputs: <unknown>', 'ref_AppliedPTransform_Create simple/MaybeReshuffle/Reshuffle/RemoveRandomKeys_24\n  Create simple/MaybeReshuffle/Reshuffle/RemoveRandomKeys:beam:transform:pardo:v1\n  must follow: \n  downstream_side_inputs: <unknown>', 'ref_AppliedPTransform_Create simple/Map(decode)_25\n  Create simple/Map(decode):beam:transform:pardo:v1\n  must follow: \n  downstream_side_inputs: <unknown>', 'external_7SqlTransform(beam:external:java:sql:v1)/BeamCoGBKJoinRel_95/left_TimestampCombiner/Flatten.PCollections\n  SqlTransform(beam:external:java:sql:v1)/BeamCoGBKJoinRel_95/left_TimestampCombiner/Flatten.PCollections:beam:transform:flatten:v1\n  must follow: \n  downstream_side_inputs: <unknown>', 'external_7SqlTransform(beam:external:java:sql:v1)/BeamCoGBKJoinRel_95/right_TimestampCombiner/Flatten.PCollections\n  SqlTransform(beam:external:java:sql:v1)/BeamCoGBKJoinRel_95/right_TimestampCombiner/Flatten.PCollections:beam:transform:flatten:v1\n  must follow: \n  downstream_side_inputs: <unknown>', 'external_7SqlTransform(beam:external:java:sql:v1)/BeamCoGBKJoinRel_95/Join.Impl/CoGroup.ExpandCrossProduct/extractKeylhs/ParMultiDo(Anonymous)\n  SqlTransform(beam:external:java:sql:v1)/BeamCoGBKJoinRel_95/Join.Impl/CoGroup.ExpandCrossProduct/extractKeylhs/ParMultiDo(Anonymous):beam:transform:pardo:v1\n  must follow: \n  downstream_side_inputs: <unknown>', 'external_7SqlTransform(beam:external:java:sql:v1)/BeamCoGBKJoinRel_95/Join.Impl/CoGroup.ExpandCrossProduct/extractKeyrhs/ParMultiDo(Anonymous)\n  SqlTransform(beam:external:java:sql:v1)/BeamCoGBKJoinRel_95/Join.Impl/CoGroup.ExpandCrossProduct/extractKeyrhs/ParMultiDo(Anonymous):beam:transform:pardo:v1\n  must follow: \n  downstream_side_inputs: <unknown>', 'external_7SqlTransform(beam:external:java:sql:v1)/BeamCoGBKJoinRel_95/Join.Impl/CoGroup.ExpandCrossProduct/CoGroupByKey/MakeUnionTable0/ParMultiDo(ConstructUnionTable)\n  SqlTransform(beam:external:java:sql:v1)/BeamCoGBKJoinRel_95/Join.Impl/CoGroup.ExpandCrossProduct/CoGroupByKey/MakeUnionTable0/ParMultiDo(ConstructUnionTable):beam:transform:pardo:v1\n  must follow: \n  downstream_side_inputs: <unknown>', 'external_7SqlTransform(beam:external:java:sql:v1)/BeamCoGBKJoinRel_95/Join.Impl/CoGroup.ExpandCrossProduct/CoGroupByKey/MakeUnionTable1/ParMultiDo(ConstructUnionTable)\n  SqlTransform(beam:external:java:sql:v1)/BeamCoGBKJoinRel_95/Join.Impl/CoGroup.ExpandCrossProduct/CoGroupByKey/MakeUnionTable1/ParMultiDo(ConstructUnionTable):beam:transform:pardo:v1\n  must follow: \n  downstream_side_inputs: <unknown>', 'external_7SqlTransform(beam:external:java:sql:v1)/BeamCoGBKJoinRel_95/Join.Impl/CoGroup.ExpandCrossProduct/CoGroupByKey/Flatten\n  SqlTransform(beam:external:java:sql:v1)/BeamCoGBKJoinRel_95/Join.Impl/CoGroup.ExpandCrossProduct/CoGroupByKey/Flatten:beam:transform:flatten:v1\n  must follow: \n  downstream_side_inputs: <unknown>', 'external_7SqlTransform(beam:external:java:sql:v1)/BeamCoGBKJoinRel_95/Join.Impl/CoGroup.ExpandCrossProduct/CoGroupByKey/GBK\n  SqlTransform(beam:external:java:sql:v1)/BeamCoGBKJoinRel_95/Join.Impl/CoGroup.ExpandCrossProduct/CoGroupByKey/GBK:beam:transform:group_by_key:v1\n  must follow: \n  downstream_side_inputs: <unknown>', 'external_7SqlTransform(beam:external:java:sql:v1)/BeamCoGBKJoinRel_95/Join.Impl/CoGroup.ExpandCrossProduct/CoGroupByKey/ConstructCoGbkResultFn/ParMultiDo(ConstructCoGbkResult)\n  SqlTransform(beam:external:java:sql:v1)/BeamCoGBKJoinRel_95/Join.Impl/CoGroup.ExpandCrossProduct/CoGroupByKey/ConstructCoGbkResultFn/ParMultiDo(ConstructCoGbkResult):beam:transform:pardo:v1\n  must follow: \n  downstream_side_inputs: <unknown>', 'external_7SqlTransform(beam:external:java:sql:v1)/BeamCoGBKJoinRel_95/Join.Impl/CoGroup.ExpandCrossProduct/ParDo(ConvertCoGbkResult)/ParMultiDo(ConvertCoGbkResult)\n  SqlTransform(beam:external:java:sql:v1)/BeamCoGBKJoinRel_95/Join.Impl/CoGroup.ExpandCrossProduct/ParDo(ConvertCoGbkResult)/ParMultiDo(ConvertCoGbkResult):beam:transform:pardo:v1\n  must follow: \n  downstream_side_inputs: <unknown>', 'external_7SqlTransform(beam:external:java:sql:v1)/BeamCoGBKJoinRel_95/Select.Fields/ParDo(Select)/ParMultiDo(Select)\n  SqlTransform(beam:external:java:sql:v1)/BeamCoGBKJoinRel_95/Select.Fields/ParDo(Select)/ParMultiDo(Select):beam:transform:pardo:v1\n  must follow: \n  downstream_side_inputs: <unknown>', 'external_7SqlTransform(beam:external:java:sql:v1)/BeamCalcRel_96/ParDo(Calc)/ParMultiDo(Calc)\n  SqlTransform(beam:external:java:sql:v1)/BeamCalcRel_96/ParDo(Calc)/ParMultiDo(Calc):beam:transform:pardo:v1\n  must follow: \n  downstream_side_inputs: <unknown>', 'ref_AppliedPTransform_assert_that/Create/Impulse_29\n  assert_that/Create/Impulse:beam:transform:impulse:v1\n  must follow: \n  downstream_side_inputs: <unknown>', 'ref_AppliedPTransform_assert_that/Create/FlatMap(<lambda at core.py:2971>)_30\n  assert_that/Create/FlatMap(<lambda at core.py:2971>):beam:transform:pardo:v1\n  must follow: \n  downstream_side_inputs: <unknown>', 'ref_AppliedPTransform_assert_that/Create/Map(decode)_32\n  assert_that/Create/Map(decode):beam:transform:pardo:v1\n  must follow: \n  downstream_side_inputs: <unknown>', 'ref_AppliedPTransform_assert_that/WindowInto(WindowIntoFn)_33\n  assert_that/WindowInto(WindowIntoFn):beam:transform:window_into:v1\n  must follow: \n  downstream_side_inputs: <unknown>', 'ref_AppliedPTransform_assert_that/ToVoidKey_34\n  assert_that/ToVoidKey:beam:transform:pardo:v1\n  must follow: \n  downstream_side_inputs: <unknown>', 'ref_AppliedPTransform_assert_that/Group/pair_with_0_36\n  assert_that/Group/pair_with_0:beam:transform:pardo:v1\n  must follow: \n  downstream_side_inputs: <unknown>', 'ref_AppliedPTransform_assert_that/Group/pair_with_1_37\n  assert_that/Group/pair_with_1:beam:transform:pardo:v1\n  must follow: \n  downstream_side_inputs: <unknown>', 'ref_AppliedPTransform_assert_that/Group/Flatten_38\n  assert_that/Group/Flatten:beam:transform:flatten:v1\n  must follow: \n  downstream_side_inputs: <unknown>', 'ref_AppliedPTransform_assert_that/Group/GroupByKey_39\n  assert_that/Group/GroupByKey:beam:transform:group_by_key:v1\n  must follow: \n  downstream_side_inputs: <unknown>', 'ref_AppliedPTransform_assert_that/Group/Map(_merge_tagged_vals_under_key)_40\n  assert_that/Group/Map(_merge_tagged_vals_under_key):beam:transform:pardo:v1\n  must follow: \n  downstream_side_inputs: <unknown>', 'ref_AppliedPTransform_assert_that/Unkey_41\n  assert_that/Unkey:beam:transform:pardo:v1\n  must follow: \n  downstream_side_inputs: <unknown>', 'ref_AppliedPTransform_assert_that/Match_42\n  assert_that/Match:beam:transform:pardo:v1\n  must follow: \n  downstream_side_inputs: <unknown>']
--------------------- >> end captured logging << ---------------------

======================================================================
ERROR: test_windowing_before_sql (apache_beam.transforms.sql_test.SqlTransformTest)
----------------------------------------------------------------------
Traceback (most recent call last):
  File "<https://ci-beam.apache.org/job/beam_PostCommit_XVR_Spark/ws/src/sdks/python/apache_beam/transforms/sql_test.py",> line 179, in test_windowing_before_sql
    assert_that(out, equal_to([(1, ), (1, ), (1, )]))
  File "<https://ci-beam.apache.org/job/beam_PostCommit_XVR_Spark/ws/src/sdks/python/apache_beam/pipeline.py",> line 582, in __exit__
    self.result = self.run()
  File "<https://ci-beam.apache.org/job/beam_PostCommit_XVR_Spark/ws/src/sdks/python/apache_beam/testing/test_pipeline.py",> line 112, in run
    False if self.not_use_test_runner_api else test_runner_api))
  File "<https://ci-beam.apache.org/job/beam_PostCommit_XVR_Spark/ws/src/sdks/python/apache_beam/pipeline.py",> line 561, in run
    return self.runner.run_pipeline(self, self._options)
  File "<https://ci-beam.apache.org/job/beam_PostCommit_XVR_Spark/ws/src/sdks/python/apache_beam/runners/portability/portable_runner.py",> line 440, in run_pipeline
    job_service_handle = self.create_job_service(options)
  File "<https://ci-beam.apache.org/job/beam_PostCommit_XVR_Spark/ws/src/sdks/python/apache_beam/runners/portability/portable_runner.py",> line 320, in create_job_service
    return self.create_job_service_handle(server.start(), options)
  File "<https://ci-beam.apache.org/job/beam_PostCommit_XVR_Spark/ws/src/sdks/python/apache_beam/runners/portability/job_server.py",> line 56, in start
    grpc.channel_ready_future(channel).result(timeout=self._timeout)
  File "<https://ci-beam.apache.org/job/beam_PostCommit_XVR_Spark/ws/src/build/gradleenv/1922375555/lib/python3.6/site-packages/grpc/_utilities.py",> line 140, in result
    self._block(timeout)
  File "<https://ci-beam.apache.org/job/beam_PostCommit_XVR_Spark/ws/src/build/gradleenv/1922375555/lib/python3.6/site-packages/grpc/_utilities.py",> line 86, in _block
    raise grpc.FutureTimeoutError()
grpc.FutureTimeoutError: 
-------------------- >> begin captured logging << --------------------
apache_beam.utils.subprocess_server: INFO: Using pre-built snapshot at <https://ci-beam.apache.org/job/beam_PostCommit_XVR_Spark/ws/src/sdks/java/extensions/sql/expansion-service/build/libs/beam-sdks-java-extensions-sql-expansion-service-2.30.0-SNAPSHOT.jar>
apache_beam.utils.subprocess_server: INFO: Starting service with ['java' '-jar' '<https://ci-beam.apache.org/job/beam_PostCommit_XVR_Spark/ws/src/sdks/java/extensions/sql/expansion-service/build/libs/beam-sdks-java-extensions-sql-expansion-service-2.30.0-SNAPSHOT.jar'> '60539']
root: DEBUG: Waiting for grpc channel to be ready at localhost:60539.
apache_beam.utils.subprocess_server: INFO: b'Starting expansion service at localhost:60539'
root: DEBUG: Waiting for grpc channel to be ready at localhost:60539.
apache_beam.utils.subprocess_server: INFO: b'Mar 18, 2021 12:28:28 AM org.apache.beam.sdk.expansion.service.ExpansionService loadRegisteredTransforms'
apache_beam.utils.subprocess_server: INFO: b'INFO: Registering external transforms: [beam:external:java:sql:v1, beam:external:java:generate_sequence:v1]'
apache_beam.utils.subprocess_server: INFO: b'\tbeam:external:java:sql:v1: org.apache.beam.sdk.expansion.service.ExpansionService$ExternalTransformRegistrarLoader$$Lambda$3/1130478920@5680a178'
apache_beam.utils.subprocess_server: INFO: b'\tbeam:external:java:generate_sequence:v1: org.apache.beam.sdk.expansion.service.ExpansionService$ExternalTransformRegistrarLoader$$Lambda$3/1130478920@5fdef03a'
root: DEBUG: Waiting for grpc channel to be ready at localhost:60539.
root: DEBUG: Waiting for grpc channel to be ready at localhost:60539.
root: DEBUG: Waiting for grpc channel to be ready at localhost:60539.
root: DEBUG: Waiting for grpc channel to be ready at localhost:60539.
apache_beam.utils.subprocess_server: INFO: b'Mar 18, 2021 12:28:29 AM org.apache.beam.sdk.expansion.service.ExpansionService expand'
apache_beam.utils.subprocess_server: INFO: b"INFO: Expanding 'SqlTransform(beam:external:java:sql:v1)' with URN 'beam:external:java:sql:v1'"
apache_beam.utils.subprocess_server: INFO: b'Mar 18, 2021 12:28:30 AM org.apache.beam.sdk.expansion.service.ExpansionService$ExternalTransformRegistrarLoader payloadToConfig'
apache_beam.utils.subprocess_server: INFO: b"WARNING: Configuration class 'org.apache.beam.sdk.extensions.sql.expansion.ExternalSqlTransformRegistrar$Configuration' has no schema registered. Attempting to construct with setter approach."
apache_beam.utils.subprocess_server: INFO: b'Mar 18, 2021 12:28:31 AM org.apache.beam.sdk.extensions.sql.impl.CalciteQueryPlanner convertToBeamRel'
apache_beam.utils.subprocess_server: INFO: b'INFO: SQL:'
apache_beam.utils.subprocess_server: INFO: b'SELECT COUNT(*) AS `count`'
apache_beam.utils.subprocess_server: INFO: b'FROM `beam`.`PCOLLECTION` AS `PCOLLECTION`'
apache_beam.utils.subprocess_server: INFO: b'Mar 18, 2021 12:28:32 AM org.apache.beam.sdk.extensions.sql.impl.CalciteQueryPlanner convertToBeamRel'
apache_beam.utils.subprocess_server: INFO: b'INFO: SQLPlan>'
apache_beam.utils.subprocess_server: INFO: b'LogicalAggregate(group=[{}], count=[COUNT()])'
apache_beam.utils.subprocess_server: INFO: b'  LogicalProject($f0=[0])'
apache_beam.utils.subprocess_server: INFO: b'    BeamIOSourceRel(table=[[beam, PCOLLECTION]])'
apache_beam.utils.subprocess_server: INFO: b''
apache_beam.utils.subprocess_server: INFO: b'Mar 18, 2021 12:28:32 AM org.apache.beam.sdk.extensions.sql.impl.CalciteQueryPlanner convertToBeamRel'
apache_beam.utils.subprocess_server: INFO: b'INFO: BEAMPlan>'
apache_beam.utils.subprocess_server: INFO: b'BeamAggregationRel(group=[{}], count=[COUNT()])'
apache_beam.utils.subprocess_server: INFO: b'  BeamIOSourceRel(table=[[beam, PCOLLECTION]])'
apache_beam.utils.subprocess_server: INFO: b''
root: DEBUG: Sending SIGINT to job_server
root: DEBUG: Unhandled type_constraint: Union[]
root: DEBUG: Unhandled type_constraint: Union[]
root: DEBUG: Unhandled type_constraint: Union[]
root: DEBUG: Unhandled type_constraint: Union[]
root: WARNING: Make sure that locally built Python SDK docker image has Python 3.6 interpreter.
root: INFO: Default Python SDK image for environment is apache/beam_python3.6_sdk:2.30.0.dev
root: INFO: No image given, using default Python SDK image
root: WARNING: Make sure that locally built Python SDK docker image has Python 3.6 interpreter.
root: INFO: Default Python SDK image for environment is apache/beam_python3.6_sdk:2.30.0.dev
root: INFO: Python SDK container image set to "apache/beam_python3.6_sdk:2.30.0.dev" for Docker environment
apache_beam.runners.portability.fn_api_runner.translations: INFO: ==================== <function lift_combiners at 0x7fa0aed02d90> ====================
apache_beam.runners.portability.fn_api_runner.translations: DEBUG: 27 [1, 1, 1, 1, 1, 1, 1, 1, 1, 1, 1, 1, 1, 1, 1, 1, 1, 1, 1, 1, 1, 1, 1, 1, 1, 1, 1]
apache_beam.runners.portability.fn_api_runner.translations: DEBUG: Stages: ['ref_AppliedPTransform_Create/Impulse_3\n  Create/Impulse:beam:transform:impulse:v1\n  must follow: \n  downstream_side_inputs: <unknown>', 'ref_AppliedPTransform_Create/FlatMap(<lambda at core.py:2971>)_4\n  Create/FlatMap(<lambda at core.py:2971>):beam:transform:pardo:v1\n  must follow: \n  downstream_side_inputs: <unknown>', 'ref_AppliedPTransform_Create/MaybeReshuffle/Reshuffle/AddRandomKeys_7\n  Create/MaybeReshuffle/Reshuffle/AddRandomKeys:beam:transform:pardo:v1\n  must follow: \n  downstream_side_inputs: <unknown>', 'ref_AppliedPTransform_Create/MaybeReshuffle/Reshuffle/ReshufflePerKey/Map(reify_timestamps)_9\n  Create/MaybeReshuffle/Reshuffle/ReshufflePerKey/Map(reify_timestamps):beam:transform:pardo:v1\n  must follow: \n  downstream_side_inputs: <unknown>', 'ref_AppliedPTransform_Create/MaybeReshuffle/Reshuffle/ReshufflePerKey/GroupByKey_10\n  Create/MaybeReshuffle/Reshuffle/ReshufflePerKey/GroupByKey:beam:transform:group_by_key:v1\n  must follow: \n  downstream_side_inputs: <unknown>', 'ref_AppliedPTransform_Create/MaybeReshuffle/Reshuffle/ReshufflePerKey/FlatMap(restore_timestamps)_11\n  Create/MaybeReshuffle/Reshuffle/ReshufflePerKey/FlatMap(restore_timestamps):beam:transform:pardo:v1\n  must follow: \n  downstream_side_inputs: <unknown>', 'ref_AppliedPTransform_Create/MaybeReshuffle/Reshuffle/RemoveRandomKeys_12\n  Create/MaybeReshuffle/Reshuffle/RemoveRandomKeys:beam:transform:pardo:v1\n  must follow: \n  downstream_side_inputs: <unknown>', 'ref_AppliedPTransform_Create/Map(decode)_13\n  Create/Map(decode):beam:transform:pardo:v1\n  must follow: \n  downstream_side_inputs: <unknown>', 'ref_AppliedPTransform_Map(<lambda at sql_test.py:174>)_14\n  Map(<lambda at sql_test.py:174>):beam:transform:pardo:v1\n  must follow: \n  downstream_side_inputs: <unknown>', 'ref_AppliedPTransform_WindowInto(WindowIntoFn)_15\n  WindowInto(WindowIntoFn):beam:transform:window_into:v1\n  must follow: \n  downstream_side_inputs: <unknown>', 'external_8SqlTransform(beam:external:java:sql:v1)/BeamAggregationRel_40/Group.CombineFieldsByFields/ToKvs/selectKeys/AddKeys/Map/ParMultiDo(Anonymous)\n  SqlTransform(beam:external:java:sql:v1)/BeamAggregationRel_40/Group.CombineFieldsByFields/ToKvs/selectKeys/AddKeys/Map/ParMultiDo(Anonymous):beam:transform:pardo:v1\n  must follow: \n  downstream_side_inputs: <unknown>', 'external_8SqlTransform(beam:external:java:sql:v1)/BeamAggregationRel_40/Group.CombineFieldsByFields/ToKvs/GroupByKey\n  SqlTransform(beam:external:java:sql:v1)/BeamAggregationRel_40/Group.CombineFieldsByFields/ToKvs/GroupByKey:beam:transform:group_by_key:v1\n  must follow: \n  downstream_side_inputs: <unknown>', 'external_8SqlTransform(beam:external:java:sql:v1)/BeamAggregationRel_40/Group.CombineFieldsByFields/Combine/ParDo(Anonymous)/ParMultiDo(Anonymous)\n  SqlTransform(beam:external:java:sql:v1)/BeamAggregationRel_40/Group.CombineFieldsByFields/Combine/ParDo(Anonymous)/ParMultiDo(Anonymous):beam:transform:pardo:v1\n  must follow: \n  downstream_side_inputs: <unknown>', 'external_8SqlTransform(beam:external:java:sql:v1)/BeamAggregationRel_40/Group.CombineFieldsByFields/ToRow/ParMultiDo(Anonymous)\n  SqlTransform(beam:external:java:sql:v1)/BeamAggregationRel_40/Group.CombineFieldsByFields/ToRow/ParMultiDo(Anonymous):beam:transform:pardo:v1\n  must follow: \n  downstream_side_inputs: <unknown>', 'external_8SqlTransform(beam:external:java:sql:v1)/BeamAggregationRel_40/mergeRecord/ParMultiDo(Anonymous)\n  SqlTransform(beam:external:java:sql:v1)/BeamAggregationRel_40/mergeRecord/ParMultiDo(Anonymous):beam:transform:pardo:v1\n  must follow: \n  downstream_side_inputs: <unknown>', 'ref_AppliedPTransform_assert_that/Create/Impulse_19\n  assert_that/Create/Impulse:beam:transform:impulse:v1\n  must follow: \n  downstream_side_inputs: <unknown>', 'ref_AppliedPTransform_assert_that/Create/FlatMap(<lambda at core.py:2971>)_20\n  assert_that/Create/FlatMap(<lambda at core.py:2971>):beam:transform:pardo:v1\n  must follow: \n  downstream_side_inputs: <unknown>', 'ref_AppliedPTransform_assert_that/Create/Map(decode)_22\n  assert_that/Create/Map(decode):beam:transform:pardo:v1\n  must follow: \n  downstream_side_inputs: <unknown>', 'ref_AppliedPTransform_assert_that/WindowInto(WindowIntoFn)_23\n  assert_that/WindowInto(WindowIntoFn):beam:transform:window_into:v1\n  must follow: \n  downstream_side_inputs: <unknown>', 'ref_AppliedPTransform_assert_that/ToVoidKey_24\n  assert_that/ToVoidKey:beam:transform:pardo:v1\n  must follow: \n  downstream_side_inputs: <unknown>', 'ref_AppliedPTransform_assert_that/Group/pair_with_0_26\n  assert_that/Group/pair_with_0:beam:transform:pardo:v1\n  must follow: \n  downstream_side_inputs: <unknown>', 'ref_AppliedPTransform_assert_that/Group/pair_with_1_27\n  assert_that/Group/pair_with_1:beam:transform:pardo:v1\n  must follow: \n  downstream_side_inputs: <unknown>', 'ref_AppliedPTransform_assert_that/Group/Flatten_28\n  assert_that/Group/Flatten:beam:transform:flatten:v1\n  must follow: \n  downstream_side_inputs: <unknown>', 'ref_AppliedPTransform_assert_that/Group/GroupByKey_29\n  assert_that/Group/GroupByKey:beam:transform:group_by_key:v1\n  must follow: \n  downstream_side_inputs: <unknown>', 'ref_AppliedPTransform_assert_that/Group/Map(_merge_tagged_vals_under_key)_30\n  assert_that/Group/Map(_merge_tagged_vals_under_key):beam:transform:pardo:v1\n  must follow: \n  downstream_side_inputs: <unknown>', 'ref_AppliedPTransform_assert_that/Unkey_31\n  assert_that/Unkey:beam:transform:pardo:v1\n  must follow: \n  downstream_side_inputs: <unknown>', 'ref_AppliedPTransform_assert_that/Match_32\n  assert_that/Match:beam:transform:pardo:v1\n  must follow: \n  downstream_side_inputs: <unknown>']
apache_beam.runners.portability.fn_api_runner.translations: INFO: ==================== <function sort_stages at 0x7fa0aed03510> ====================
apache_beam.runners.portability.fn_api_runner.translations: DEBUG: 27 [1, 1, 1, 1, 1, 1, 1, 1, 1, 1, 1, 1, 1, 1, 1, 1, 1, 1, 1, 1, 1, 1, 1, 1, 1, 1, 1]
apache_beam.runners.portability.fn_api_runner.translations: DEBUG: Stages: ['ref_AppliedPTransform_Create/Impulse_3\n  Create/Impulse:beam:transform:impulse:v1\n  must follow: \n  downstream_side_inputs: <unknown>', 'ref_AppliedPTransform_Create/FlatMap(<lambda at core.py:2971>)_4\n  Create/FlatMap(<lambda at core.py:2971>):beam:transform:pardo:v1\n  must follow: \n  downstream_side_inputs: <unknown>', 'ref_AppliedPTransform_Create/MaybeReshuffle/Reshuffle/AddRandomKeys_7\n  Create/MaybeReshuffle/Reshuffle/AddRandomKeys:beam:transform:pardo:v1\n  must follow: \n  downstream_side_inputs: <unknown>', 'ref_AppliedPTransform_Create/MaybeReshuffle/Reshuffle/ReshufflePerKey/Map(reify_timestamps)_9\n  Create/MaybeReshuffle/Reshuffle/ReshufflePerKey/Map(reify_timestamps):beam:transform:pardo:v1\n  must follow: \n  downstream_side_inputs: <unknown>', 'ref_AppliedPTransform_Create/MaybeReshuffle/Reshuffle/ReshufflePerKey/GroupByKey_10\n  Create/MaybeReshuffle/Reshuffle/ReshufflePerKey/GroupByKey:beam:transform:group_by_key:v1\n  must follow: \n  downstream_side_inputs: <unknown>', 'ref_AppliedPTransform_Create/MaybeReshuffle/Reshuffle/ReshufflePerKey/FlatMap(restore_timestamps)_11\n  Create/MaybeReshuffle/Reshuffle/ReshufflePerKey/FlatMap(restore_timestamps):beam:transform:pardo:v1\n  must follow: \n  downstream_side_inputs: <unknown>', 'ref_AppliedPTransform_Create/MaybeReshuffle/Reshuffle/RemoveRandomKeys_12\n  Create/MaybeReshuffle/Reshuffle/RemoveRandomKeys:beam:transform:pardo:v1\n  must follow: \n  downstream_side_inputs: <unknown>', 'ref_AppliedPTransform_Create/Map(decode)_13\n  Create/Map(decode):beam:transform:pardo:v1\n  must follow: \n  downstream_side_inputs: <unknown>', 'ref_AppliedPTransform_Map(<lambda at sql_test.py:174>)_14\n  Map(<lambda at sql_test.py:174>):beam:transform:pardo:v1\n  must follow: \n  downstream_side_inputs: <unknown>', 'ref_AppliedPTransform_WindowInto(WindowIntoFn)_15\n  WindowInto(WindowIntoFn):beam:transform:window_into:v1\n  must follow: \n  downstream_side_inputs: <unknown>', 'external_8SqlTransform(beam:external:java:sql:v1)/BeamAggregationRel_40/Group.CombineFieldsByFields/ToKvs/selectKeys/AddKeys/Map/ParMultiDo(Anonymous)\n  SqlTransform(beam:external:java:sql:v1)/BeamAggregationRel_40/Group.CombineFieldsByFields/ToKvs/selectKeys/AddKeys/Map/ParMultiDo(Anonymous):beam:transform:pardo:v1\n  must follow: \n  downstream_side_inputs: <unknown>', 'external_8SqlTransform(beam:external:java:sql:v1)/BeamAggregationRel_40/Group.CombineFieldsByFields/ToKvs/GroupByKey\n  SqlTransform(beam:external:java:sql:v1)/BeamAggregationRel_40/Group.CombineFieldsByFields/ToKvs/GroupByKey:beam:transform:group_by_key:v1\n  must follow: \n  downstream_side_inputs: <unknown>', 'external_8SqlTransform(beam:external:java:sql:v1)/BeamAggregationRel_40/Group.CombineFieldsByFields/Combine/ParDo(Anonymous)/ParMultiDo(Anonymous)\n  SqlTransform(beam:external:java:sql:v1)/BeamAggregationRel_40/Group.CombineFieldsByFields/Combine/ParDo(Anonymous)/ParMultiDo(Anonymous):beam:transform:pardo:v1\n  must follow: \n  downstream_side_inputs: <unknown>', 'external_8SqlTransform(beam:external:java:sql:v1)/BeamAggregationRel_40/Group.CombineFieldsByFields/ToRow/ParMultiDo(Anonymous)\n  SqlTransform(beam:external:java:sql:v1)/BeamAggregationRel_40/Group.CombineFieldsByFields/ToRow/ParMultiDo(Anonymous):beam:transform:pardo:v1\n  must follow: \n  downstream_side_inputs: <unknown>', 'external_8SqlTransform(beam:external:java:sql:v1)/BeamAggregationRel_40/mergeRecord/ParMultiDo(Anonymous)\n  SqlTransform(beam:external:java:sql:v1)/BeamAggregationRel_40/mergeRecord/ParMultiDo(Anonymous):beam:transform:pardo:v1\n  must follow: \n  downstream_side_inputs: <unknown>', 'ref_AppliedPTransform_assert_that/Create/Impulse_19\n  assert_that/Create/Impulse:beam:transform:impulse:v1\n  must follow: \n  downstream_side_inputs: <unknown>', 'ref_AppliedPTransform_assert_that/Create/FlatMap(<lambda at core.py:2971>)_20\n  assert_that/Create/FlatMap(<lambda at core.py:2971>):beam:transform:pardo:v1\n  must follow: \n  downstream_side_inputs: <unknown>', 'ref_AppliedPTransform_assert_that/Create/Map(decode)_22\n  assert_that/Create/Map(decode):beam:transform:pardo:v1\n  must follow: \n  downstream_side_inputs: <unknown>', 'ref_AppliedPTransform_assert_that/WindowInto(WindowIntoFn)_23\n  assert_that/WindowInto(WindowIntoFn):beam:transform:window_into:v1\n  must follow: \n  downstream_side_inputs: <unknown>', 'ref_AppliedPTransform_assert_that/ToVoidKey_24\n  assert_that/ToVoidKey:beam:transform:pardo:v1\n  must follow: \n  downstream_side_inputs: <unknown>', 'ref_AppliedPTransform_assert_that/Group/pair_with_0_26\n  assert_that/Group/pair_with_0:beam:transform:pardo:v1\n  must follow: \n  downstream_side_inputs: <unknown>', 'ref_AppliedPTransform_assert_that/Group/pair_with_1_27\n  assert_that/Group/pair_with_1:beam:transform:pardo:v1\n  must follow: \n  downstream_side_inputs: <unknown>', 'ref_AppliedPTransform_assert_that/Group/Flatten_28\n  assert_that/Group/Flatten:beam:transform:flatten:v1\n  must follow: \n  downstream_side_inputs: <unknown>', 'ref_AppliedPTransform_assert_that/Group/GroupByKey_29\n  assert_that/Group/GroupByKey:beam:transform:group_by_key:v1\n  must follow: \n  downstream_side_inputs: <unknown>', 'ref_AppliedPTransform_assert_that/Group/Map(_merge_tagged_vals_under_key)_30\n  assert_that/Group/Map(_merge_tagged_vals_under_key):beam:transform:pardo:v1\n  must follow: \n  downstream_side_inputs: <unknown>', 'ref_AppliedPTransform_assert_that/Unkey_31\n  assert_that/Unkey:beam:transform:pardo:v1\n  must follow: \n  downstream_side_inputs: <unknown>', 'ref_AppliedPTransform_assert_that/Match_32\n  assert_that/Match:beam:transform:pardo:v1\n  must follow: \n  downstream_side_inputs: <unknown>']
--------------------- >> end captured logging << ---------------------

======================================================================
ERROR: test_zetasql_generate_data (apache_beam.transforms.sql_test.SqlTransformTest)
----------------------------------------------------------------------
Traceback (most recent call last):
  File "<https://ci-beam.apache.org/job/beam_PostCommit_XVR_Spark/ws/src/sdks/python/apache_beam/transforms/sql_test.py",> line 164, in test_zetasql_generate_data
    assert_that(out, equal_to([(1, "foo", 3.14)]))
  File "<https://ci-beam.apache.org/job/beam_PostCommit_XVR_Spark/ws/src/sdks/python/apache_beam/pipeline.py",> line 582, in __exit__
    self.result = self.run()
  File "<https://ci-beam.apache.org/job/beam_PostCommit_XVR_Spark/ws/src/sdks/python/apache_beam/testing/test_pipeline.py",> line 112, in run
    False if self.not_use_test_runner_api else test_runner_api))
  File "<https://ci-beam.apache.org/job/beam_PostCommit_XVR_Spark/ws/src/sdks/python/apache_beam/pipeline.py",> line 561, in run
    return self.runner.run_pipeline(self, self._options)
  File "<https://ci-beam.apache.org/job/beam_PostCommit_XVR_Spark/ws/src/sdks/python/apache_beam/runners/portability/portable_runner.py",> line 440, in run_pipeline
    job_service_handle = self.create_job_service(options)
  File "<https://ci-beam.apache.org/job/beam_PostCommit_XVR_Spark/ws/src/sdks/python/apache_beam/runners/portability/portable_runner.py",> line 320, in create_job_service
    return self.create_job_service_handle(server.start(), options)
  File "<https://ci-beam.apache.org/job/beam_PostCommit_XVR_Spark/ws/src/sdks/python/apache_beam/runners/portability/job_server.py",> line 56, in start
    grpc.channel_ready_future(channel).result(timeout=self._timeout)
  File "<https://ci-beam.apache.org/job/beam_PostCommit_XVR_Spark/ws/src/build/gradleenv/1922375555/lib/python3.6/site-packages/grpc/_utilities.py",> line 140, in result
    self._block(timeout)
  File "<https://ci-beam.apache.org/job/beam_PostCommit_XVR_Spark/ws/src/build/gradleenv/1922375555/lib/python3.6/site-packages/grpc/_utilities.py",> line 86, in _block
    raise grpc.FutureTimeoutError()
grpc.FutureTimeoutError: 
-------------------- >> begin captured logging << --------------------
apache_beam.utils.subprocess_server: INFO: Using pre-built snapshot at <https://ci-beam.apache.org/job/beam_PostCommit_XVR_Spark/ws/src/sdks/java/extensions/sql/expansion-service/build/libs/beam-sdks-java-extensions-sql-expansion-service-2.30.0-SNAPSHOT.jar>
apache_beam.utils.subprocess_server: INFO: Starting service with ['java' '-jar' '<https://ci-beam.apache.org/job/beam_PostCommit_XVR_Spark/ws/src/sdks/java/extensions/sql/expansion-service/build/libs/beam-sdks-java-extensions-sql-expansion-service-2.30.0-SNAPSHOT.jar'> '43871']
root: DEBUG: Waiting for grpc channel to be ready at localhost:43871.
apache_beam.utils.subprocess_server: INFO: b'Starting expansion service at localhost:43871'
root: DEBUG: Waiting for grpc channel to be ready at localhost:43871.
apache_beam.utils.subprocess_server: INFO: b'Mar 18, 2021 12:29:36 AM org.apache.beam.sdk.expansion.service.ExpansionService loadRegisteredTransforms'
apache_beam.utils.subprocess_server: INFO: b'INFO: Registering external transforms: [beam:external:java:sql:v1, beam:external:java:generate_sequence:v1]'
apache_beam.utils.subprocess_server: INFO: b'\tbeam:external:java:sql:v1: org.apache.beam.sdk.expansion.service.ExpansionService$ExternalTransformRegistrarLoader$$Lambda$3/1130478920@5680a178'
apache_beam.utils.subprocess_server: INFO: b'\tbeam:external:java:generate_sequence:v1: org.apache.beam.sdk.expansion.service.ExpansionService$ExternalTransformRegistrarLoader$$Lambda$3/1130478920@5fdef03a'
root: DEBUG: Waiting for grpc channel to be ready at localhost:43871.
root: DEBUG: Waiting for grpc channel to be ready at localhost:43871.
root: DEBUG: Waiting for grpc channel to be ready at localhost:43871.
root: DEBUG: Waiting for grpc channel to be ready at localhost:43871.
apache_beam.utils.subprocess_server: INFO: b'Mar 18, 2021 12:29:37 AM org.apache.beam.sdk.expansion.service.ExpansionService expand'
apache_beam.utils.subprocess_server: INFO: b"INFO: Expanding 'SqlTransform(beam:external:java:sql:v1)' with URN 'beam:external:java:sql:v1'"
apache_beam.utils.subprocess_server: INFO: b'Mar 18, 2021 12:29:38 AM org.apache.beam.sdk.expansion.service.ExpansionService$ExternalTransformRegistrarLoader payloadToConfig'
apache_beam.utils.subprocess_server: INFO: b"WARNING: Configuration class 'org.apache.beam.sdk.extensions.sql.expansion.ExternalSqlTransformRegistrar$Configuration' has no schema registered. Attempting to construct with setter approach."
apache_beam.utils.subprocess_server: INFO: b'Mar 18, 2021 12:29:42 AM org.apache.beam.sdk.extensions.sql.zetasql.ZetaSQLQueryPlanner convertToBeamRelInternal'
apache_beam.utils.subprocess_server: INFO: b'INFO: BEAMPlan>'
apache_beam.utils.subprocess_server: INFO: b"BeamZetaSqlCalcRel(expr#0=[{inputs}], expr#1=[1:BIGINT], expr#2=['foo':VARCHAR], expr#3=[3.1400000000000001243E0:DOUBLE], int=[$t1], str=[$t2], flt=[$t3])"
apache_beam.utils.subprocess_server: INFO: b'  BeamValuesRel(tuples=[[{ 0 }]])'
apache_beam.utils.subprocess_server: INFO: b''
root: DEBUG: Sending SIGINT to job_server
root: DEBUG: Unhandled type_constraint: Union[]
root: DEBUG: Unhandled type_constraint: Union[]
root: DEBUG: Unhandled type_constraint: Union[]
root: DEBUG: Unhandled type_constraint: Union[]
root: WARNING: Make sure that locally built Python SDK docker image has Python 3.6 interpreter.
root: INFO: Default Python SDK image for environment is apache/beam_python3.6_sdk:2.30.0.dev
root: INFO: No image given, using default Python SDK image
root: WARNING: Make sure that locally built Python SDK docker image has Python 3.6 interpreter.
root: INFO: Default Python SDK image for environment is apache/beam_python3.6_sdk:2.30.0.dev
root: INFO: Python SDK container image set to "apache/beam_python3.6_sdk:2.30.0.dev" for Docker environment
apache_beam.runners.portability.fn_api_runner.translations: INFO: ==================== <function lift_combiners at 0x7fa0aed02d90> ====================
apache_beam.runners.portability.fn_api_runner.translations: DEBUG: 16 [1, 1, 1, 1, 1, 1, 1, 1, 1, 1, 1, 1, 1, 1, 1, 1]
apache_beam.runners.portability.fn_api_runner.translations: DEBUG: Stages: ['external_9SqlTransform(beam:external:java:sql:v1)/BeamValuesRel_13/Create.Values/Read(CreateSource)/Impulse\n  SqlTransform(beam:external:java:sql:v1)/BeamValuesRel_13/Create.Values/Read(CreateSource)/Impulse:beam:transform:impulse:v1\n  must follow: \n  downstream_side_inputs: <unknown>', 'external_9SqlTransform(beam:external:java:sql:v1)/BeamValuesRel_13/Create.Values/Read(CreateSource)/ParDo(OutputSingleSource)/ParMultiDo(OutputSingleSource)\n  SqlTransform(beam:external:java:sql:v1)/BeamValuesRel_13/Create.Values/Read(CreateSource)/ParDo(OutputSingleSource)/ParMultiDo(OutputSingleSource):beam:transform:pardo:v1\n  must follow: \n  downstream_side_inputs: <unknown>', 'external_9SqlTransform(beam:external:java:sql:v1)/BeamValuesRel_13/Create.Values/Read(CreateSource)/ParDo(BoundedSourceAsSDFWrapper)/ParMultiDo(BoundedSourceAsSDFWrapper)\n  SqlTransform(beam:external:java:sql:v1)/BeamValuesRel_13/Create.Values/Read(CreateSource)/ParDo(BoundedSourceAsSDFWrapper)/ParMultiDo(BoundedSourceAsSDFWrapper):beam:transform:pardo:v1\n  must follow: \n  downstream_side_inputs: <unknown>', 'external_9SqlTransform(beam:external:java:sql:v1)/BeamZetaSqlCalcRel_17/ParDo(Calc)/ParMultiDo(Calc)\n  SqlTransform(beam:external:java:sql:v1)/BeamZetaSqlCalcRel_17/ParDo(Calc)/ParMultiDo(Calc):beam:transform:pardo:v1\n  must follow: \n  downstream_side_inputs: <unknown>', 'ref_AppliedPTransform_assert_that/Create/Impulse_5\n  assert_that/Create/Impulse:beam:transform:impulse:v1\n  must follow: \n  downstream_side_inputs: <unknown>', 'ref_AppliedPTransform_assert_that/Create/FlatMap(<lambda at core.py:2971>)_6\n  assert_that/Create/FlatMap(<lambda at core.py:2971>):beam:transform:pardo:v1\n  must follow: \n  downstream_side_inputs: <unknown>', 'ref_AppliedPTransform_assert_that/Create/Map(decode)_8\n  assert_that/Create/Map(decode):beam:transform:pardo:v1\n  must follow: \n  downstream_side_inputs: <unknown>', 'ref_AppliedPTransform_assert_that/WindowInto(WindowIntoFn)_9\n  assert_that/WindowInto(WindowIntoFn):beam:transform:window_into:v1\n  must follow: \n  downstream_side_inputs: <unknown>', 'ref_AppliedPTransform_assert_that/ToVoidKey_10\n  assert_that/ToVoidKey:beam:transform:pardo:v1\n  must follow: \n  downstream_side_inputs: <unknown>', 'ref_AppliedPTransform_assert_that/Group/pair_with_0_12\n  assert_that/Group/pair_with_0:beam:transform:pardo:v1\n  must follow: \n  downstream_side_inputs: <unknown>', 'ref_AppliedPTransform_assert_that/Group/pair_with_1_13\n  assert_that/Group/pair_with_1:beam:transform:pardo:v1\n  must follow: \n  downstream_side_inputs: <unknown>', 'ref_AppliedPTransform_assert_that/Group/Flatten_14\n  assert_that/Group/Flatten:beam:transform:flatten:v1\n  must follow: \n  downstream_side_inputs: <unknown>', 'ref_AppliedPTransform_assert_that/Group/GroupByKey_15\n  assert_that/Group/GroupByKey:beam:transform:group_by_key:v1\n  must follow: \n  downstream_side_inputs: <unknown>', 'ref_AppliedPTransform_assert_that/Group/Map(_merge_tagged_vals_under_key)_16\n  assert_that/Group/Map(_merge_tagged_vals_under_key):beam:transform:pardo:v1\n  must follow: \n  downstream_side_inputs: <unknown>', 'ref_AppliedPTransform_assert_that/Unkey_17\n  assert_that/Unkey:beam:transform:pardo:v1\n  must follow: \n  downstream_side_inputs: <unknown>', 'ref_AppliedPTransform_assert_that/Match_18\n  assert_that/Match:beam:transform:pardo:v1\n  must follow: \n  downstream_side_inputs: <unknown>']
apache_beam.runners.portability.fn_api_runner.translations: INFO: ==================== <function sort_stages at 0x7fa0aed03510> ====================
apache_beam.runners.portability.fn_api_runner.translations: DEBUG: 16 [1, 1, 1, 1, 1, 1, 1, 1, 1, 1, 1, 1, 1, 1, 1, 1]
apache_beam.runners.portability.fn_api_runner.translations: DEBUG: Stages: ['external_9SqlTransform(beam:external:java:sql:v1)/BeamValuesRel_13/Create.Values/Read(CreateSource)/Impulse\n  SqlTransform(beam:external:java:sql:v1)/BeamValuesRel_13/Create.Values/Read(CreateSource)/Impulse:beam:transform:impulse:v1\n  must follow: \n  downstream_side_inputs: <unknown>', 'external_9SqlTransform(beam:external:java:sql:v1)/BeamValuesRel_13/Create.Values/Read(CreateSource)/ParDo(OutputSingleSource)/ParMultiDo(OutputSingleSource)\n  SqlTransform(beam:external:java:sql:v1)/BeamValuesRel_13/Create.Values/Read(CreateSource)/ParDo(OutputSingleSource)/ParMultiDo(OutputSingleSource):beam:transform:pardo:v1\n  must follow: \n  downstream_side_inputs: <unknown>', 'external_9SqlTransform(beam:external:java:sql:v1)/BeamValuesRel_13/Create.Values/Read(CreateSource)/ParDo(BoundedSourceAsSDFWrapper)/ParMultiDo(BoundedSourceAsSDFWrapper)\n  SqlTransform(beam:external:java:sql:v1)/BeamValuesRel_13/Create.Values/Read(CreateSource)/ParDo(BoundedSourceAsSDFWrapper)/ParMultiDo(BoundedSourceAsSDFWrapper):beam:transform:pardo:v1\n  must follow: \n  downstream_side_inputs: <unknown>', 'external_9SqlTransform(beam:external:java:sql:v1)/BeamZetaSqlCalcRel_17/ParDo(Calc)/ParMultiDo(Calc)\n  SqlTransform(beam:external:java:sql:v1)/BeamZetaSqlCalcRel_17/ParDo(Calc)/ParMultiDo(Calc):beam:transform:pardo:v1\n  must follow: \n  downstream_side_inputs: <unknown>', 'ref_AppliedPTransform_assert_that/Create/Impulse_5\n  assert_that/Create/Impulse:beam:transform:impulse:v1\n  must follow: \n  downstream_side_inputs: <unknown>', 'ref_AppliedPTransform_assert_that/Create/FlatMap(<lambda at core.py:2971>)_6\n  assert_that/Create/FlatMap(<lambda at core.py:2971>):beam:transform:pardo:v1\n  must follow: \n  downstream_side_inputs: <unknown>', 'ref_AppliedPTransform_assert_that/Create/Map(decode)_8\n  assert_that/Create/Map(decode):beam:transform:pardo:v1\n  must follow: \n  downstream_side_inputs: <unknown>', 'ref_AppliedPTransform_assert_that/WindowInto(WindowIntoFn)_9\n  assert_that/WindowInto(WindowIntoFn):beam:transform:window_into:v1\n  must follow: \n  downstream_side_inputs: <unknown>', 'ref_AppliedPTransform_assert_that/ToVoidKey_10\n  assert_that/ToVoidKey:beam:transform:pardo:v1\n  must follow: \n  downstream_side_inputs: <unknown>', 'ref_AppliedPTransform_assert_that/Group/pair_with_0_12\n  assert_that/Group/pair_with_0:beam:transform:pardo:v1\n  must follow: \n  downstream_side_inputs: <unknown>', 'ref_AppliedPTransform_assert_that/Group/pair_with_1_13\n  assert_that/Group/pair_with_1:beam:transform:pardo:v1\n  must follow: \n  downstream_side_inputs: <unknown>', 'ref_AppliedPTransform_assert_that/Group/Flatten_14\n  assert_that/Group/Flatten:beam:transform:flatten:v1\n  must follow: \n  downstream_side_inputs: <unknown>', 'ref_AppliedPTransform_assert_that/Group/GroupByKey_15\n  assert_that/Group/GroupByKey:beam:transform:group_by_key:v1\n  must follow: \n  downstream_side_inputs: <unknown>', 'ref_AppliedPTransform_assert_that/Group/Map(_merge_tagged_vals_under_key)_16\n  assert_that/Group/Map(_merge_tagged_vals_under_key):beam:transform:pardo:v1\n  must follow: \n  downstream_side_inputs: <unknown>', 'ref_AppliedPTransform_assert_that/Unkey_17\n  assert_that/Unkey:beam:transform:pardo:v1\n  must follow: \n  downstream_side_inputs: <unknown>', 'ref_AppliedPTransform_assert_that/Match_18\n  assert_that/Match:beam:transform:pardo:v1\n  must follow: \n  downstream_side_inputs: <unknown>']
--------------------- >> end captured logging << ---------------------

----------------------------------------------------------------------
XML: nosetests-xlangSqlValidateRunner.xml
----------------------------------------------------------------------
XML: <https://ci-beam.apache.org/job/beam_PostCommit_XVR_Spark/ws/src/sdks/python/nosetests.xml>
----------------------------------------------------------------------
Ran 9 tests in 629.966s

FAILED (errors=9)

> Task :runners:spark:2:job-server:validatesCrossLanguageRunnerPythonUsingSql FAILED
> Task :runners:spark:2:job-server:validatesCrossLanguageRunnerCleanup
> Task :runners:spark:2:job-server:sparkJobServerCleanup

FAILURE: Build completed with 7 failures.

1: Task failed with an exception.
-----------
* What went wrong:
Execution failed for task ':runners:spark:3:job-server:validatesCrossLanguageRunnerPythonUsingJava'.
> Process 'command 'sh'' finished with non-zero exit value 1

* Try:
Run with --stacktrace option to get the stack trace. Run with --info or --debug option to get more log output. Run with --scan to get full insights.
==============================================================================

2: Task failed with an exception.
-----------
* What went wrong:
Execution failed for task ':runners:spark:3:job-server:validatesCrossLanguageRunnerPythonUsingPython'.
> Process 'command 'sh'' finished with non-zero exit value 1

* Try:
Run with --stacktrace option to get the stack trace. Run with --info or --debug option to get more log output. Run with --scan to get full insights.
==============================================================================

3: Task failed with an exception.
-----------
* What went wrong:
Execution failed for task ':runners:spark:2:job-server:validatesCrossLanguageRunnerJavaUsingPython'.
> There were failing tests. See the report at: file://<https://ci-beam.apache.org/job/beam_PostCommit_XVR_Spark/ws/src/runners/spark/2/job-server/build/reports/tests/validatesCrossLanguageRunnerJavaUsingPython/index.html>

* Try:
Run with --stacktrace option to get the stack trace. Run with --info or --debug option to get more log output. Run with --scan to get full insights.
==============================================================================

4: Task failed with an exception.
-----------
* What went wrong:
Execution failed for task ':runners:spark:2:job-server:validatesCrossLanguageRunnerJavaUsingPythonOnly'.
> There were failing tests. See the report at: file://<https://ci-beam.apache.org/job/beam_PostCommit_XVR_Spark/ws/src/runners/spark/2/job-server/build/reports/tests/validatesCrossLanguageRunnerJavaUsingPythonOnly/index.html>

* Try:
Run with --stacktrace option to get the stack trace. Run with --info or --debug option to get more log output. Run with --scan to get full insights.
==============================================================================

5: Task failed with an exception.
-----------
* What went wrong:
Execution failed for task ':runners:spark:2:job-server:validatesCrossLanguageRunnerPythonUsingJava'.
> Process 'command 'sh'' finished with non-zero exit value 1

* Try:
Run with --stacktrace option to get the stack trace. Run with --info or --debug option to get more log output. Run with --scan to get full insights.
==============================================================================

6: Task failed with an exception.
-----------
* What went wrong:
Execution failed for task ':runners:spark:2:job-server:validatesCrossLanguageRunnerPythonUsingPython'.
> Process 'command 'sh'' finished with non-zero exit value 1

* Try:
Run with --stacktrace option to get the stack trace. Run with --info or --debug option to get more log output. Run with --scan to get full insights.
==============================================================================

7: Task failed with an exception.
-----------
* What went wrong:
Execution failed for task ':runners:spark:2:job-server:validatesCrossLanguageRunnerPythonUsingSql'.
> Process 'command 'sh'' finished with non-zero exit value 1

* Try:
Run with --stacktrace option to get the stack trace. Run with --info or --debug option to get more log output. Run with --scan to get full insights.
==============================================================================

* Get more help at https://help.gradle.org

Deprecated Gradle features were used in this build, making it incompatible with Gradle 7.0.
Use '--warning-mode all' to show the individual deprecation warnings.
See https://docs.gradle.org/6.8/userguide/command_line_interface.html#sec:command_line_warnings

BUILD FAILED in 30m 18s
201 actionable tasks: 143 executed, 54 from cache, 4 up-to-date
Gradle was unable to watch the file system for changes. The inotify watches limit is too low.

Publishing build scan...
https://gradle.com/s/l42fqnn6wlrqy

Build step 'Invoke Gradle script' changed build result to FAILURE
Build step 'Invoke Gradle script' marked build as failure

---------------------------------------------------------------------
To unsubscribe, e-mail: builds-unsubscribe@beam.apache.org
For additional commands, e-mail: builds-help@beam.apache.org


Build failed in Jenkins: beam_PostCommit_XVR_Spark #2066

Posted by Apache Jenkins Server <je...@builds.apache.org>.
See <https://ci-beam.apache.org/job/beam_PostCommit_XVR_Spark/2066/display/redirect?page=changes>

Changes:

[noreply] [BEAM-11659] Add new schema types to Pub/Sub SQL (#13980)

[noreply] [BEAM-11628] Switch to pd.testing.assert* in transforms_test (#14256)

[noreply] [BEAM-10708] Clean up pipeline instrument (#14176)

[noreply] [BEAM-9615] Embedded structs and Deterministic map encoding, and Logical


------------------------------------------
[...truncated 1.32 MB...]
ERROR: test_windowing_before_sql (apache_beam.transforms.sql_test.SqlTransformTest)
----------------------------------------------------------------------
Traceback (most recent call last):
  File "<https://ci-beam.apache.org/job/beam_PostCommit_XVR_Spark/ws/src/sdks/python/apache_beam/transforms/sql_test.py",> line 179, in test_windowing_before_sql
    assert_that(out, equal_to([(1, ), (1, ), (1, )]))
  File "<https://ci-beam.apache.org/job/beam_PostCommit_XVR_Spark/ws/src/sdks/python/apache_beam/pipeline.py",> line 582, in __exit__
    self.result = self.run()
  File "<https://ci-beam.apache.org/job/beam_PostCommit_XVR_Spark/ws/src/sdks/python/apache_beam/testing/test_pipeline.py",> line 112, in run
    False if self.not_use_test_runner_api else test_runner_api))
  File "<https://ci-beam.apache.org/job/beam_PostCommit_XVR_Spark/ws/src/sdks/python/apache_beam/pipeline.py",> line 561, in run
    return self.runner.run_pipeline(self, self._options)
  File "<https://ci-beam.apache.org/job/beam_PostCommit_XVR_Spark/ws/src/sdks/python/apache_beam/runners/portability/portable_runner.py",> line 440, in run_pipeline
    job_service_handle = self.create_job_service(options)
  File "<https://ci-beam.apache.org/job/beam_PostCommit_XVR_Spark/ws/src/sdks/python/apache_beam/runners/portability/portable_runner.py",> line 320, in create_job_service
    return self.create_job_service_handle(server.start(), options)
  File "<https://ci-beam.apache.org/job/beam_PostCommit_XVR_Spark/ws/src/sdks/python/apache_beam/runners/portability/job_server.py",> line 56, in start
    grpc.channel_ready_future(channel).result(timeout=self._timeout)
  File "<https://ci-beam.apache.org/job/beam_PostCommit_XVR_Spark/ws/src/build/gradleenv/1922375555/lib/python3.6/site-packages/grpc/_utilities.py",> line 140, in result
    self._block(timeout)
  File "<https://ci-beam.apache.org/job/beam_PostCommit_XVR_Spark/ws/src/build/gradleenv/1922375555/lib/python3.6/site-packages/grpc/_utilities.py",> line 86, in _block
    raise grpc.FutureTimeoutError()
grpc.FutureTimeoutError: 
-------------------- >> begin captured logging << --------------------
apache_beam.utils.subprocess_server: INFO: Using pre-built snapshot at <https://ci-beam.apache.org/job/beam_PostCommit_XVR_Spark/ws/src/sdks/java/extensions/sql/expansion-service/build/libs/beam-sdks-java-extensions-sql-expansion-service-2.30.0-SNAPSHOT.jar>
apache_beam.utils.subprocess_server: INFO: Starting service with ['java' '-jar' '<https://ci-beam.apache.org/job/beam_PostCommit_XVR_Spark/ws/src/sdks/java/extensions/sql/expansion-service/build/libs/beam-sdks-java-extensions-sql-expansion-service-2.30.0-SNAPSHOT.jar'> '55687']
root: DEBUG: Waiting for grpc channel to be ready at localhost:55687.
apache_beam.utils.subprocess_server: INFO: b'Starting expansion service at localhost:55687'
root: DEBUG: Waiting for grpc channel to be ready at localhost:55687.
apache_beam.utils.subprocess_server: INFO: b'Mar 17, 2021 6:39:43 PM org.apache.beam.sdk.expansion.service.ExpansionService loadRegisteredTransforms'
apache_beam.utils.subprocess_server: INFO: b'INFO: Registering external transforms: [beam:external:java:sql:v1, beam:external:java:generate_sequence:v1]'
apache_beam.utils.subprocess_server: INFO: b'\tbeam:external:java:sql:v1: org.apache.beam.sdk.expansion.service.ExpansionService$ExternalTransformRegistrarLoader$$Lambda$3/1130478920@5680a178'
apache_beam.utils.subprocess_server: INFO: b'\tbeam:external:java:generate_sequence:v1: org.apache.beam.sdk.expansion.service.ExpansionService$ExternalTransformRegistrarLoader$$Lambda$3/1130478920@5fdef03a'
root: DEBUG: Waiting for grpc channel to be ready at localhost:55687.
root: DEBUG: Waiting for grpc channel to be ready at localhost:55687.
root: DEBUG: Waiting for grpc channel to be ready at localhost:55687.
root: DEBUG: Waiting for grpc channel to be ready at localhost:55687.
apache_beam.utils.subprocess_server: INFO: b'Mar 17, 2021 6:39:44 PM org.apache.beam.sdk.expansion.service.ExpansionService expand'
apache_beam.utils.subprocess_server: INFO: b"INFO: Expanding 'SqlTransform(beam:external:java:sql:v1)' with URN 'beam:external:java:sql:v1'"
apache_beam.utils.subprocess_server: INFO: b'Mar 17, 2021 6:39:45 PM org.apache.beam.sdk.expansion.service.ExpansionService$ExternalTransformRegistrarLoader payloadToConfig'
apache_beam.utils.subprocess_server: INFO: b"WARNING: Configuration class 'org.apache.beam.sdk.extensions.sql.expansion.ExternalSqlTransformRegistrar$Configuration' has no schema registered. Attempting to construct with setter approach."
apache_beam.utils.subprocess_server: INFO: b'Mar 17, 2021 6:39:46 PM org.apache.beam.sdk.extensions.sql.impl.CalciteQueryPlanner convertToBeamRel'
apache_beam.utils.subprocess_server: INFO: b'INFO: SQL:'
apache_beam.utils.subprocess_server: INFO: b'SELECT COUNT(*) AS `count`'
apache_beam.utils.subprocess_server: INFO: b'FROM `beam`.`PCOLLECTION` AS `PCOLLECTION`'
apache_beam.utils.subprocess_server: INFO: b'Mar 17, 2021 6:39:46 PM org.apache.beam.sdk.extensions.sql.impl.CalciteQueryPlanner convertToBeamRel'
apache_beam.utils.subprocess_server: INFO: b'INFO: SQLPlan>'
apache_beam.utils.subprocess_server: INFO: b'LogicalAggregate(group=[{}], count=[COUNT()])'
apache_beam.utils.subprocess_server: INFO: b'  LogicalProject($f0=[0])'
apache_beam.utils.subprocess_server: INFO: b'    BeamIOSourceRel(table=[[beam, PCOLLECTION]])'
apache_beam.utils.subprocess_server: INFO: b''
apache_beam.utils.subprocess_server: INFO: b'Mar 17, 2021 6:39:47 PM org.apache.beam.sdk.extensions.sql.impl.CalciteQueryPlanner convertToBeamRel'
apache_beam.utils.subprocess_server: INFO: b'INFO: BEAMPlan>'
apache_beam.utils.subprocess_server: INFO: b'BeamAggregationRel(group=[{}], count=[COUNT()])'
apache_beam.utils.subprocess_server: INFO: b'  BeamIOSourceRel(table=[[beam, PCOLLECTION]])'
apache_beam.utils.subprocess_server: INFO: b''
root: DEBUG: Sending SIGINT to job_server
root: DEBUG: Unhandled type_constraint: Union[]
root: DEBUG: Unhandled type_constraint: Union[]
root: DEBUG: Unhandled type_constraint: Union[]
root: DEBUG: Unhandled type_constraint: Union[]
root: WARNING: Make sure that locally built Python SDK docker image has Python 3.6 interpreter.
root: INFO: Default Python SDK image for environment is apache/beam_python3.6_sdk:2.30.0.dev
root: INFO: No image given, using default Python SDK image
root: WARNING: Make sure that locally built Python SDK docker image has Python 3.6 interpreter.
root: INFO: Default Python SDK image for environment is apache/beam_python3.6_sdk:2.30.0.dev
root: INFO: Python SDK container image set to "apache/beam_python3.6_sdk:2.30.0.dev" for Docker environment
apache_beam.runners.portability.fn_api_runner.translations: INFO: ==================== <function lift_combiners at 0x7f62bdb67ae8> ====================
apache_beam.runners.portability.fn_api_runner.translations: DEBUG: 27 [1, 1, 1, 1, 1, 1, 1, 1, 1, 1, 1, 1, 1, 1, 1, 1, 1, 1, 1, 1, 1, 1, 1, 1, 1, 1, 1]
apache_beam.runners.portability.fn_api_runner.translations: DEBUG: Stages: ['ref_AppliedPTransform_Create/Impulse_3\n  Create/Impulse:beam:transform:impulse:v1\n  must follow: \n  downstream_side_inputs: <unknown>', 'ref_AppliedPTransform_Create/FlatMap(<lambda at core.py:2971>)_4\n  Create/FlatMap(<lambda at core.py:2971>):beam:transform:pardo:v1\n  must follow: \n  downstream_side_inputs: <unknown>', 'ref_AppliedPTransform_Create/MaybeReshuffle/Reshuffle/AddRandomKeys_7\n  Create/MaybeReshuffle/Reshuffle/AddRandomKeys:beam:transform:pardo:v1\n  must follow: \n  downstream_side_inputs: <unknown>', 'ref_AppliedPTransform_Create/MaybeReshuffle/Reshuffle/ReshufflePerKey/Map(reify_timestamps)_9\n  Create/MaybeReshuffle/Reshuffle/ReshufflePerKey/Map(reify_timestamps):beam:transform:pardo:v1\n  must follow: \n  downstream_side_inputs: <unknown>', 'ref_AppliedPTransform_Create/MaybeReshuffle/Reshuffle/ReshufflePerKey/GroupByKey_10\n  Create/MaybeReshuffle/Reshuffle/ReshufflePerKey/GroupByKey:beam:transform:group_by_key:v1\n  must follow: \n  downstream_side_inputs: <unknown>', 'ref_AppliedPTransform_Create/MaybeReshuffle/Reshuffle/ReshufflePerKey/FlatMap(restore_timestamps)_11\n  Create/MaybeReshuffle/Reshuffle/ReshufflePerKey/FlatMap(restore_timestamps):beam:transform:pardo:v1\n  must follow: \n  downstream_side_inputs: <unknown>', 'ref_AppliedPTransform_Create/MaybeReshuffle/Reshuffle/RemoveRandomKeys_12\n  Create/MaybeReshuffle/Reshuffle/RemoveRandomKeys:beam:transform:pardo:v1\n  must follow: \n  downstream_side_inputs: <unknown>', 'ref_AppliedPTransform_Create/Map(decode)_13\n  Create/Map(decode):beam:transform:pardo:v1\n  must follow: \n  downstream_side_inputs: <unknown>', 'ref_AppliedPTransform_Map(<lambda at sql_test.py:174>)_14\n  Map(<lambda at sql_test.py:174>):beam:transform:pardo:v1\n  must follow: \n  downstream_side_inputs: <unknown>', 'ref_AppliedPTransform_WindowInto(WindowIntoFn)_15\n  WindowInto(WindowIntoFn):beam:transform:window_into:v1\n  must follow: \n  downstream_side_inputs: <unknown>', 'external_8SqlTransform(beam:external:java:sql:v1)/BeamAggregationRel_40/Group.CombineFieldsByFields/ToKvs/selectKeys/AddKeys/Map/ParMultiDo(Anonymous)\n  SqlTransform(beam:external:java:sql:v1)/BeamAggregationRel_40/Group.CombineFieldsByFields/ToKvs/selectKeys/AddKeys/Map/ParMultiDo(Anonymous):beam:transform:pardo:v1\n  must follow: \n  downstream_side_inputs: <unknown>', 'external_8SqlTransform(beam:external:java:sql:v1)/BeamAggregationRel_40/Group.CombineFieldsByFields/ToKvs/GroupByKey\n  SqlTransform(beam:external:java:sql:v1)/BeamAggregationRel_40/Group.CombineFieldsByFields/ToKvs/GroupByKey:beam:transform:group_by_key:v1\n  must follow: \n  downstream_side_inputs: <unknown>', 'external_8SqlTransform(beam:external:java:sql:v1)/BeamAggregationRel_40/Group.CombineFieldsByFields/Combine/ParDo(Anonymous)/ParMultiDo(Anonymous)\n  SqlTransform(beam:external:java:sql:v1)/BeamAggregationRel_40/Group.CombineFieldsByFields/Combine/ParDo(Anonymous)/ParMultiDo(Anonymous):beam:transform:pardo:v1\n  must follow: \n  downstream_side_inputs: <unknown>', 'external_8SqlTransform(beam:external:java:sql:v1)/BeamAggregationRel_40/Group.CombineFieldsByFields/ToRow/ParMultiDo(Anonymous)\n  SqlTransform(beam:external:java:sql:v1)/BeamAggregationRel_40/Group.CombineFieldsByFields/ToRow/ParMultiDo(Anonymous):beam:transform:pardo:v1\n  must follow: \n  downstream_side_inputs: <unknown>', 'external_8SqlTransform(beam:external:java:sql:v1)/BeamAggregationRel_40/mergeRecord/ParMultiDo(Anonymous)\n  SqlTransform(beam:external:java:sql:v1)/BeamAggregationRel_40/mergeRecord/ParMultiDo(Anonymous):beam:transform:pardo:v1\n  must follow: \n  downstream_side_inputs: <unknown>', 'ref_AppliedPTransform_assert_that/Create/Impulse_19\n  assert_that/Create/Impulse:beam:transform:impulse:v1\n  must follow: \n  downstream_side_inputs: <unknown>', 'ref_AppliedPTransform_assert_that/Create/FlatMap(<lambda at core.py:2971>)_20\n  assert_that/Create/FlatMap(<lambda at core.py:2971>):beam:transform:pardo:v1\n  must follow: \n  downstream_side_inputs: <unknown>', 'ref_AppliedPTransform_assert_that/Create/Map(decode)_22\n  assert_that/Create/Map(decode):beam:transform:pardo:v1\n  must follow: \n  downstream_side_inputs: <unknown>', 'ref_AppliedPTransform_assert_that/WindowInto(WindowIntoFn)_23\n  assert_that/WindowInto(WindowIntoFn):beam:transform:window_into:v1\n  must follow: \n  downstream_side_inputs: <unknown>', 'ref_AppliedPTransform_assert_that/ToVoidKey_24\n  assert_that/ToVoidKey:beam:transform:pardo:v1\n  must follow: \n  downstream_side_inputs: <unknown>', 'ref_AppliedPTransform_assert_that/Group/pair_with_0_26\n  assert_that/Group/pair_with_0:beam:transform:pardo:v1\n  must follow: \n  downstream_side_inputs: <unknown>', 'ref_AppliedPTransform_assert_that/Group/pair_with_1_27\n  assert_that/Group/pair_with_1:beam:transform:pardo:v1\n  must follow: \n  downstream_side_inputs: <unknown>', 'ref_AppliedPTransform_assert_that/Group/Flatten_28\n  assert_that/Group/Flatten:beam:transform:flatten:v1\n  must follow: \n  downstream_side_inputs: <unknown>', 'ref_AppliedPTransform_assert_that/Group/GroupByKey_29\n  assert_that/Group/GroupByKey:beam:transform:group_by_key:v1\n  must follow: \n  downstream_side_inputs: <unknown>', 'ref_AppliedPTransform_assert_that/Group/Map(_merge_tagged_vals_under_key)_30\n  assert_that/Group/Map(_merge_tagged_vals_under_key):beam:transform:pardo:v1\n  must follow: \n  downstream_side_inputs: <unknown>', 'ref_AppliedPTransform_assert_that/Unkey_31\n  assert_that/Unkey:beam:transform:pardo:v1\n  must follow: \n  downstream_side_inputs: <unknown>', 'ref_AppliedPTransform_assert_that/Match_32\n  assert_that/Match:beam:transform:pardo:v1\n  must follow: \n  downstream_side_inputs: <unknown>']
apache_beam.runners.portability.fn_api_runner.translations: INFO: ==================== <function sort_stages at 0x7f62bdb68268> ====================
apache_beam.runners.portability.fn_api_runner.translations: DEBUG: 27 [1, 1, 1, 1, 1, 1, 1, 1, 1, 1, 1, 1, 1, 1, 1, 1, 1, 1, 1, 1, 1, 1, 1, 1, 1, 1, 1]
apache_beam.runners.portability.fn_api_runner.translations: DEBUG: Stages: ['ref_AppliedPTransform_Create/Impulse_3\n  Create/Impulse:beam:transform:impulse:v1\n  must follow: \n  downstream_side_inputs: <unknown>', 'ref_AppliedPTransform_Create/FlatMap(<lambda at core.py:2971>)_4\n  Create/FlatMap(<lambda at core.py:2971>):beam:transform:pardo:v1\n  must follow: \n  downstream_side_inputs: <unknown>', 'ref_AppliedPTransform_Create/MaybeReshuffle/Reshuffle/AddRandomKeys_7\n  Create/MaybeReshuffle/Reshuffle/AddRandomKeys:beam:transform:pardo:v1\n  must follow: \n  downstream_side_inputs: <unknown>', 'ref_AppliedPTransform_Create/MaybeReshuffle/Reshuffle/ReshufflePerKey/Map(reify_timestamps)_9\n  Create/MaybeReshuffle/Reshuffle/ReshufflePerKey/Map(reify_timestamps):beam:transform:pardo:v1\n  must follow: \n  downstream_side_inputs: <unknown>', 'ref_AppliedPTransform_Create/MaybeReshuffle/Reshuffle/ReshufflePerKey/GroupByKey_10\n  Create/MaybeReshuffle/Reshuffle/ReshufflePerKey/GroupByKey:beam:transform:group_by_key:v1\n  must follow: \n  downstream_side_inputs: <unknown>', 'ref_AppliedPTransform_Create/MaybeReshuffle/Reshuffle/ReshufflePerKey/FlatMap(restore_timestamps)_11\n  Create/MaybeReshuffle/Reshuffle/ReshufflePerKey/FlatMap(restore_timestamps):beam:transform:pardo:v1\n  must follow: \n  downstream_side_inputs: <unknown>', 'ref_AppliedPTransform_Create/MaybeReshuffle/Reshuffle/RemoveRandomKeys_12\n  Create/MaybeReshuffle/Reshuffle/RemoveRandomKeys:beam:transform:pardo:v1\n  must follow: \n  downstream_side_inputs: <unknown>', 'ref_AppliedPTransform_Create/Map(decode)_13\n  Create/Map(decode):beam:transform:pardo:v1\n  must follow: \n  downstream_side_inputs: <unknown>', 'ref_AppliedPTransform_Map(<lambda at sql_test.py:174>)_14\n  Map(<lambda at sql_test.py:174>):beam:transform:pardo:v1\n  must follow: \n  downstream_side_inputs: <unknown>', 'ref_AppliedPTransform_WindowInto(WindowIntoFn)_15\n  WindowInto(WindowIntoFn):beam:transform:window_into:v1\n  must follow: \n  downstream_side_inputs: <unknown>', 'external_8SqlTransform(beam:external:java:sql:v1)/BeamAggregationRel_40/Group.CombineFieldsByFields/ToKvs/selectKeys/AddKeys/Map/ParMultiDo(Anonymous)\n  SqlTransform(beam:external:java:sql:v1)/BeamAggregationRel_40/Group.CombineFieldsByFields/ToKvs/selectKeys/AddKeys/Map/ParMultiDo(Anonymous):beam:transform:pardo:v1\n  must follow: \n  downstream_side_inputs: <unknown>', 'external_8SqlTransform(beam:external:java:sql:v1)/BeamAggregationRel_40/Group.CombineFieldsByFields/ToKvs/GroupByKey\n  SqlTransform(beam:external:java:sql:v1)/BeamAggregationRel_40/Group.CombineFieldsByFields/ToKvs/GroupByKey:beam:transform:group_by_key:v1\n  must follow: \n  downstream_side_inputs: <unknown>', 'external_8SqlTransform(beam:external:java:sql:v1)/BeamAggregationRel_40/Group.CombineFieldsByFields/Combine/ParDo(Anonymous)/ParMultiDo(Anonymous)\n  SqlTransform(beam:external:java:sql:v1)/BeamAggregationRel_40/Group.CombineFieldsByFields/Combine/ParDo(Anonymous)/ParMultiDo(Anonymous):beam:transform:pardo:v1\n  must follow: \n  downstream_side_inputs: <unknown>', 'external_8SqlTransform(beam:external:java:sql:v1)/BeamAggregationRel_40/Group.CombineFieldsByFields/ToRow/ParMultiDo(Anonymous)\n  SqlTransform(beam:external:java:sql:v1)/BeamAggregationRel_40/Group.CombineFieldsByFields/ToRow/ParMultiDo(Anonymous):beam:transform:pardo:v1\n  must follow: \n  downstream_side_inputs: <unknown>', 'external_8SqlTransform(beam:external:java:sql:v1)/BeamAggregationRel_40/mergeRecord/ParMultiDo(Anonymous)\n  SqlTransform(beam:external:java:sql:v1)/BeamAggregationRel_40/mergeRecord/ParMultiDo(Anonymous):beam:transform:pardo:v1\n  must follow: \n  downstream_side_inputs: <unknown>', 'ref_AppliedPTransform_assert_that/Create/Impulse_19\n  assert_that/Create/Impulse:beam:transform:impulse:v1\n  must follow: \n  downstream_side_inputs: <unknown>', 'ref_AppliedPTransform_assert_that/Create/FlatMap(<lambda at core.py:2971>)_20\n  assert_that/Create/FlatMap(<lambda at core.py:2971>):beam:transform:pardo:v1\n  must follow: \n  downstream_side_inputs: <unknown>', 'ref_AppliedPTransform_assert_that/Create/Map(decode)_22\n  assert_that/Create/Map(decode):beam:transform:pardo:v1\n  must follow: \n  downstream_side_inputs: <unknown>', 'ref_AppliedPTransform_assert_that/WindowInto(WindowIntoFn)_23\n  assert_that/WindowInto(WindowIntoFn):beam:transform:window_into:v1\n  must follow: \n  downstream_side_inputs: <unknown>', 'ref_AppliedPTransform_assert_that/ToVoidKey_24\n  assert_that/ToVoidKey:beam:transform:pardo:v1\n  must follow: \n  downstream_side_inputs: <unknown>', 'ref_AppliedPTransform_assert_that/Group/pair_with_0_26\n  assert_that/Group/pair_with_0:beam:transform:pardo:v1\n  must follow: \n  downstream_side_inputs: <unknown>', 'ref_AppliedPTransform_assert_that/Group/pair_with_1_27\n  assert_that/Group/pair_with_1:beam:transform:pardo:v1\n  must follow: \n  downstream_side_inputs: <unknown>', 'ref_AppliedPTransform_assert_that/Group/Flatten_28\n  assert_that/Group/Flatten:beam:transform:flatten:v1\n  must follow: \n  downstream_side_inputs: <unknown>', 'ref_AppliedPTransform_assert_that/Group/GroupByKey_29\n  assert_that/Group/GroupByKey:beam:transform:group_by_key:v1\n  must follow: \n  downstream_side_inputs: <unknown>', 'ref_AppliedPTransform_assert_that/Group/Map(_merge_tagged_vals_under_key)_30\n  assert_that/Group/Map(_merge_tagged_vals_under_key):beam:transform:pardo:v1\n  must follow: \n  downstream_side_inputs: <unknown>', 'ref_AppliedPTransform_assert_that/Unkey_31\n  assert_that/Unkey:beam:transform:pardo:v1\n  must follow: \n  downstream_side_inputs: <unknown>', 'ref_AppliedPTransform_assert_that/Match_32\n  assert_that/Match:beam:transform:pardo:v1\n  must follow: \n  downstream_side_inputs: <unknown>']
--------------------- >> end captured logging << ---------------------

======================================================================
ERROR: test_zetasql_generate_data (apache_beam.transforms.sql_test.SqlTransformTest)
----------------------------------------------------------------------
Traceback (most recent call last):
  File "<https://ci-beam.apache.org/job/beam_PostCommit_XVR_Spark/ws/src/sdks/python/apache_beam/transforms/sql_test.py",> line 164, in test_zetasql_generate_data
    assert_that(out, equal_to([(1, "foo", 3.14)]))
  File "<https://ci-beam.apache.org/job/beam_PostCommit_XVR_Spark/ws/src/sdks/python/apache_beam/pipeline.py",> line 582, in __exit__
    self.result = self.run()
  File "<https://ci-beam.apache.org/job/beam_PostCommit_XVR_Spark/ws/src/sdks/python/apache_beam/testing/test_pipeline.py",> line 112, in run
    False if self.not_use_test_runner_api else test_runner_api))
  File "<https://ci-beam.apache.org/job/beam_PostCommit_XVR_Spark/ws/src/sdks/python/apache_beam/pipeline.py",> line 561, in run
    return self.runner.run_pipeline(self, self._options)
  File "<https://ci-beam.apache.org/job/beam_PostCommit_XVR_Spark/ws/src/sdks/python/apache_beam/runners/portability/portable_runner.py",> line 440, in run_pipeline
    job_service_handle = self.create_job_service(options)
  File "<https://ci-beam.apache.org/job/beam_PostCommit_XVR_Spark/ws/src/sdks/python/apache_beam/runners/portability/portable_runner.py",> line 320, in create_job_service
    return self.create_job_service_handle(server.start(), options)
  File "<https://ci-beam.apache.org/job/beam_PostCommit_XVR_Spark/ws/src/sdks/python/apache_beam/runners/portability/job_server.py",> line 56, in start
    grpc.channel_ready_future(channel).result(timeout=self._timeout)
  File "<https://ci-beam.apache.org/job/beam_PostCommit_XVR_Spark/ws/src/build/gradleenv/1922375555/lib/python3.6/site-packages/grpc/_utilities.py",> line 140, in result
    self._block(timeout)
  File "<https://ci-beam.apache.org/job/beam_PostCommit_XVR_Spark/ws/src/build/gradleenv/1922375555/lib/python3.6/site-packages/grpc/_utilities.py",> line 86, in _block
    raise grpc.FutureTimeoutError()
grpc.FutureTimeoutError: 
-------------------- >> begin captured logging << --------------------
apache_beam.utils.subprocess_server: INFO: Using pre-built snapshot at <https://ci-beam.apache.org/job/beam_PostCommit_XVR_Spark/ws/src/sdks/java/extensions/sql/expansion-service/build/libs/beam-sdks-java-extensions-sql-expansion-service-2.30.0-SNAPSHOT.jar>
apache_beam.utils.subprocess_server: INFO: Starting service with ['java' '-jar' '<https://ci-beam.apache.org/job/beam_PostCommit_XVR_Spark/ws/src/sdks/java/extensions/sql/expansion-service/build/libs/beam-sdks-java-extensions-sql-expansion-service-2.30.0-SNAPSHOT.jar'> '54719']
root: DEBUG: Waiting for grpc channel to be ready at localhost:54719.
apache_beam.utils.subprocess_server: INFO: b'Starting expansion service at localhost:54719'
root: DEBUG: Waiting for grpc channel to be ready at localhost:54719.
apache_beam.utils.subprocess_server: INFO: b'Mar 17, 2021 6:40:51 PM org.apache.beam.sdk.expansion.service.ExpansionService loadRegisteredTransforms'
apache_beam.utils.subprocess_server: INFO: b'INFO: Registering external transforms: [beam:external:java:sql:v1, beam:external:java:generate_sequence:v1]'
apache_beam.utils.subprocess_server: INFO: b'\tbeam:external:java:sql:v1: org.apache.beam.sdk.expansion.service.ExpansionService$ExternalTransformRegistrarLoader$$Lambda$3/1130478920@5680a178'
apache_beam.utils.subprocess_server: INFO: b'\tbeam:external:java:generate_sequence:v1: org.apache.beam.sdk.expansion.service.ExpansionService$ExternalTransformRegistrarLoader$$Lambda$3/1130478920@5fdef03a'
root: DEBUG: Waiting for grpc channel to be ready at localhost:54719.
root: DEBUG: Waiting for grpc channel to be ready at localhost:54719.
root: DEBUG: Waiting for grpc channel to be ready at localhost:54719.
root: DEBUG: Waiting for grpc channel to be ready at localhost:54719.
apache_beam.utils.subprocess_server: INFO: b'Mar 17, 2021 6:40:52 PM org.apache.beam.sdk.expansion.service.ExpansionService expand'
apache_beam.utils.subprocess_server: INFO: b"INFO: Expanding 'SqlTransform(beam:external:java:sql:v1)' with URN 'beam:external:java:sql:v1'"
apache_beam.utils.subprocess_server: INFO: b'Mar 17, 2021 6:40:53 PM org.apache.beam.sdk.expansion.service.ExpansionService$ExternalTransformRegistrarLoader payloadToConfig'
apache_beam.utils.subprocess_server: INFO: b"WARNING: Configuration class 'org.apache.beam.sdk.extensions.sql.expansion.ExternalSqlTransformRegistrar$Configuration' has no schema registered. Attempting to construct with setter approach."
apache_beam.utils.subprocess_server: INFO: b'Mar 17, 2021 6:40:57 PM org.apache.beam.sdk.extensions.sql.zetasql.ZetaSQLQueryPlanner convertToBeamRelInternal'
apache_beam.utils.subprocess_server: INFO: b'INFO: BEAMPlan>'
apache_beam.utils.subprocess_server: INFO: b"BeamZetaSqlCalcRel(expr#0=[{inputs}], expr#1=[1:BIGINT], expr#2=['foo':VARCHAR], expr#3=[3.1400000000000001243E0:DOUBLE], int=[$t1], str=[$t2], flt=[$t3])"
apache_beam.utils.subprocess_server: INFO: b'  BeamValuesRel(tuples=[[{ 0 }]])'
apache_beam.utils.subprocess_server: INFO: b''
root: DEBUG: Sending SIGINT to job_server
root: DEBUG: Unhandled type_constraint: Union[]
root: DEBUG: Unhandled type_constraint: Union[]
root: DEBUG: Unhandled type_constraint: Union[]
root: DEBUG: Unhandled type_constraint: Union[]
root: WARNING: Make sure that locally built Python SDK docker image has Python 3.6 interpreter.
root: INFO: Default Python SDK image for environment is apache/beam_python3.6_sdk:2.30.0.dev
root: INFO: No image given, using default Python SDK image
root: WARNING: Make sure that locally built Python SDK docker image has Python 3.6 interpreter.
root: INFO: Default Python SDK image for environment is apache/beam_python3.6_sdk:2.30.0.dev
root: INFO: Python SDK container image set to "apache/beam_python3.6_sdk:2.30.0.dev" for Docker environment
apache_beam.runners.portability.fn_api_runner.translations: INFO: ==================== <function lift_combiners at 0x7f62bdb67ae8> ====================
apache_beam.runners.portability.fn_api_runner.translations: DEBUG: 16 [1, 1, 1, 1, 1, 1, 1, 1, 1, 1, 1, 1, 1, 1, 1, 1]
apache_beam.runners.portability.fn_api_runner.translations: DEBUG: Stages: ['external_9SqlTransform(beam:external:java:sql:v1)/BeamValuesRel_13/Create.Values/Read(CreateSource)/Impulse\n  SqlTransform(beam:external:java:sql:v1)/BeamValuesRel_13/Create.Values/Read(CreateSource)/Impulse:beam:transform:impulse:v1\n  must follow: \n  downstream_side_inputs: <unknown>', 'external_9SqlTransform(beam:external:java:sql:v1)/BeamValuesRel_13/Create.Values/Read(CreateSource)/ParDo(OutputSingleSource)/ParMultiDo(OutputSingleSource)\n  SqlTransform(beam:external:java:sql:v1)/BeamValuesRel_13/Create.Values/Read(CreateSource)/ParDo(OutputSingleSource)/ParMultiDo(OutputSingleSource):beam:transform:pardo:v1\n  must follow: \n  downstream_side_inputs: <unknown>', 'external_9SqlTransform(beam:external:java:sql:v1)/BeamValuesRel_13/Create.Values/Read(CreateSource)/ParDo(BoundedSourceAsSDFWrapper)/ParMultiDo(BoundedSourceAsSDFWrapper)\n  SqlTransform(beam:external:java:sql:v1)/BeamValuesRel_13/Create.Values/Read(CreateSource)/ParDo(BoundedSourceAsSDFWrapper)/ParMultiDo(BoundedSourceAsSDFWrapper):beam:transform:pardo:v1\n  must follow: \n  downstream_side_inputs: <unknown>', 'external_9SqlTransform(beam:external:java:sql:v1)/BeamZetaSqlCalcRel_17/ParDo(Calc)/ParMultiDo(Calc)\n  SqlTransform(beam:external:java:sql:v1)/BeamZetaSqlCalcRel_17/ParDo(Calc)/ParMultiDo(Calc):beam:transform:pardo:v1\n  must follow: \n  downstream_side_inputs: <unknown>', 'ref_AppliedPTransform_assert_that/Create/Impulse_5\n  assert_that/Create/Impulse:beam:transform:impulse:v1\n  must follow: \n  downstream_side_inputs: <unknown>', 'ref_AppliedPTransform_assert_that/Create/FlatMap(<lambda at core.py:2971>)_6\n  assert_that/Create/FlatMap(<lambda at core.py:2971>):beam:transform:pardo:v1\n  must follow: \n  downstream_side_inputs: <unknown>', 'ref_AppliedPTransform_assert_that/Create/Map(decode)_8\n  assert_that/Create/Map(decode):beam:transform:pardo:v1\n  must follow: \n  downstream_side_inputs: <unknown>', 'ref_AppliedPTransform_assert_that/WindowInto(WindowIntoFn)_9\n  assert_that/WindowInto(WindowIntoFn):beam:transform:window_into:v1\n  must follow: \n  downstream_side_inputs: <unknown>', 'ref_AppliedPTransform_assert_that/ToVoidKey_10\n  assert_that/ToVoidKey:beam:transform:pardo:v1\n  must follow: \n  downstream_side_inputs: <unknown>', 'ref_AppliedPTransform_assert_that/Group/pair_with_0_12\n  assert_that/Group/pair_with_0:beam:transform:pardo:v1\n  must follow: \n  downstream_side_inputs: <unknown>', 'ref_AppliedPTransform_assert_that/Group/pair_with_1_13\n  assert_that/Group/pair_with_1:beam:transform:pardo:v1\n  must follow: \n  downstream_side_inputs: <unknown>', 'ref_AppliedPTransform_assert_that/Group/Flatten_14\n  assert_that/Group/Flatten:beam:transform:flatten:v1\n  must follow: \n  downstream_side_inputs: <unknown>', 'ref_AppliedPTransform_assert_that/Group/GroupByKey_15\n  assert_that/Group/GroupByKey:beam:transform:group_by_key:v1\n  must follow: \n  downstream_side_inputs: <unknown>', 'ref_AppliedPTransform_assert_that/Group/Map(_merge_tagged_vals_under_key)_16\n  assert_that/Group/Map(_merge_tagged_vals_under_key):beam:transform:pardo:v1\n  must follow: \n  downstream_side_inputs: <unknown>', 'ref_AppliedPTransform_assert_that/Unkey_17\n  assert_that/Unkey:beam:transform:pardo:v1\n  must follow: \n  downstream_side_inputs: <unknown>', 'ref_AppliedPTransform_assert_that/Match_18\n  assert_that/Match:beam:transform:pardo:v1\n  must follow: \n  downstream_side_inputs: <unknown>']
apache_beam.runners.portability.fn_api_runner.translations: INFO: ==================== <function sort_stages at 0x7f62bdb68268> ====================
apache_beam.runners.portability.fn_api_runner.translations: DEBUG: 16 [1, 1, 1, 1, 1, 1, 1, 1, 1, 1, 1, 1, 1, 1, 1, 1]
apache_beam.runners.portability.fn_api_runner.translations: DEBUG: Stages: ['external_9SqlTransform(beam:external:java:sql:v1)/BeamValuesRel_13/Create.Values/Read(CreateSource)/Impulse\n  SqlTransform(beam:external:java:sql:v1)/BeamValuesRel_13/Create.Values/Read(CreateSource)/Impulse:beam:transform:impulse:v1\n  must follow: \n  downstream_side_inputs: <unknown>', 'external_9SqlTransform(beam:external:java:sql:v1)/BeamValuesRel_13/Create.Values/Read(CreateSource)/ParDo(OutputSingleSource)/ParMultiDo(OutputSingleSource)\n  SqlTransform(beam:external:java:sql:v1)/BeamValuesRel_13/Create.Values/Read(CreateSource)/ParDo(OutputSingleSource)/ParMultiDo(OutputSingleSource):beam:transform:pardo:v1\n  must follow: \n  downstream_side_inputs: <unknown>', 'external_9SqlTransform(beam:external:java:sql:v1)/BeamValuesRel_13/Create.Values/Read(CreateSource)/ParDo(BoundedSourceAsSDFWrapper)/ParMultiDo(BoundedSourceAsSDFWrapper)\n  SqlTransform(beam:external:java:sql:v1)/BeamValuesRel_13/Create.Values/Read(CreateSource)/ParDo(BoundedSourceAsSDFWrapper)/ParMultiDo(BoundedSourceAsSDFWrapper):beam:transform:pardo:v1\n  must follow: \n  downstream_side_inputs: <unknown>', 'external_9SqlTransform(beam:external:java:sql:v1)/BeamZetaSqlCalcRel_17/ParDo(Calc)/ParMultiDo(Calc)\n  SqlTransform(beam:external:java:sql:v1)/BeamZetaSqlCalcRel_17/ParDo(Calc)/ParMultiDo(Calc):beam:transform:pardo:v1\n  must follow: \n  downstream_side_inputs: <unknown>', 'ref_AppliedPTransform_assert_that/Create/Impulse_5\n  assert_that/Create/Impulse:beam:transform:impulse:v1\n  must follow: \n  downstream_side_inputs: <unknown>', 'ref_AppliedPTransform_assert_that/Create/FlatMap(<lambda at core.py:2971>)_6\n  assert_that/Create/FlatMap(<lambda at core.py:2971>):beam:transform:pardo:v1\n  must follow: \n  downstream_side_inputs: <unknown>', 'ref_AppliedPTransform_assert_that/Create/Map(decode)_8\n  assert_that/Create/Map(decode):beam:transform:pardo:v1\n  must follow: \n  downstream_side_inputs: <unknown>', 'ref_AppliedPTransform_assert_that/WindowInto(WindowIntoFn)_9\n  assert_that/WindowInto(WindowIntoFn):beam:transform:window_into:v1\n  must follow: \n  downstream_side_inputs: <unknown>', 'ref_AppliedPTransform_assert_that/ToVoidKey_10\n  assert_that/ToVoidKey:beam:transform:pardo:v1\n  must follow: \n  downstream_side_inputs: <unknown>', 'ref_AppliedPTransform_assert_that/Group/pair_with_0_12\n  assert_that/Group/pair_with_0:beam:transform:pardo:v1\n  must follow: \n  downstream_side_inputs: <unknown>', 'ref_AppliedPTransform_assert_that/Group/pair_with_1_13\n  assert_that/Group/pair_with_1:beam:transform:pardo:v1\n  must follow: \n  downstream_side_inputs: <unknown>', 'ref_AppliedPTransform_assert_that/Group/Flatten_14\n  assert_that/Group/Flatten:beam:transform:flatten:v1\n  must follow: \n  downstream_side_inputs: <unknown>', 'ref_AppliedPTransform_assert_that/Group/GroupByKey_15\n  assert_that/Group/GroupByKey:beam:transform:group_by_key:v1\n  must follow: \n  downstream_side_inputs: <unknown>', 'ref_AppliedPTransform_assert_that/Group/Map(_merge_tagged_vals_under_key)_16\n  assert_that/Group/Map(_merge_tagged_vals_under_key):beam:transform:pardo:v1\n  must follow: \n  downstream_side_inputs: <unknown>', 'ref_AppliedPTransform_assert_that/Unkey_17\n  assert_that/Unkey:beam:transform:pardo:v1\n  must follow: \n  downstream_side_inputs: <unknown>', 'ref_AppliedPTransform_assert_that/Match_18\n  assert_that/Match:beam:transform:pardo:v1\n  must follow: \n  downstream_side_inputs: <unknown>']
--------------------- >> end captured logging << ---------------------

----------------------------------------------------------------------
XML: nosetests-xlangSqlValidateRunner.xml
----------------------------------------------------------------------
XML: <https://ci-beam.apache.org/job/beam_PostCommit_XVR_Spark/ws/src/sdks/python/nosetests.xml>
----------------------------------------------------------------------
Ran 9 tests in 633.881s

FAILED (errors=9)

> Task :runners:spark:2:job-server:validatesCrossLanguageRunnerPythonUsingSql FAILED
> Task :runners:spark:2:job-server:validatesCrossLanguageRunnerCleanup
> Task :runners:spark:2:job-server:sparkJobServerCleanup

FAILURE: Build completed with 8 failures.

1: Task failed with an exception.
-----------
* What went wrong:
Execution failed for task ':runners:spark:3:job-server:validatesCrossLanguageRunnerPythonUsingJava'.
> Process 'command 'sh'' finished with non-zero exit value 1

* Try:
Run with --stacktrace option to get the stack trace. Run with --info or --debug option to get more log output. Run with --scan to get full insights.
==============================================================================

2: Task failed with an exception.
-----------
* What went wrong:
Execution failed for task ':runners:spark:3:job-server:validatesCrossLanguageRunnerPythonUsingPython'.
> Process 'command 'sh'' finished with non-zero exit value 1

* Try:
Run with --stacktrace option to get the stack trace. Run with --info or --debug option to get more log output. Run with --scan to get full insights.
==============================================================================

3: Task failed with an exception.
-----------
* What went wrong:
Execution failed for task ':runners:spark:3:job-server:validatesCrossLanguageRunnerPythonUsingSql'.
> Process 'command 'sh'' finished with non-zero exit value 1

* Try:
Run with --stacktrace option to get the stack trace. Run with --info or --debug option to get more log output. Run with --scan to get full insights.
==============================================================================

4: Task failed with an exception.
-----------
* What went wrong:
Execution failed for task ':runners:spark:2:job-server:validatesCrossLanguageRunnerJavaUsingPython'.
> There were failing tests. See the report at: file://<https://ci-beam.apache.org/job/beam_PostCommit_XVR_Spark/ws/src/runners/spark/2/job-server/build/reports/tests/validatesCrossLanguageRunnerJavaUsingPython/index.html>

* Try:
Run with --stacktrace option to get the stack trace. Run with --info or --debug option to get more log output. Run with --scan to get full insights.
==============================================================================

5: Task failed with an exception.
-----------
* What went wrong:
Execution failed for task ':runners:spark:2:job-server:validatesCrossLanguageRunnerJavaUsingPythonOnly'.
> There were failing tests. See the report at: file://<https://ci-beam.apache.org/job/beam_PostCommit_XVR_Spark/ws/src/runners/spark/2/job-server/build/reports/tests/validatesCrossLanguageRunnerJavaUsingPythonOnly/index.html>

* Try:
Run with --stacktrace option to get the stack trace. Run with --info or --debug option to get more log output. Run with --scan to get full insights.
==============================================================================

6: Task failed with an exception.
-----------
* What went wrong:
Execution failed for task ':runners:spark:2:job-server:validatesCrossLanguageRunnerPythonUsingJava'.
> Process 'command 'sh'' finished with non-zero exit value 1

* Try:
Run with --stacktrace option to get the stack trace. Run with --info or --debug option to get more log output. Run with --scan to get full insights.
==============================================================================

7: Task failed with an exception.
-----------
* What went wrong:
Execution failed for task ':runners:spark:2:job-server:validatesCrossLanguageRunnerPythonUsingPython'.
> Process 'command 'sh'' finished with non-zero exit value 1

* Try:
Run with --stacktrace option to get the stack trace. Run with --info or --debug option to get more log output. Run with --scan to get full insights.
==============================================================================

8: Task failed with an exception.
-----------
* What went wrong:
Execution failed for task ':runners:spark:2:job-server:validatesCrossLanguageRunnerPythonUsingSql'.
> Process 'command 'sh'' finished with non-zero exit value 1

* Try:
Run with --stacktrace option to get the stack trace. Run with --info or --debug option to get more log output. Run with --scan to get full insights.
==============================================================================

* Get more help at https://help.gradle.org

Deprecated Gradle features were used in this build, making it incompatible with Gradle 7.0.
Use '--warning-mode all' to show the individual deprecation warnings.
See https://docs.gradle.org/6.8/userguide/command_line_interface.html#sec:command_line_warnings

BUILD FAILED in 41m 31s
201 actionable tasks: 146 executed, 51 from cache, 4 up-to-date
Gradle was unable to watch the file system for changes. The inotify watches limit is too low.

Publishing build scan...
https://gradle.com/s/cosnyvpzzrd3g

Build step 'Invoke Gradle script' changed build result to FAILURE
Build step 'Invoke Gradle script' marked build as failure


---------------------------------------------------------------------
To unsubscribe, e-mail: builds-unsubscribe@beam.apache.org
For additional commands, e-mail: builds-help@beam.apache.org