You are viewing a plain text version of this content. The canonical link for it is here.
Posted to issues@bookkeeper.apache.org by Apache Jenkins Server <je...@builds.apache.org> on 2019/09/27 15:32:28 UTC

Build failed in Jenkins: bookkeeper_postcommit_validation_master #481

See <https://builds.apache.org/job/bookkeeper_postcommit_validation_master/481/display/redirect>

------------------------------------------
Started by timer
[EnvInject] - Loading node environment variables.
Building remotely on H40 (ubuntu xenial) in workspace /home/jenkins/jenkins-slave/workspace/bookkeeper_postcommit_validation_master
[WS-CLEANUP] Deleting project workspace...
[WS-CLEANUP] Deferred wipeout is used...
FATAL: hudson.remoting.Channel$OrderlyShutdown: Command Close created at
Command Close created at
	at hudson.remoting.Command.<init>(Command.java:68)
	at hudson.remoting.Channel$CloseCommand.<init>(Channel.java:1265)
	at hudson.remoting.Channel$CloseCommand.<init>(Channel.java:1263)
	at hudson.remoting.Channel.close(Channel.java:1436)
	at hudson.remoting.Channel.close(Channel.java:1403)
	at hudson.remoting.Channel$CloseCommand.execute(Channel.java:1270)
Caused: hudson.remoting.Channel$OrderlyShutdown
Also:   hudson.remoting.Channel$CallSiteStackTrace: Remote call to H40
		at hudson.remoting.Channel.attachCallSiteStackTrace(Channel.java:1741)
		at hudson.remoting.Request.call(Request.java:202)
		at hudson.remoting.Channel.call(Channel.java:954)
		at hudson.FilePath.act(FilePath.java:1072)
		at hudson.FilePath.act(FilePath.java:1061)
		at hudson.FilePath.renameTo(FilePath.java:2173)
		at hudson.plugins.ws_cleanup.Wipeout.perform(Wipeout.java:67)
		at hudson.plugins.ws_cleanup.PreBuildCleanup.preCheckout(PreBuildCleanup.java:107)
		at jenkins.scm.SCMCheckoutStrategy.preCheckout(SCMCheckoutStrategy.java:76)
		at hudson.model.AbstractBuild$AbstractBuildExecution.run(AbstractBuild.java:498)
		at hudson.model.Run.execute(Run.java:1810)
		at hudson.maven.MavenModuleSetBuild.run(MavenModuleSetBuild.java:543)
		at hudson.model.ResourceController.execute(ResourceController.java:97)
		at hudson.model.Executor.run(Executor.java:429)
Caused: hudson.remoting.RequestAbortedException
	at hudson.remoting.Request.abort(Request.java:340)
	at hudson.remoting.Channel.terminate(Channel.java:1038)
	at hudson.remoting.Channel$CloseCommand.execute(Channel.java:1271)
	at hudson.remoting.Channel$1.handle(Channel.java:565)
	at hudson.remoting.SynchronousCommandTransport$ReaderThread.run(SynchronousCommandTransport.java:85)
ERROR: H40 is offline; cannot locate JDK 1.8 (latest)
ERROR: H40 is offline; cannot locate Maven 3.6.0
Not sending mail to unregistered user noreply@github.com

Jenkins build is back to normal : bookkeeper_postcommit_validation_master #485

Posted by Apache Jenkins Server <je...@builds.apache.org>.
See <https://builds.apache.org/job/bookkeeper_postcommit_validation_master/485/display/redirect>


Build failed in Jenkins: bookkeeper_postcommit_validation_master #484

Posted by Apache Jenkins Server <je...@builds.apache.org>.
See <https://builds.apache.org/job/bookkeeper_postcommit_validation_master/484/display/redirect>

Changes:


------------------------------------------
Started by timer
Running as SYSTEM
[EnvInject] - Loading node environment variables.
Building remotely on H41 (ubuntu xenial) in workspace <https://builds.apache.org/job/bookkeeper_postcommit_validation_master/ws/>
[WS-CLEANUP] Deleting project workspace...
[WS-CLEANUP] Deferred wipeout is used...
[WS-CLEANUP] Done
No credentials specified
Cloning the remote Git repository
Cloning repository https://github.com/apache/bookkeeper.git
 > git init <https://builds.apache.org/job/bookkeeper_postcommit_validation_master/ws/> # timeout=10
Fetching upstream changes from https://github.com/apache/bookkeeper.git
 > git --version # timeout=10
 > git fetch --tags --progress https://github.com/apache/bookkeeper.git +refs/heads/*:refs/remotes/origin/*
 > git config remote.origin.url https://github.com/apache/bookkeeper.git # timeout=10
 > git config --add remote.origin.fetch +refs/heads/*:refs/remotes/origin/* # timeout=10
 > git config remote.origin.url https://github.com/apache/bookkeeper.git # timeout=10
Fetching upstream changes from https://github.com/apache/bookkeeper.git
 > git fetch --tags --progress https://github.com/apache/bookkeeper.git +refs/heads/*:refs/remotes/origin/* +refs/pull/${ghprbPullId}/*:refs/remotes/origin/pr/${ghprbPullId}/*
 > git rev-parse origin/master^{commit} # timeout=10
Checking out Revision 7071dac225cb2e4924e4c1e75225e572270a7135 (origin/master)
 > git config core.sparsecheckout # timeout=10
 > git checkout -f 7071dac225cb2e4924e4c1e75225e572270a7135
Commit message: "Change Python client version to 4.10.0"
 > git rev-list --no-walk 7071dac225cb2e4924e4c1e75225e572270a7135 # timeout=10
Cleaning workspace
 > git rev-parse --verify HEAD # timeout=10
Resetting working tree
 > git reset --hard # timeout=10
 > git clean -fdx # timeout=10
Parsing POMs
Downloaded artifact https://repo.maven.apache.org/maven2/org/apache/apache/18/apache-18.pom
Modules changed, recalculating dependency graph
Established TCP socket on 37257
maven35-agent.jar already up to date
maven35-interceptor.jar already up to date
maven3-interceptor-commons.jar already up to date
[bookkeeper_postcommit_validation_master] $ /home/jenkins/tools/java/latest1.8/bin/java -Dorg.slf4j.simpleLogger.showDateTime=true -Dorg.slf4j.simpleLogger.dateTimeFormat=yyyy-MM-dd'T'HH:mm:ss.SSS -XX:+TieredCompilation -XX:TieredStopAtLevel=1 -Xmx4096m -Xms2048m -cp /home/jenkins/jenkins-slave/maven35-agent.jar:/home/jenkins/tools/maven/apache-maven-3.6.0/boot/plexus-classworlds-2.5.2.jar:/home/jenkins/tools/maven/apache-maven-3.6.0/conf/logging jenkins.maven3.agent.Maven35Main /home/jenkins/tools/maven/apache-maven-3.6.0 /home/jenkins/jenkins-slave/remoting.jar /home/jenkins/jenkins-slave/maven35-interceptor.jar /home/jenkins/jenkins-slave/maven3-interceptor-commons.jar 37257
#
# There is insufficient memory for the Java Runtime Environment to continue.
# Cannot create GC thread. Out of system resources.
# An error report file with more information is saved as:
# <https://builds.apache.org/job/bookkeeper_postcommit_validation_master/ws/hs_err_pid33883.log>
ERROR: Failed to launch Maven. Exit code = 1
Not sending mail to unregistered user noreply@github.com

Build failed in Jenkins: bookkeeper_postcommit_validation_master #483

Posted by Apache Jenkins Server <je...@builds.apache.org>.
See <https://builds.apache.org/job/bookkeeper_postcommit_validation_master/483/display/redirect?page=changes>

Changes:

[github] Fix tests and upgrade libs to make tests pass on JDK13

[github] Change Python client version to 4.10.0


------------------------------------------
[...truncated 328.09 KB...]
2019-09-29T16:32:33.049 [INFO] Downloading from central: https://repo.maven.apache.org/maven2/org/apache/maven/surefire/surefire-logger-api/2.21.0/surefire-logger-api-2.21.0.pom
2019-09-29T16:32:33.061 [INFO] Downloaded from central: https://repo.maven.apache.org/maven2/org/apache/maven/surefire/surefire-logger-api/2.21.0/surefire-logger-api-2.21.0.pom (2.0 kB at 168 kB/s)
2019-09-29T16:32:33.067 [INFO] Downloading from central: https://repo.maven.apache.org/maven2/org/apache/maven/surefire/surefire-booter/2.21.0/surefire-booter-2.21.0.pom
2019-09-29T16:32:33.079 [INFO] Downloaded from central: https://repo.maven.apache.org/maven2/org/apache/maven/surefire/surefire-booter/2.21.0/surefire-booter-2.21.0.pom (7.4 kB at 614 kB/s)
2019-09-29T16:32:33.087 [INFO] Downloading from central: https://repo.maven.apache.org/maven2/org/apache/maven/maven-toolchain/2.2.1/maven-toolchain-2.2.1.pom
2019-09-29T16:32:33.100 [INFO] Downloaded from central: https://repo.maven.apache.org/maven2/org/apache/maven/maven-toolchain/2.2.1/maven-toolchain-2.2.1.pom (3.3 kB at 257 kB/s)
2019-09-29T16:32:33.104 [INFO] Downloading from central: https://repo.maven.apache.org/maven2/org/codehaus/plexus/plexus-java/0.9.3/plexus-java-0.9.3.pom
2019-09-29T16:32:33.117 [INFO] Downloaded from central: https://repo.maven.apache.org/maven2/org/codehaus/plexus/plexus-java/0.9.3/plexus-java-0.9.3.pom (2.4 kB at 181 kB/s)
2019-09-29T16:32:33.119 [INFO] Downloading from central: https://repo.maven.apache.org/maven2/org/codehaus/plexus/plexus-languages/0.9.3/plexus-languages-0.9.3.pom
2019-09-29T16:32:33.140 [INFO] Downloaded from central: https://repo.maven.apache.org/maven2/org/codehaus/plexus/plexus-languages/0.9.3/plexus-languages-0.9.3.pom (2.2 kB at 105 kB/s)
2019-09-29T16:32:33.143 [INFO] Downloading from central: https://repo.maven.apache.org/maven2/org/ow2/asm/asm/6.0_BETA/asm-6.0_BETA.pom
2019-09-29T16:32:33.154 [INFO] Downloaded from central: https://repo.maven.apache.org/maven2/org/ow2/asm/asm/6.0_BETA/asm-6.0_BETA.pom (1.9 kB at 176 kB/s)
2019-09-29T16:32:33.156 [INFO] Downloading from central: https://repo.maven.apache.org/maven2/org/ow2/asm/asm-parent/6.0_BETA/asm-parent-6.0_BETA.pom
2019-09-29T16:32:33.168 [INFO] Downloaded from central: https://repo.maven.apache.org/maven2/org/ow2/asm/asm-parent/6.0_BETA/asm-parent-6.0_BETA.pom (5.5 kB at 458 kB/s)
2019-09-29T16:32:33.171 [INFO] Downloading from central: https://repo.maven.apache.org/maven2/com/thoughtworks/qdox/qdox/2.0-M7/qdox-2.0-M7.pom
2019-09-29T16:32:33.184 [INFO] Downloaded from central: https://repo.maven.apache.org/maven2/com/thoughtworks/qdox/qdox/2.0-M7/qdox-2.0-M7.pom (16 kB at 1.2 MB/s)
2019-09-29T16:32:33.193 [INFO] Downloading from central: https://repo.maven.apache.org/maven2/org/apache/maven/surefire/maven-surefire-common/2.21.0/maven-surefire-common-2.21.0.jar
2019-09-29T16:32:33.193 [INFO] Downloading from central: https://repo.maven.apache.org/maven2/org/apache/maven/plugin-tools/maven-plugin-annotations/3.5/maven-plugin-annotations-3.5.jar
2019-09-29T16:32:33.194 [INFO] Downloading from central: https://repo.maven.apache.org/maven2/org/apache/maven/surefire/surefire-api/2.21.0/surefire-api-2.21.0.jar
2019-09-29T16:32:33.195 [INFO] Downloading from central: https://repo.maven.apache.org/maven2/org/apache/maven/surefire/surefire-logger-api/2.21.0/surefire-logger-api-2.21.0.jar
2019-09-29T16:32:33.196 [INFO] Downloading from central: https://repo.maven.apache.org/maven2/org/apache/maven/surefire/surefire-booter/2.21.0/surefire-booter-2.21.0.jar
2019-09-29T16:32:33.209 [INFO] Downloaded from central: https://repo.maven.apache.org/maven2/org/apache/maven/plugin-tools/maven-plugin-annotations/3.5/maven-plugin-annotations-3.5.jar (14 kB at 894 kB/s)
2019-09-29T16:32:33.209 [INFO] Downloading from central: https://repo.maven.apache.org/maven2/org/apache/maven/maven-toolchain/2.2.1/maven-toolchain-2.2.1.jar
2019-09-29T16:32:33.210 [INFO] Downloaded from central: https://repo.maven.apache.org/maven2/org/apache/maven/surefire/surefire-logger-api/2.21.0/surefire-logger-api-2.21.0.jar (13 kB at 838 kB/s)
2019-09-29T16:32:33.210 [INFO] Downloading from central: https://repo.maven.apache.org/maven2/org/codehaus/plexus/plexus-java/0.9.3/plexus-java-0.9.3.jar
2019-09-29T16:32:33.224 [INFO] Downloaded from central: https://repo.maven.apache.org/maven2/org/apache/maven/maven-toolchain/2.2.1/maven-toolchain-2.2.1.jar (38 kB at 1.3 MB/s)
2019-09-29T16:32:33.224 [INFO] Downloading from central: https://repo.maven.apache.org/maven2/org/ow2/asm/asm/6.0_BETA/asm-6.0_BETA.jar
2019-09-29T16:32:33.225 [INFO] Downloaded from central: https://repo.maven.apache.org/maven2/org/codehaus/plexus/plexus-java/0.9.3/plexus-java-0.9.3.jar (32 kB at 1.1 MB/s)
2019-09-29T16:32:33.225 [INFO] Downloading from central: https://repo.maven.apache.org/maven2/com/thoughtworks/qdox/qdox/2.0-M7/qdox-2.0-M7.jar
2019-09-29T16:32:33.226 [INFO] Downloaded from central: https://repo.maven.apache.org/maven2/org/apache/maven/surefire/surefire-api/2.21.0/surefire-api-2.21.0.jar (185 kB at 5.6 MB/s)
2019-09-29T16:32:33.235 [INFO] Downloaded from central: https://repo.maven.apache.org/maven2/org/apache/maven/surefire/surefire-booter/2.21.0/surefire-booter-2.21.0.jar (273 kB at 6.8 MB/s)
2019-09-29T16:32:33.240 [INFO] Downloaded from central: https://repo.maven.apache.org/maven2/org/ow2/asm/asm/6.0_BETA/asm-6.0_BETA.jar (56 kB at 1.3 MB/s)
2019-09-29T16:32:33.256 [INFO] Downloaded from central: https://repo.maven.apache.org/maven2/org/apache/maven/surefire/maven-surefire-common/2.21.0/maven-surefire-common-2.21.0.jar (521 kB at 8.1 MB/s)
2019-09-29T16:32:33.268 [INFO] Downloaded from central: https://repo.maven.apache.org/maven2/com/thoughtworks/qdox/qdox/2.0-M7/qdox-2.0-M7.jar (315 kB at 4.4 MB/s)
2019-09-29T16:32:33.370 [INFO] Tests are skipped.
2019-09-29T16:32:33.687 [INFO] 
2019-09-29T16:32:33.687 [INFO] --- maven-jar-plugin:3.0.0:jar (default-jar) @ buildtools ---
2019-09-29T16:32:33.697 [INFO] Downloading from central: https://repo.maven.apache.org/maven2/org/apache/maven/maven-archiver/3.0.2/maven-archiver-3.0.2.pom
2019-09-29T16:32:33.713 [INFO] Downloaded from central: https://repo.maven.apache.org/maven2/org/apache/maven/maven-archiver/3.0.2/maven-archiver-3.0.2.pom (4.1 kB at 259 kB/s)
2019-09-29T16:32:33.715 [INFO] Downloading from central: https://repo.maven.apache.org/maven2/org/apache/maven/shared/maven-shared-components/22/maven-shared-components-22.pom
2019-09-29T16:32:33.728 [INFO] Downloaded from central: https://repo.maven.apache.org/maven2/org/apache/maven/shared/maven-shared-components/22/maven-shared-components-22.pom (5.1 kB at 393 kB/s)
2019-09-29T16:32:33.732 [INFO] Downloading from central: https://repo.maven.apache.org/maven2/org/codehaus/plexus/plexus-archiver/3.1.1/plexus-archiver-3.1.1.pom
2019-09-29T16:32:33.745 [INFO] Downloaded from central: https://repo.maven.apache.org/maven2/org/codehaus/plexus/plexus-archiver/3.1.1/plexus-archiver-3.1.1.pom (5.0 kB at 383 kB/s)
2019-09-29T16:32:33.748 [INFO] Downloading from central: https://repo.maven.apache.org/maven2/org/codehaus/plexus/plexus-io/2.7.1/plexus-io-2.7.1.pom
2019-09-29T16:32:33.760 [INFO] Downloaded from central: https://repo.maven.apache.org/maven2/org/codehaus/plexus/plexus-io/2.7.1/plexus-io-2.7.1.pom (4.9 kB at 410 kB/s)
2019-09-29T16:32:33.763 [INFO] Downloading from central: https://repo.maven.apache.org/maven2/org/iq80/snappy/snappy/0.4/snappy-0.4.pom
2019-09-29T16:32:33.777 [INFO] Downloaded from central: https://repo.maven.apache.org/maven2/org/iq80/snappy/snappy/0.4/snappy-0.4.pom (15 kB at 1.0 MB/s)
2019-09-29T16:32:33.780 [INFO] Downloading from central: https://repo.maven.apache.org/maven2/org/codehaus/plexus/plexus-interpolation/1.21/plexus-interpolation-1.21.pom
2019-09-29T16:32:33.791 [INFO] Downloaded from central: https://repo.maven.apache.org/maven2/org/codehaus/plexus/plexus-interpolation/1.21/plexus-interpolation-1.21.pom (1.5 kB at 140 kB/s)
2019-09-29T16:32:33.806 [INFO] Downloading from central: https://repo.maven.apache.org/maven2/org/apache/maven/maven-archiver/3.0.2/maven-archiver-3.0.2.jar
2019-09-29T16:32:33.806 [INFO] Downloading from central: https://repo.maven.apache.org/maven2/org/codehaus/plexus/plexus-archiver/3.1.1/plexus-archiver-3.1.1.jar
2019-09-29T16:32:33.806 [INFO] Downloading from central: https://repo.maven.apache.org/maven2/org/codehaus/plexus/plexus-io/2.7.1/plexus-io-2.7.1.jar
2019-09-29T16:32:33.807 [INFO] Downloading from central: https://repo.maven.apache.org/maven2/org/iq80/snappy/snappy/0.4/snappy-0.4.jar
2019-09-29T16:32:33.808 [INFO] Downloading from central: https://repo.maven.apache.org/maven2/org/codehaus/plexus/plexus-utils/3.0.22/plexus-utils-3.0.22.jar
2019-09-29T16:32:33.823 [INFO] Downloaded from central: https://repo.maven.apache.org/maven2/org/apache/maven/maven-archiver/3.0.2/maven-archiver-3.0.2.jar (23 kB at 1.3 MB/s)
2019-09-29T16:32:33.826 [INFO] Downloaded from central: https://repo.maven.apache.org/maven2/org/iq80/snappy/snappy/0.4/snappy-0.4.jar (58 kB at 2.9 MB/s)
2019-09-29T16:32:33.827 [INFO] Downloaded from central: https://repo.maven.apache.org/maven2/org/codehaus/plexus/plexus-io/2.7.1/plexus-io-2.7.1.jar (86 kB at 4.1 MB/s)
2019-09-29T16:32:33.836 [INFO] Downloaded from central: https://repo.maven.apache.org/maven2/org/codehaus/plexus/plexus-archiver/3.1.1/plexus-archiver-3.1.1.jar (178 kB at 5.9 MB/s)
2019-09-29T16:32:33.844 [INFO] Downloaded from central: https://repo.maven.apache.org/maven2/org/codehaus/plexus/plexus-utils/3.0.22/plexus-utils-3.0.22.jar (245 kB at 6.6 MB/s)
2019-09-29T16:32:33.998 [INFO] Building jar: <https://builds.apache.org/job/bookkeeper_postcommit_validation_master/ws/buildtools/target/buildtools-4.10.0-SNAPSHOT.jar>
[JENKINS] Archiving disabled
[JENKINS] Archiving disabled
[JENKINS] Archiving disabled
[JENKINS] Archiving disabled
[JENKINS] Archiving disabled
[JENKINS] Archiving disabled
[JENKINS] Archiving disabled
[JENKINS] Archiving disabled
[JENKINS] Archiving disabled
[JENKINS] Archiving disabled
[JENKINS] Archiving disabled
[JENKINS] Archiving disabled
[JENKINS] Archiving disabled
[JENKINS] Archiving disabled
[JENKINS] Archiving disabled
[JENKINS] Archiving disabled
[JENKINS] Archiving disabled
[JENKINS] Archiving disabled
[JENKINS] Archiving disabled
[JENKINS] Archiving disabled
[JENKINS] Archiving disabled
[JENKINS] Archiving disabled
[JENKINS] Archiving disabled
[JENKINS] Archiving disabled
[JENKINS] Archiving disabled
[JENKINS] Archiving disabled
[JENKINS] Archiving disabled
[JENKINS] Archiving disabled
[JENKINS] Archiving disabled
[JENKINS] Archiving disabled
[JENKINS] Archiving disabled
[JENKINS] Archiving disabled
[JENKINS] Archiving disabled
[JENKINS] Archiving disabled
[JENKINS] Archiving disabled
[JENKINS] Archiving disabled
[JENKINS] Archiving disabled
[JENKINS] Archiving disabled
[JENKINS] Archiving disabled
[JENKINS] Archiving disabled
[JENKINS] Archiving disabled
[JENKINS] Archiving disabled
[JENKINS] Archiving disabled
[JENKINS] Archiving disabled
[JENKINS] Archiving disabled
[JENKINS] Archiving disabled
[JENKINS] Archiving disabled
[JENKINS] Archiving disabled
[JENKINS] Archiving disabled
[JENKINS] Archiving disabled
[JENKINS] Archiving disabled
[JENKINS] Archiving disabled
[JENKINS] Archiving disabled
[JENKINS] Archiving disabled
[JENKINS] Archiving disabled
[JENKINS] Archiving disabled
[JENKINS] Archiving disabled
[JENKINS] Archiving disabled
[JENKINS] Archiving disabled
[JENKINS] Archiving disabled
[JENKINS] Archiving disabled
[JENKINS] Archiving disabled
[JENKINS] Archiving disabled
[JENKINS] Archiving disabled
[JENKINS] Archiving disabled
[JENKINS] Archiving disabled
[JENKINS] Archiving disabled
[JENKINS] Archiving disabled
[JENKINS] Archiving disabled
[JENKINS] Archiving disabled
[JENKINS] Archiving disabled
[JENKINS] Archiving disabled
[JENKINS] Archiving disabled
[JENKINS] Archiving disabled
[JENKINS] Archiving disabled
[JENKINS] Archiving disabled
[JENKINS] Archiving disabled
[JENKINS] Archiving disabled
[JENKINS] Archiving disabled
[JENKINS] Archiving disabled
[JENKINS] Archiving disabled
[JENKINS] Archiving disabled
[JENKINS] Archiving disabled
[JENKINS] Archiving disabled
[JENKINS] Archiving disabled
2019-09-29T16:33:17.246 [INFO] ------------------------------------------------------------------------
2019-09-29T16:33:17.246 [INFO] Reactor Summary for Apache BookKeeper :: Parent 4.10.0-SNAPSHOT:
2019-09-29T16:33:17.246 [INFO] 
2019-09-29T16:33:17.247 [INFO] Apache BookKeeper :: Parent ........................ SUCCESS [ 14.357 s]
2019-09-29T16:33:17.247 [INFO] Apache BookKeeper :: Build Tools ................... FAILURE [  4.727 s]
2019-09-29T16:33:17.247 [INFO] Apache BookKeeper :: Circe Checksum Library ........ SKIPPED
2019-09-29T16:33:17.247 [INFO] Apache BookKeeper :: Stats API ..................... SKIPPED
2019-09-29T16:33:17.247 [INFO] Apache BookKeeper :: CPU Affinity Library .......... SKIPPED
2019-09-29T16:33:17.247 [INFO] Apache BookKeeper :: Common ........................ SKIPPED
2019-09-29T16:33:17.247 [INFO] Apache BookKeeper :: Common :: Allocator ........... SKIPPED
2019-09-29T16:33:17.247 [INFO] Apache BookKeeper :: Stats :: Parent ............... SKIPPED
2019-09-29T16:33:17.247 [INFO] Apache BookKeeper :: Stats :: Utils ................ SKIPPED
2019-09-29T16:33:17.247 [INFO] Apache BookKeeper :: Protocols ..................... SKIPPED
2019-09-29T16:33:17.247 [INFO] Apache BookKeeper :: Tools :: Parent ............... SKIPPED
2019-09-29T16:33:17.247 [INFO] Apache BookKeeper :: Tools :: Framework ............ SKIPPED
2019-09-29T16:33:17.247 [INFO] Apache BookKeeper :: Http :: Http Server ........... SKIPPED
2019-09-29T16:33:17.247 [INFO] Apache BookKeeper :: Stats Providers :: Prometheus . SKIPPED
2019-09-29T16:33:17.247 [INFO] Apache BookKeeper :: Bookkeeper Http :: Vertx Http Server SKIPPED
2019-09-29T16:33:17.247 [INFO] Apache BookKeeper :: Server ........................ SKIPPED
2019-09-29T16:33:17.247 [INFO] Apache BookKeeper :: Benchmark ..................... SKIPPED
2019-09-29T16:33:17.247 [INFO] Apache BookKeeper :: Stats Providers :: Codahale Metrics SKIPPED
2019-09-29T16:33:17.247 [INFO] Apache BookKeeper :: Stats Providers ............... SKIPPED
2019-09-29T16:33:17.248 [INFO] Apache BookKeeper :: Bookkeeper Http :: Twitter Http Server SKIPPED
2019-09-29T16:33:17.248 [INFO] Apache BookKeeper :: Http .......................... SKIPPED
2019-09-29T16:33:17.248 [INFO] Apache BookKeeper :: DistributedLog :: Parent ...... SKIPPED
2019-09-29T16:33:17.248 [INFO] Apache BookKeeper :: DistributedLog :: Common ...... SKIPPED
2019-09-29T16:33:17.248 [INFO] Apache BookKeeper :: DistributedLog :: Protocol .... SKIPPED
2019-09-29T16:33:17.248 [INFO] Apache BookKeeper :: DistributedLog :: Core Library  SKIPPED
2019-09-29T16:33:17.248 [INFO] Apache BookKeeper :: DistributedLog :: IO :: FileSystem SKIPPED
2019-09-29T16:33:17.248 [INFO] Apache BookKeeper :: DistributedLog :: IO .......... SKIPPED
2019-09-29T16:33:17.248 [INFO] Apache BookKeeper :: Tools :: Ledger ............... SKIPPED
2019-09-29T16:33:17.248 [INFO] Apache BookKeeper :: Stream Storage :: Parent ...... SKIPPED
2019-09-29T16:33:17.248 [INFO] Apache BookKeeper :: Stream Storage :: Common Classes for Tests SKIPPED
2019-09-29T16:33:17.248 [INFO] Apache BookKeeper :: Stream Storage :: Common ...... SKIPPED
2019-09-29T16:33:17.248 [INFO] Apache BookKeeper :: Stream Storage :: API ......... SKIPPED
2019-09-29T16:33:17.248 [INFO] Apache BookKeeper :: Stream Storage :: Proto ....... SKIPPED
2019-09-29T16:33:17.248 [INFO] Apache BookKeeper :: Stream Storage :: Clients :: Parent SKIPPED
2019-09-29T16:33:17.248 [INFO] Apache BookKeeper :: Stream Storage :: Clients :: Java Client :: Parent SKIPPED
2019-09-29T16:33:17.248 [INFO] Apache BookKeeper :: Stream Storage :: Clients :: Java Client :: Base SKIPPED
2019-09-29T16:33:17.248 [INFO] Apache BookKeeper :: Stream Storage :: Clients :: Java Client :: KV SKIPPED
2019-09-29T16:33:17.248 [INFO] Apache BookKeeper :: Stream Storage :: Clients :: Java Client SKIPPED
2019-09-29T16:33:17.248 [INFO] Apache BookKeeper :: Stream Storage :: Storage :: Parent SKIPPED
2019-09-29T16:33:17.248 [INFO] Apache BookKeeper :: Stream Storage :: Storage :: Api SKIPPED
2019-09-29T16:33:17.248 [INFO] Apache BookKeeper :: Stream Storage :: State Library SKIPPED
2019-09-29T16:33:17.248 [INFO] Apache BookKeeper :: Stream Storage :: Storage :: Impl SKIPPED
2019-09-29T16:33:17.248 [INFO] Apache BookKeeper :: Tools :: Stream ............... SKIPPED
2019-09-29T16:33:17.248 [INFO] Apache BookKeeper :: Tools ......................... SKIPPED
2019-09-29T16:33:17.249 [INFO] Apache BookKeeper :: Tools :: Perf ................. SKIPPED
2019-09-29T16:33:17.249 [INFO] Apache BookKeeper :: Metadata Drivers :: Parent .... SKIPPED
2019-09-29T16:33:17.249 [INFO] Apache BookKeeper :: Metadata Drivers:: Etcd ....... SKIPPED
2019-09-29T16:33:17.249 [INFO] Apache BookKeeper :: Stream Storage :: Server ...... SKIPPED
2019-09-29T16:33:17.249 [INFO] Apache BookKeeper :: Dist (Parent) ................. SKIPPED
2019-09-29T16:33:17.249 [INFO] Apache BookKeeper :: Dist (All) .................... SKIPPED
2019-09-29T16:33:17.249 [INFO] Apache BookKeeper :: Dist (Server) ................. SKIPPED
2019-09-29T16:33:17.249 [INFO] Apache BookKeeper :: Dist (Bkctl) .................. SKIPPED
2019-09-29T16:33:17.249 [INFO] Apache BookKeeper :: Shaded :: Parent .............. SKIPPED
2019-09-29T16:33:17.249 [INFO] Apache BookKeeper :: Shaded :: bookkeeper-server-shaded SKIPPED
2019-09-29T16:33:17.249 [INFO] Apache BookKeeper :: Shaded :: bookkeeper-server-tests-shaded SKIPPED
2019-09-29T16:33:17.249 [INFO] Apache BookKeeper :: Shaded :: distributedlog-core-shaded SKIPPED
2019-09-29T16:33:17.249 [INFO] Apache BookKeeper :: microbenchmarks ............... SKIPPED
2019-09-29T16:33:17.249 [INFO] Apache BookKeeper :: Tests ......................... SKIPPED
2019-09-29T16:33:17.249 [INFO] Apache BookKeeper :: Tests :: Test Shaded Jars ..... SKIPPED
2019-09-29T16:33:17.249 [INFO] Apache BookKeeper :: Tests :: bookkeeper-server-shaded test SKIPPED
2019-09-29T16:33:17.249 [INFO] Apache BookKeeper :: Tests :: bookkeeper-server-tests-shaded test SKIPPED
2019-09-29T16:33:17.249 [INFO] Apache BookKeeper :: Tests :: distributedlog-core-shaded test SKIPPED
2019-09-29T16:33:17.249 [INFO] Apache BookKeeper :: Tests :: Docker Images ........ SKIPPED
2019-09-29T16:33:17.249 [INFO] Apache BookKeeper :: Tests :: Docker Images :: All Released Versions SKIPPED
2019-09-29T16:33:17.249 [INFO] Apache BookKeeper :: Tests :: Docker Images :: All Versions SKIPPED
2019-09-29T16:33:17.249 [INFO] Apache BookKeeper :: Tests :: Docker Images :: Current Version SKIPPED
2019-09-29T16:33:17.249 [INFO] Apache BookKeeper :: Tests :: Utility module for Arquillian based integration tests SKIPPED
2019-09-29T16:33:17.249 [INFO] Apache BookKeeper :: Tests :: Common topologies for Docker based integration tests SKIPPED
2019-09-29T16:33:17.249 [INFO] Apache BookKeeper :: Tests :: Base module for Arquillian based integration tests SKIPPED
2019-09-29T16:33:17.249 [INFO] Apache BookKeeper :: Tests :: Base module for Arquillian based integration tests using groovy SKIPPED
2019-09-29T16:33:17.250 [INFO] Apache BookKeeper :: Tests :: Backward Compatibility SKIPPED
2019-09-29T16:33:17.250 [INFO] Apache BookKeeper :: Tests :: Backward Compatibility :: Test upgrade between all released versions and current version SKIPPED
2019-09-29T16:33:17.250 [INFO] Apache BookKeeper :: Tests :: Backward Compatibility :: Test upgrade between 4.1.0 and current version SKIPPED
2019-09-29T16:33:17.250 [INFO] Apache BookKeeper :: Tests :: Backward Compatibility :: Test compat between old version and new version of hierarchical ledger manager SKIPPED
2019-09-29T16:33:17.250 [INFO] Apache BookKeeper :: Tests :: Backward Compatibility :: Test upgrade between 4.1.0 and current version (with hostname bookie ID) SKIPPED
2019-09-29T16:33:17.250 [INFO] Apache BookKeeper :: Tests :: Backward Compatibility :: Test recovery does not work when password no in metadata SKIPPED
2019-09-29T16:33:17.250 [INFO] Apache BookKeeper :: Tests :: Backward Compatibility :: Test upgrade 4.1.0 to current in cluster with cookies SKIPPED
2019-09-29T16:33:17.250 [INFO] Apache BookKeeper :: Tests :: Backward Compatibility :: Test old clients working on current server SKIPPED
2019-09-29T16:33:17.250 [INFO] Apache BookKeeper :: Tests :: Backward Compatibility :: Test upgrade between yahoo custom version and current SKIPPED
2019-09-29T16:33:17.250 [INFO] Apache BookKeeper :: Tests :: Integration .......... SKIPPED
2019-09-29T16:33:17.250 [INFO] Apache BookKeeper :: Tests :: Integration :: Smoke test SKIPPED
2019-09-29T16:33:17.250 [INFO] Apache BookKeeper :: Tests :: Integration :: Standalone test SKIPPED
2019-09-29T16:33:17.250 [INFO] Apache BookKeeper :: Tests :: Integration :: Cluster test SKIPPED
2019-09-29T16:33:17.250 [INFO] Apache BookKeeper :: Tests :: Bash Scripts Test .... SKIPPED
2019-09-29T16:33:17.250 [INFO] Apache BookKeeper :: Stream Storage :: Common :: BK Grpc Name Resolver SKIPPED
2019-09-29T16:33:17.250 [INFO] ------------------------------------------------------------------------
2019-09-29T16:33:17.250 [INFO] BUILD FAILURE
2019-09-29T16:33:17.250 [INFO] ------------------------------------------------------------------------
2019-09-29T16:33:17.250 [INFO] Total time:  01:23 min
2019-09-29T16:33:17.251 [INFO] Finished at: 2019-09-29T16:33:17Z
2019-09-29T16:33:17.251 [INFO] ------------------------------------------------------------------------
Waiting for Jenkins to finish collecting data
2019-09-29T16:33:18.280 [ERROR] unable to create new native thread -> [Help 1]
2019-09-29T16:33:18.280 [ERROR] 
2019-09-29T16:33:18.280 [ERROR] To see the full stack trace of the errors, re-run Maven with the -e switch.
2019-09-29T16:33:18.281 [ERROR] Re-run Maven using the -X switch to enable full debug logging.
2019-09-29T16:33:18.281 [ERROR] 
2019-09-29T16:33:18.281 [ERROR] For more information about the errors and possible solutions, please read the following articles:
2019-09-29T16:33:18.281 [ERROR] [Help 1] http://cwiki.apache.org/confluence/display/MAVEN/OutOfMemoryError
channel stopped
Not sending mail to unregistered user noreply@github.com

Build failed in Jenkins: bookkeeper_postcommit_validation_master #482

Posted by Apache Jenkins Server <je...@builds.apache.org>.
See <https://builds.apache.org/job/bookkeeper_postcommit_validation_master/482/display/redirect>

------------------------------------------
Started by timer
[EnvInject] - Loading node environment variables.
Building remotely on H41 (ubuntu xenial) in workspace <https://builds.apache.org/job/bookkeeper_postcommit_validation_master/ws/>
[WS-CLEANUP] Deleting project workspace...
[WS-CLEANUP] Deferred wipeout is used...
[WS-CLEANUP] Done
No credentials specified
Cloning the remote Git repository
Cloning repository https://github.com/apache/bookkeeper.git
 > git init <https://builds.apache.org/job/bookkeeper_postcommit_validation_master/ws/> # timeout=10
ERROR: Error cloning remote repo 'origin'
hudson.plugins.git.GitException: Could not init <https://builds.apache.org/job/bookkeeper_postcommit_validation_master/ws/>
	at org.jenkinsci.plugins.gitclient.CliGitAPIImpl$5.execute(CliGitAPIImpl.java:813)
	at org.jenkinsci.plugins.gitclient.CliGitAPIImpl$2.execute(CliGitAPIImpl.java:605)
	at org.jenkinsci.plugins.gitclient.RemoteGitImpl$CommandInvocationHandler$1.call(RemoteGitImpl.java:153)
	at org.jenkinsci.plugins.gitclient.RemoteGitImpl$CommandInvocationHandler$1.call(RemoteGitImpl.java:146)
	at hudson.remoting.UserRequest.perform(UserRequest.java:212)
	at hudson.remoting.UserRequest.perform(UserRequest.java:54)
	at hudson.remoting.Request$2.run(Request.java:369)
	at hudson.remoting.InterceptingExecutorService$1.call(InterceptingExecutorService.java:72)
	at java.util.concurrent.FutureTask.run(FutureTask.java:266)
	at java.util.concurrent.ThreadPoolExecutor.runWorker(ThreadPoolExecutor.java:1142)
	at java.util.concurrent.ThreadPoolExecutor$Worker.run(ThreadPoolExecutor.java:617)
	at java.lang.Thread.run(Thread.java:748)
	Suppressed: hudson.remoting.Channel$CallSiteStackTrace: Remote call to H41
		at hudson.remoting.Channel.attachCallSiteStackTrace(Channel.java:1741)
		at hudson.remoting.UserRequest$ExceptionResponse.retrieve(UserRequest.java:357)
		at hudson.remoting.Channel.call(Channel.java:955)
		at org.jenkinsci.plugins.gitclient.RemoteGitImpl$CommandInvocationHandler.execute(RemoteGitImpl.java:146)
		at sun.reflect.GeneratedMethodAccessor1084.invoke(Unknown Source)
		at sun.reflect.DelegatingMethodAccessorImpl.invoke(DelegatingMethodAccessorImpl.java:43)
		at java.lang.reflect.Method.invoke(Method.java:498)
		at org.jenkinsci.plugins.gitclient.RemoteGitImpl$CommandInvocationHandler.invoke(RemoteGitImpl.java:132)
		at com.sun.proxy.$Proxy135.execute(Unknown Source)
		at hudson.plugins.git.GitSCM.retrieveChanges(GitSCM.java:1152)
		at hudson.plugins.git.GitSCM.checkout(GitSCM.java:1192)
		at hudson.scm.SCM.checkout(SCM.java:504)
		at hudson.model.AbstractProject.checkout(AbstractProject.java:1208)
		at hudson.model.AbstractBuild$AbstractBuildExecution.defaultCheckout(AbstractBuild.java:574)
		at jenkins.scm.SCMCheckoutStrategy.checkout(SCMCheckoutStrategy.java:86)
		at hudson.model.AbstractBuild$AbstractBuildExecution.run(AbstractBuild.java:499)
		at hudson.model.Run.execute(Run.java:1810)
		at hudson.maven.MavenModuleSetBuild.run(MavenModuleSetBuild.java:543)
		at hudson.model.ResourceController.execute(ResourceController.java:97)
		at hudson.model.Executor.run(Executor.java:429)
Caused by: hudson.plugins.git.GitException: Error performing git command
	at org.jenkinsci.plugins.gitclient.CliGitAPIImpl.launchCommandIn(CliGitAPIImpl.java:2051)
	at org.jenkinsci.plugins.gitclient.CliGitAPIImpl.launchCommandIn(CliGitAPIImpl.java:2010)
	at org.jenkinsci.plugins.gitclient.CliGitAPIImpl.launchCommandIn(CliGitAPIImpl.java:2006)
	at org.jenkinsci.plugins.gitclient.CliGitAPIImpl.launchCommand(CliGitAPIImpl.java:1638)
	at org.jenkinsci.plugins.gitclient.CliGitAPIImpl$5.execute(CliGitAPIImpl.java:811)
	... 11 more
Caused by: java.lang.OutOfMemoryError: unable to create new native thread
	at java.lang.Thread.start0(Native Method)
	at java.lang.Thread.start(Thread.java:717)
	at hudson.Proc$LocalProc.<init>(Proc.java:281)
	at hudson.Proc$LocalProc.<init>(Proc.java:218)
	at hudson.Launcher$LocalLauncher.launch(Launcher.java:936)
	at hudson.Launcher$ProcStarter.start(Launcher.java:455)
	at org.jenkinsci.plugins.gitclient.CliGitAPIImpl.launchCommandIn(CliGitAPIImpl.java:2038)
	... 15 more
ERROR: Error cloning remote repo 'origin'
Retrying after 10 seconds
No credentials specified
 > git rev-parse --is-inside-work-tree # timeout=10
ERROR: Workspace has a .git repository, but it appears to be corrupt.
hudson.plugins.git.GitException: Error performing git command
	at org.jenkinsci.plugins.gitclient.CliGitAPIImpl.launchCommandIn(CliGitAPIImpl.java:2051)
	at org.jenkinsci.plugins.gitclient.CliGitAPIImpl.launchCommandIn(CliGitAPIImpl.java:2010)
	at org.jenkinsci.plugins.gitclient.CliGitAPIImpl.launchCommandIn(CliGitAPIImpl.java:2006)
	at org.jenkinsci.plugins.gitclient.CliGitAPIImpl.launchCommand(CliGitAPIImpl.java:1638)
	at org.jenkinsci.plugins.gitclient.CliGitAPIImpl.launchCommand(CliGitAPIImpl.java:1650)
	at org.jenkinsci.plugins.gitclient.CliGitAPIImpl.hasGitRepo(CliGitAPIImpl.java:300)
	at hudson.plugins.git.GitAPI.hasGitRepo(GitAPI.java:232)
	at sun.reflect.GeneratedMethodAccessor57.invoke(Unknown Source)
	at sun.reflect.DelegatingMethodAccessorImpl.invoke(DelegatingMethodAccessorImpl.java:43)
	at java.lang.reflect.Method.invoke(Method.java:498)
	at hudson.remoting.RemoteInvocationHandler$RPCRequest.perform(RemoteInvocationHandler.java:929)
	at hudson.remoting.RemoteInvocationHandler$RPCRequest.call(RemoteInvocationHandler.java:903)
	at hudson.remoting.RemoteInvocationHandler$RPCRequest.call(RemoteInvocationHandler.java:855)
	at hudson.remoting.UserRequest.perform(UserRequest.java:212)
	at hudson.remoting.UserRequest.perform(UserRequest.java:54)
	at hudson.remoting.Request$2.run(Request.java:369)
	at hudson.remoting.InterceptingExecutorService$1.call(InterceptingExecutorService.java:72)
	at java.util.concurrent.FutureTask.run(FutureTask.java:266)
	at java.util.concurrent.ThreadPoolExecutor.runWorker(ThreadPoolExecutor.java:1142)
	at java.util.concurrent.ThreadPoolExecutor$Worker.run(ThreadPoolExecutor.java:617)
	at java.lang.Thread.run(Thread.java:748)
Caused by: java.lang.OutOfMemoryError: unable to create new native thread
	at java.lang.Thread.start0(Native Method)
	at java.lang.Thread.start(Thread.java:717)
	at hudson.Proc$LocalProc.<init>(Proc.java:281)
	at hudson.Proc$LocalProc.<init>(Proc.java:218)
	at hudson.Launcher$LocalLauncher.launch(Launcher.java:936)
	at hudson.Launcher$ProcStarter.start(Launcher.java:455)
	at org.jenkinsci.plugins.gitclient.CliGitAPIImpl.launchCommandIn(CliGitAPIImpl.java:2038)
	... 20 more
Cloning the remote Git repository
Cloning repository https://github.com/apache/bookkeeper.git
 > git init <https://builds.apache.org/job/bookkeeper_postcommit_validation_master/ws/> # timeout=10
ERROR: Error cloning remote repo 'origin'
hudson.plugins.git.GitException: Could not init <https://builds.apache.org/job/bookkeeper_postcommit_validation_master/ws/>
	at org.jenkinsci.plugins.gitclient.CliGitAPIImpl$5.execute(CliGitAPIImpl.java:813)
	at org.jenkinsci.plugins.gitclient.CliGitAPIImpl$2.execute(CliGitAPIImpl.java:605)
	at org.jenkinsci.plugins.gitclient.RemoteGitImpl$CommandInvocationHandler$1.call(RemoteGitImpl.java:153)
	at org.jenkinsci.plugins.gitclient.RemoteGitImpl$CommandInvocationHandler$1.call(RemoteGitImpl.java:146)
	at hudson.remoting.UserRequest.perform(UserRequest.java:212)
	at hudson.remoting.UserRequest.perform(UserRequest.java:54)
	at hudson.remoting.Request$2.run(Request.java:369)
	at hudson.remoting.InterceptingExecutorService$1.call(InterceptingExecutorService.java:72)
	at java.util.concurrent.FutureTask.run(FutureTask.java:266)
	at java.util.concurrent.ThreadPoolExecutor.runWorker(ThreadPoolExecutor.java:1142)
	at java.util.concurrent.ThreadPoolExecutor$Worker.run(ThreadPoolExecutor.java:617)
	at java.lang.Thread.run(Thread.java:748)
	Suppressed: hudson.remoting.Channel$CallSiteStackTrace: Remote call to H41
		at hudson.remoting.Channel.attachCallSiteStackTrace(Channel.java:1741)
		at hudson.remoting.UserRequest$ExceptionResponse.retrieve(UserRequest.java:357)
		at hudson.remoting.Channel.call(Channel.java:955)
		at org.jenkinsci.plugins.gitclient.RemoteGitImpl$CommandInvocationHandler.execute(RemoteGitImpl.java:146)
		at sun.reflect.GeneratedMethodAccessor1084.invoke(Unknown Source)
		at sun.reflect.DelegatingMethodAccessorImpl.invoke(DelegatingMethodAccessorImpl.java:43)
		at java.lang.reflect.Method.invoke(Method.java:498)
		at org.jenkinsci.plugins.gitclient.RemoteGitImpl$CommandInvocationHandler.invoke(RemoteGitImpl.java:132)
		at com.sun.proxy.$Proxy135.execute(Unknown Source)
		at hudson.plugins.git.GitSCM.retrieveChanges(GitSCM.java:1152)
		at hudson.plugins.git.GitSCM.checkout(GitSCM.java:1192)
		at hudson.scm.SCM.checkout(SCM.java:504)
		at hudson.model.AbstractProject.checkout(AbstractProject.java:1208)
		at hudson.model.AbstractBuild$AbstractBuildExecution.defaultCheckout(AbstractBuild.java:574)
		at jenkins.scm.SCMCheckoutStrategy.checkout(SCMCheckoutStrategy.java:86)
		at hudson.model.AbstractBuild$AbstractBuildExecution.run(AbstractBuild.java:499)
		at hudson.model.Run.execute(Run.java:1810)
		at hudson.maven.MavenModuleSetBuild.run(MavenModuleSetBuild.java:543)
		at hudson.model.ResourceController.execute(ResourceController.java:97)
		at hudson.model.Executor.run(Executor.java:429)
Caused by: hudson.plugins.git.GitException: Error performing git command
	at org.jenkinsci.plugins.gitclient.CliGitAPIImpl.launchCommandIn(CliGitAPIImpl.java:2051)
	at org.jenkinsci.plugins.gitclient.CliGitAPIImpl.launchCommandIn(CliGitAPIImpl.java:2010)
	at org.jenkinsci.plugins.gitclient.CliGitAPIImpl.launchCommandIn(CliGitAPIImpl.java:2006)
	at org.jenkinsci.plugins.gitclient.CliGitAPIImpl.launchCommand(CliGitAPIImpl.java:1638)
	at org.jenkinsci.plugins.gitclient.CliGitAPIImpl$5.execute(CliGitAPIImpl.java:811)
	... 11 more
Caused by: java.lang.OutOfMemoryError: unable to create new native thread
	at java.lang.Thread.start0(Native Method)
	at java.lang.Thread.start(Thread.java:717)
	at hudson.Proc$LocalProc.<init>(Proc.java:281)
	at hudson.Proc$LocalProc.<init>(Proc.java:218)
	at hudson.Launcher$LocalLauncher.launch(Launcher.java:936)
	at hudson.Launcher$ProcStarter.start(Launcher.java:455)
	at org.jenkinsci.plugins.gitclient.CliGitAPIImpl.launchCommandIn(CliGitAPIImpl.java:2038)
	... 15 more
ERROR: Error cloning remote repo 'origin'
Retrying after 10 seconds
No credentials specified
 > git rev-parse --is-inside-work-tree # timeout=10
ERROR: Workspace has a .git repository, but it appears to be corrupt.
hudson.plugins.git.GitException: Error performing git command
	at org.jenkinsci.plugins.gitclient.CliGitAPIImpl.launchCommandIn(CliGitAPIImpl.java:2051)
	at org.jenkinsci.plugins.gitclient.CliGitAPIImpl.launchCommandIn(CliGitAPIImpl.java:2010)
	at org.jenkinsci.plugins.gitclient.CliGitAPIImpl.launchCommandIn(CliGitAPIImpl.java:2006)
	at org.jenkinsci.plugins.gitclient.CliGitAPIImpl.launchCommand(CliGitAPIImpl.java:1638)
	at org.jenkinsci.plugins.gitclient.CliGitAPIImpl.launchCommand(CliGitAPIImpl.java:1650)
	at org.jenkinsci.plugins.gitclient.CliGitAPIImpl.hasGitRepo(CliGitAPIImpl.java:300)
	at hudson.plugins.git.GitAPI.hasGitRepo(GitAPI.java:232)
	at sun.reflect.GeneratedMethodAccessor57.invoke(Unknown Source)
	at sun.reflect.DelegatingMethodAccessorImpl.invoke(DelegatingMethodAccessorImpl.java:43)
	at java.lang.reflect.Method.invoke(Method.java:498)
	at hudson.remoting.RemoteInvocationHandler$RPCRequest.perform(RemoteInvocationHandler.java:929)
	at hudson.remoting.RemoteInvocationHandler$RPCRequest.call(RemoteInvocationHandler.java:903)
	at hudson.remoting.RemoteInvocationHandler$RPCRequest.call(RemoteInvocationHandler.java:855)
	at hudson.remoting.UserRequest.perform(UserRequest.java:212)
	at hudson.remoting.UserRequest.perform(UserRequest.java:54)
	at hudson.remoting.Request$2.run(Request.java:369)
	at hudson.remoting.InterceptingExecutorService$1.call(InterceptingExecutorService.java:72)
	at java.util.concurrent.FutureTask.run(FutureTask.java:266)
	at java.util.concurrent.ThreadPoolExecutor.runWorker(ThreadPoolExecutor.java:1142)
	at java.util.concurrent.ThreadPoolExecutor$Worker.run(ThreadPoolExecutor.java:617)
	at java.lang.Thread.run(Thread.java:748)
Caused by: java.lang.OutOfMemoryError: unable to create new native thread
	at java.lang.Thread.start0(Native Method)
	at java.lang.Thread.start(Thread.java:717)
	at hudson.Proc$LocalProc.<init>(Proc.java:281)
	at hudson.Proc$LocalProc.<init>(Proc.java:218)
	at hudson.Launcher$LocalLauncher.launch(Launcher.java:936)
	at hudson.Launcher$ProcStarter.start(Launcher.java:455)
	at org.jenkinsci.plugins.gitclient.CliGitAPIImpl.launchCommandIn(CliGitAPIImpl.java:2038)
	... 20 more
Cloning the remote Git repository
Cloning repository https://github.com/apache/bookkeeper.git
 > git init <https://builds.apache.org/job/bookkeeper_postcommit_validation_master/ws/> # timeout=10
ERROR: Error cloning remote repo 'origin'
hudson.plugins.git.GitException: Could not init <https://builds.apache.org/job/bookkeeper_postcommit_validation_master/ws/>
	at org.jenkinsci.plugins.gitclient.CliGitAPIImpl$5.execute(CliGitAPIImpl.java:813)
	at org.jenkinsci.plugins.gitclient.CliGitAPIImpl$2.execute(CliGitAPIImpl.java:605)
	at org.jenkinsci.plugins.gitclient.RemoteGitImpl$CommandInvocationHandler$1.call(RemoteGitImpl.java:153)
	at org.jenkinsci.plugins.gitclient.RemoteGitImpl$CommandInvocationHandler$1.call(RemoteGitImpl.java:146)
	at hudson.remoting.UserRequest.perform(UserRequest.java:212)
	at hudson.remoting.UserRequest.perform(UserRequest.java:54)
	at hudson.remoting.Request$2.run(Request.java:369)
	at hudson.remoting.InterceptingExecutorService$1.call(InterceptingExecutorService.java:72)
	at java.util.concurrent.FutureTask.run(FutureTask.java:266)
	at java.util.concurrent.ThreadPoolExecutor.runWorker(ThreadPoolExecutor.java:1142)
	at java.util.concurrent.ThreadPoolExecutor$Worker.run(ThreadPoolExecutor.java:617)
	at java.lang.Thread.run(Thread.java:748)
	Suppressed: hudson.remoting.Channel$CallSiteStackTrace: Remote call to H41
		at hudson.remoting.Channel.attachCallSiteStackTrace(Channel.java:1741)
		at hudson.remoting.UserRequest$ExceptionResponse.retrieve(UserRequest.java:357)
		at hudson.remoting.Channel.call(Channel.java:955)
		at org.jenkinsci.plugins.gitclient.RemoteGitImpl$CommandInvocationHandler.execute(RemoteGitImpl.java:146)
		at sun.reflect.GeneratedMethodAccessor1084.invoke(Unknown Source)
		at sun.reflect.DelegatingMethodAccessorImpl.invoke(DelegatingMethodAccessorImpl.java:43)
		at java.lang.reflect.Method.invoke(Method.java:498)
		at org.jenkinsci.plugins.gitclient.RemoteGitImpl$CommandInvocationHandler.invoke(RemoteGitImpl.java:132)
		at com.sun.proxy.$Proxy135.execute(Unknown Source)
		at hudson.plugins.git.GitSCM.retrieveChanges(GitSCM.java:1152)
		at hudson.plugins.git.GitSCM.checkout(GitSCM.java:1192)
		at hudson.scm.SCM.checkout(SCM.java:504)
		at hudson.model.AbstractProject.checkout(AbstractProject.java:1208)
		at hudson.model.AbstractBuild$AbstractBuildExecution.defaultCheckout(AbstractBuild.java:574)
		at jenkins.scm.SCMCheckoutStrategy.checkout(SCMCheckoutStrategy.java:86)
		at hudson.model.AbstractBuild$AbstractBuildExecution.run(AbstractBuild.java:499)
		at hudson.model.Run.execute(Run.java:1810)
		at hudson.maven.MavenModuleSetBuild.run(MavenModuleSetBuild.java:543)
		at hudson.model.ResourceController.execute(ResourceController.java:97)
		at hudson.model.Executor.run(Executor.java:429)
Caused by: hudson.plugins.git.GitException: Error performing git command
	at org.jenkinsci.plugins.gitclient.CliGitAPIImpl.launchCommandIn(CliGitAPIImpl.java:2051)
	at org.jenkinsci.plugins.gitclient.CliGitAPIImpl.launchCommandIn(CliGitAPIImpl.java:2010)
	at org.jenkinsci.plugins.gitclient.CliGitAPIImpl.launchCommandIn(CliGitAPIImpl.java:2006)
	at org.jenkinsci.plugins.gitclient.CliGitAPIImpl.launchCommand(CliGitAPIImpl.java:1638)
	at org.jenkinsci.plugins.gitclient.CliGitAPIImpl$5.execute(CliGitAPIImpl.java:811)
	... 11 more
Caused by: java.lang.OutOfMemoryError: unable to create new native thread
	at java.lang.Thread.start0(Native Method)
	at java.lang.Thread.start(Thread.java:717)
	at hudson.Proc$LocalProc.<init>(Proc.java:281)
	at hudson.Proc$LocalProc.<init>(Proc.java:218)
	at hudson.Launcher$LocalLauncher.launch(Launcher.java:936)
	at hudson.Launcher$ProcStarter.start(Launcher.java:455)
	at org.jenkinsci.plugins.gitclient.CliGitAPIImpl.launchCommandIn(CliGitAPIImpl.java:2038)
	... 15 more
ERROR: Error cloning remote repo 'origin'
Not sending mail to unregistered user noreply@github.com