You are viewing a plain text version of this content. The canonical link for it is here.
Posted to oak-dev@jackrabbit.apache.org by Apache Jenkins Server <je...@builds.apache.org> on 2017/11/27 17:49:36 UTC

BUILD FAILURE: Jackrabbit Oak - Build # 1017 - Failure

The Apache Jenkins build system has built Jackrabbit Oak (build #1017)

Status: Failure

Check console output at https://builds.apache.org/job/Jackrabbit%20Oak/1017/ to view the results.

Changes:
[frm] OAK-7004 - The server command should not silently upgrade the FileStore

[mduerig] OAK-6984: High read IO in compaction retry cycles
Adding checkpointing capabilities to SCIT

 

Test results:
1 tests failed.
FAILED:  org.apache.jackrabbit.oak.plugins.document.DocumentLeaseUpdateRetryTest.testLeaseRetryLoopWithDelay

Error Message:
null

Stack Trace:
java.lang.AssertionError
	at org.apache.jackrabbit.oak.plugins.document.DocumentLeaseUpdateRetryTest.internalTestLeaseRetryLoop(DocumentLeaseUpdateRetryTest.java:87)
	at org.apache.jackrabbit.oak.plugins.document.DocumentLeaseUpdateRetryTest.testLeaseRetryLoopWithDelay(DocumentLeaseUpdateRetryTest.java:61)