You are viewing a plain text version of this content. The canonical link for it is here.
Posted to yarn-dev@hadoop.apache.org by Apache Jenkins Server <je...@builds.apache.org> on 2015/08/16 03:17:53 UTC
Failed: YARN-3045 PreCommit Build #8852
Jira: https://issues.apache.org/jira/browse/YARN-3045
Build: https://builds.apache.org/job/PreCommit-YARN-Build/8852/
###################################################################################
########################## LAST 60 LINES OF THE CONSOLE ###########################
[...truncated 412 lines...]
| +1 | eclipse:eclipse | 0m 40s | The patch built with
| | | | eclipse:eclipse.
| +1 | findbugs | 2m 47s | The patch does not introduce any
| | | | new Findbugs (version 3.0.0)
| | | | warnings.
| +1 | yarn tests | 8m 12s | Tests passed in
| | | | hadoop-yarn-applications-distributeds
| | | | hell.
| +1 | yarn tests | 6m 19s | Tests passed in
| | | | hadoop-yarn-server-nodemanager.
| +1 | yarn tests | 1m 24s | Tests passed in
| | | | hadoop-yarn-server-timelineservice.
| | | 57m 26s |
|| Subsystem || Report/Notes ||
============================================================================
| Patch URL | http://issues.apache.org/jira/secure/attachment/12750681/YARN-3045-YARN-2928.011.patch |
| Optional Tests | javac unit findbugs checkstyle javadoc |
| git revision | YARN-2928 / f40c735 |
| javac | /home/jenkins/jenkins-slave/workspace/PreCommit-YARN-Build/patchprocess/diffJavacWarnings.txt |
| hadoop-yarn-applications-distributedshell test log | /home/jenkins/jenkins-slave/workspace/PreCommit-YARN-Build/patchprocess/testrun_hadoop-yarn-applications-distributedshell.txt |
| hadoop-yarn-server-nodemanager test log | /home/jenkins/jenkins-slave/workspace/PreCommit-YARN-Build/patchprocess/testrun_hadoop-yarn-server-nodemanager.txt |
| hadoop-yarn-server-timelineservice test log | /home/jenkins/jenkins-slave/workspace/PreCommit-YARN-Build/patchprocess/testrun_hadoop-yarn-server-timelineservice.txt |
| Test Results | https://builds.apache.org/job/PreCommit-YARN-Build/8852/testReport/ |
| Java | 1.7.0_55 |
| uname | Linux asf906.gq1.ygridcore.net 3.13.0-36-lowlatency #63-Ubuntu SMP PREEMPT Wed Sep 3 21:56:12 UTC 2014 x86_64 x86_64 x86_64 GNU/Linux |
============================================================================
============================================================================
Adding comment to JIRA
============================================================================
============================================================================
Comment added.
6d3db36313558e5cac88bcfc9fb86a7f730fcde9 logged out
============================================================================
============================================================================
Finished build.
============================================================================
============================================================================
Build step 'Execute shell' marked build as failure
Archiving artifacts
Sending artifact delta relative to PreCommit-YARN-Build #8849
Archived 52 artifacts
Archive block size is 32768
Received 168 blocks and 5405538 bytes
Compression is 50.5%
Took 1.7 sec
Description set: MAPREDUCE-6439
Recording test results
Email was triggered for: Failure
Sending email for trigger: Failure
###################################################################################
############################## FAILED TESTS (if any) ##############################
All tests passed
Failed: YARN-4014 PreCommit Build #8862
Posted by Apache Jenkins Server <je...@builds.apache.org>.
Jira: https://issues.apache.org/jira/browse/YARN-4014
Build: https://builds.apache.org/job/PreCommit-YARN-Build/8862/
###################################################################################
########################## LAST 60 LINES OF THE CONSOLE ###########################
[...truncated 441 lines...]
| +1 | yarn tests | 6m 56s | Tests passed in hadoop-yarn-client.
| -1 | yarn tests | 2m 0s | Tests failed in hadoop-yarn-common.
| -1 | yarn tests | 53m 11s | Tests failed in
| | | | hadoop-yarn-server-resourcemanager.
| | | 220m 12s |
Reason | Tests
Failed unit tests | hadoop.yarn.util.TestRackResolver
| hadoop.yarn.server.resourcemanager.scheduler.capacity.TestContainerAllocation
|| Subsystem || Report/Notes ||
============================================================================
| Patch URL | http://issues.apache.org/jira/secure/attachment/12750823/0002-YARN-4014.patch |
| Optional Tests | javadoc javac unit findbugs checkstyle |
| git revision | trunk / 13604bd |
| javadoc | /home/jenkins/jenkins-slave/workspace/PreCommit-YARN-Build/patchprocess/diffJavadocWarnings.txt |
| checkstyle | /home/jenkins/jenkins-slave/workspace/PreCommit-YARN-Build/patchprocess/diffcheckstylehadoop-yarn-api.txt |
| hadoop-mapreduce-client-jobclient test log | /home/jenkins/jenkins-slave/workspace/PreCommit-YARN-Build/patchprocess/testrun_hadoop-mapreduce-client-jobclient.txt |
| hadoop-yarn-api test log | /home/jenkins/jenkins-slave/workspace/PreCommit-YARN-Build/patchprocess/testrun_hadoop-yarn-api.txt |
| hadoop-yarn-client test log | /home/jenkins/jenkins-slave/workspace/PreCommit-YARN-Build/patchprocess/testrun_hadoop-yarn-client.txt |
| hadoop-yarn-common test log | /home/jenkins/jenkins-slave/workspace/PreCommit-YARN-Build/patchprocess/testrun_hadoop-yarn-common.txt |
| hadoop-yarn-server-resourcemanager test log | /home/jenkins/jenkins-slave/workspace/PreCommit-YARN-Build/patchprocess/testrun_hadoop-yarn-server-resourcemanager.txt |
| Test Results | https://builds.apache.org/job/PreCommit-YARN-Build/8862/testReport/ |
| Java | 1.7.0_55 |
| uname | Linux asf907.gq1.ygridcore.net 3.13.0-36-lowlatency #63-Ubuntu SMP PREEMPT Wed Sep 3 21:56:12 UTC 2014 x86_64 x86_64 x86_64 GNU/Linux |
============================================================================
============================================================================
Adding comment to JIRA
============================================================================
============================================================================
Comment added.
cb47df7905e4a4bc87294aafd272d3b8dd08178f logged out
============================================================================
============================================================================
Finished build.
============================================================================
============================================================================
Build step 'Execute shell' marked build as failure
Archiving artifacts
Sending artifact delta relative to PreCommit-YARN-Build #8849
Archived 87 artifacts
Archive block size is 32768
Received 35 blocks and 31227737 bytes
Compression is 3.5%
Took 6.5 sec
[description-setter] Could not determine description.
Recording test results
Email was triggered for: Failure
Sending email for trigger: Failure
###################################################################################
############################## FAILED TESTS (if any) ##############################
3 tests failed.
FAILED: org.apache.hadoop.yarn.util.TestRackResolver.testCaching
Error Message:
expected:</[default-rack]> but was:</[rack1]>
Stack Trace:
org.junit.ComparisonFailure: expected:</[default-rack]> but was:</[rack1]>
at org.junit.Assert.assertEquals(Assert.java:115)
at org.junit.Assert.assertEquals(Assert.java:144)
at org.apache.hadoop.yarn.util.TestRackResolver.testCaching(TestRackResolver.java:102)
FAILED: org.apache.hadoop.yarn.server.resourcemanager.scheduler.capacity.TestContainerAllocation.testAMContainerAllocationWhenDNSUnavailable
Error Message:
expected:<SCHEDULED> but was:<ALLOCATED>
Stack Trace:
java.lang.AssertionError: expected:<SCHEDULED> but was:<ALLOCATED>
at org.junit.Assert.fail(Assert.java:88)
at org.junit.Assert.failNotEquals(Assert.java:743)
at org.junit.Assert.assertEquals(Assert.java:118)
at org.junit.Assert.assertEquals(Assert.java:144)
at org.apache.hadoop.yarn.server.resourcemanager.scheduler.capacity.TestContainerAllocation.testAMContainerAllocationWhenDNSUnavailable(TestContainerAllocation.java:321)
FAILED: org.apache.hadoop.yarn.server.resourcemanager.scheduler.capacity.TestContainerAllocation.testNormalContainerAllocationWhenDNSUnavailable
Error Message:
expected:<0> but was:<1>
Stack Trace:
java.lang.AssertionError: expected:<0> but was:<1>
at org.junit.Assert.fail(Assert.java:88)
at org.junit.Assert.failNotEquals(Assert.java:743)
at org.junit.Assert.assertEquals(Assert.java:118)
at org.junit.Assert.assertEquals(Assert.java:555)
at org.junit.Assert.assertEquals(Assert.java:542)
at org.apache.hadoop.yarn.server.resourcemanager.scheduler.capacity.TestContainerAllocation.testNormalContainerAllocationWhenDNSUnavailable(TestContainerAllocation.java:206)
Failed: YARN-4024 PreCommit Build #8861
Posted by Apache Jenkins Server <je...@builds.apache.org>.
Jira: https://issues.apache.org/jira/browse/YARN-4024
Build: https://builds.apache.org/job/PreCommit-YARN-Build/8861/
###################################################################################
########################## LAST 60 LINES OF THE CONSOLE ###########################
[...truncated 310 lines...]
| | | | new Findbugs (version 3.0.0)
| | | | warnings.
| -1 | yarn tests | 0m 19s | Tests failed in hadoop-yarn-api.
| -1 | yarn tests | 52m 58s | Tests failed in
| | | | hadoop-yarn-server-resourcemanager.
| | | 95m 12s |
Reason | Tests
FindBugs | module:hadoop-yarn-server-resourcemanager
Failed unit tests | hadoop.yarn.conf.TestYarnConfigurationFields
| hadoop.yarn.server.resourcemanager.scheduler.capacity.TestContainerAllocation
| hadoop.yarn.server.resourcemanager.rmapp.TestNodesListManager
|| Subsystem || Report/Notes ||
============================================================================
| Patch URL | http://issues.apache.org/jira/secure/attachment/12750780/YARN-4024-draft.patch |
| Optional Tests | javadoc javac unit findbugs checkstyle |
| git revision | trunk / 13604bd |
| checkstyle | /home/jenkins/jenkins-slave/workspace/PreCommit-YARN-Build/patchprocess/diffcheckstylehadoop-yarn-api.txt |
| Findbugs warnings | /home/jenkins/jenkins-slave/workspace/PreCommit-YARN-Build/patchprocess/newPatchFindbugsWarningshadoop-yarn-server-resourcemanager.html |
| hadoop-yarn-api test log | /home/jenkins/jenkins-slave/workspace/PreCommit-YARN-Build/patchprocess/testrun_hadoop-yarn-api.txt |
| hadoop-yarn-server-resourcemanager test log | /home/jenkins/jenkins-slave/workspace/PreCommit-YARN-Build/patchprocess/testrun_hadoop-yarn-server-resourcemanager.txt |
| Test Results | https://builds.apache.org/job/PreCommit-YARN-Build/8861/testReport/ |
| Java | 1.7.0_55 |
| uname | Linux asf907.gq1.ygridcore.net 3.13.0-36-lowlatency #63-Ubuntu SMP PREEMPT Wed Sep 3 21:56:12 UTC 2014 x86_64 x86_64 x86_64 GNU/Linux |
============================================================================
============================================================================
Adding comment to JIRA
============================================================================
============================================================================
Comment added.
ad2a9c60a2bd96d0680717f892ff43a2bfb7ec59 logged out
============================================================================
============================================================================
Finished build.
============================================================================
============================================================================
Build step 'Execute shell' marked build as failure
Archiving artifacts
Sending artifact delta relative to PreCommit-YARN-Build #8849
Archived 44 artifacts
Archive block size is 32768
Received 42 blocks and 28508648 bytes
Compression is 4.6%
Took 5.9 sec
[description-setter] Could not determine description.
Recording test results
Email was triggered for: Failure
Sending email for trigger: Failure
###################################################################################
############################## FAILED TESTS (if any) ##############################
4 tests failed.
FAILED: org.apache.hadoop.yarn.conf.TestYarnConfigurationFields.testCompareConfigurationClassAgainstXml
Error Message:
class org.apache.hadoop.yarn.conf.YarnConfiguration has 1 variables missing in yarn-default.xml
Stack Trace:
java.lang.AssertionError: class org.apache.hadoop.yarn.conf.YarnConfiguration has 1 variables missing in yarn-default.xml
at org.junit.Assert.fail(Assert.java:88)
at org.junit.Assert.assertTrue(Assert.java:41)
at org.apache.hadoop.conf.TestConfigurationFieldsBase.testCompareConfigurationClassAgainstXml(TestConfigurationFieldsBase.java:429)
at sun.reflect.NativeMethodAccessorImpl.invoke0(Native Method)
at sun.reflect.NativeMethodAccessorImpl.invoke(NativeMethodAccessorImpl.java:57)
at sun.reflect.DelegatingMethodAccessorImpl.invoke(DelegatingMethodAccessorImpl.java:43)
at java.lang.reflect.Method.invoke(Method.java:606)
at org.junit.runners.model.FrameworkMethod$1.runReflectiveCall(FrameworkMethod.java:47)
at org.junit.internal.runners.model.ReflectiveCallable.run(ReflectiveCallable.java:12)
at org.junit.runners.model.FrameworkMethod.invokeExplosively(FrameworkMethod.java:44)
at org.junit.internal.runners.statements.InvokeMethod.evaluate(InvokeMethod.java:17)
at org.junit.internal.runners.statements.RunBefores.evaluate(RunBefores.java:26)
at org.junit.runners.ParentRunner.runLeaf(ParentRunner.java:271)
at org.junit.runners.BlockJUnit4ClassRunner.runChild(BlockJUnit4ClassRunner.java:70)
at org.junit.runners.BlockJUnit4ClassRunner.runChild(BlockJUnit4ClassRunner.java:50)
at org.junit.runners.ParentRunner$3.run(ParentRunner.java:238)
at org.junit.runners.ParentRunner$1.schedule(ParentRunner.java:63)
at org.junit.runners.ParentRunner.runChildren(ParentRunner.java:236)
at org.junit.runners.ParentRunner.access$000(ParentRunner.java:53)
at org.junit.runners.ParentRunner$2.evaluate(ParentRunner.java:229)
at org.junit.runners.ParentRunner.run(ParentRunner.java:309)
at org.apache.maven.surefire.junit4.JUnit4Provider.execute(JUnit4Provider.java:264)
at org.apache.maven.surefire.junit4.JUnit4Provider.executeTestSet(JUnit4Provider.java:153)
at org.apache.maven.surefire.junit4.JUnit4Provider.invoke(JUnit4Provider.java:124)
at org.apache.maven.surefire.booter.ForkedBooter.invokeProviderInSameClassLoader(ForkedBooter.java:200)
at org.apache.maven.surefire.booter.ForkedBooter.runSuitesInProcess(ForkedBooter.java:153)
at org.apache.maven.surefire.booter.ForkedBooter.main(ForkedBooter.java:103)
FAILED: org.apache.hadoop.yarn.server.resourcemanager.rmapp.TestNodesListManager.testCachedResolver
Error Message:
expected:<[testCachedResolverHost2]> but was:<[198.105.254.11]>
Stack Trace:
org.junit.ComparisonFailure: expected:<[testCachedResolverHost2]> but was:<[198.105.254.11]>
at org.junit.Assert.assertEquals(Assert.java:115)
at org.apache.hadoop.yarn.server.resourcemanager.rmapp.TestNodesListManager.testCachedResolver(TestNodesListManager.java:139)
FAILED: org.apache.hadoop.yarn.server.resourcemanager.scheduler.capacity.TestContainerAllocation.testAMContainerAllocationWhenDNSUnavailable
Error Message:
expected:<SCHEDULED> but was:<ALLOCATED>
Stack Trace:
java.lang.AssertionError: expected:<SCHEDULED> but was:<ALLOCATED>
at org.junit.Assert.fail(Assert.java:88)
at org.junit.Assert.failNotEquals(Assert.java:743)
at org.junit.Assert.assertEquals(Assert.java:118)
at org.junit.Assert.assertEquals(Assert.java:144)
at org.apache.hadoop.yarn.server.resourcemanager.scheduler.capacity.TestContainerAllocation.testAMContainerAllocationWhenDNSUnavailable(TestContainerAllocation.java:321)
FAILED: org.apache.hadoop.yarn.server.resourcemanager.scheduler.capacity.TestContainerAllocation.testNormalContainerAllocationWhenDNSUnavailable
Error Message:
expected:<0> but was:<1>
Stack Trace:
java.lang.AssertionError: expected:<0> but was:<1>
at org.junit.Assert.fail(Assert.java:88)
at org.junit.Assert.failNotEquals(Assert.java:743)
at org.junit.Assert.assertEquals(Assert.java:118)
at org.junit.Assert.assertEquals(Assert.java:555)
at org.junit.Assert.assertEquals(Assert.java:542)
at org.apache.hadoop.yarn.server.resourcemanager.scheduler.capacity.TestContainerAllocation.testNormalContainerAllocationWhenDNSUnavailable(TestContainerAllocation.java:206)
Failed: YARN-4057 PreCommit Build #8860
Posted by Apache Jenkins Server <je...@builds.apache.org>.
Jira: https://issues.apache.org/jira/browse/YARN-4057
Build: https://builds.apache.org/job/PreCommit-YARN-Build/8860/
###################################################################################
########################## LAST 60 LINES OF THE CONSOLE ###########################
[...truncated 279 lines...]
| +1 | release audit | 0m 23s | The applied patch does not increase
| | | | the total number of release audit
| | | | warnings.
| +1 | checkstyle | 0m 36s | There were no new checkstyle
| | | | issues.
| +1 | whitespace | 0m 0s | The patch has no lines that end in
| | | | whitespace.
| +1 | install | 1m 22s | mvn install still works.
| +1 | eclipse:eclipse | 0m 34s | The patch built with
| | | | eclipse:eclipse.
| +1 | findbugs | 1m 15s | The patch does not introduce any
| | | | new Findbugs (version 3.0.0)
| | | | warnings.
| +1 | yarn tests | 6m 17s | Tests passed in
| | | | hadoop-yarn-server-nodemanager.
| | | 44m 7s |
|| Subsystem || Report/Notes ||
============================================================================
| Patch URL | http://issues.apache.org/jira/secure/attachment/12750783/YARN-4057.01.patch |
| Optional Tests | javadoc javac unit findbugs checkstyle |
| git revision | trunk / 13604bd |
| hadoop-yarn-server-nodemanager test log | /home/jenkins/jenkins-slave/workspace/PreCommit-YARN-Build/patchprocess/testrun_hadoop-yarn-server-nodemanager.txt |
| Test Results | https://builds.apache.org/job/PreCommit-YARN-Build/8860/testReport/ |
| Java | 1.7.0_55 |
| uname | Linux asf909.gq1.ygridcore.net 3.13.0-36-lowlatency #63-Ubuntu SMP PREEMPT Wed Sep 3 21:56:12 UTC 2014 x86_64 x86_64 x86_64 GNU/Linux |
============================================================================
============================================================================
Adding comment to JIRA
============================================================================
============================================================================
Comment added.
5ad21be4dd3ea424128063da92c5c6af2c4c2936 logged out
============================================================================
============================================================================
Finished build.
============================================================================
============================================================================
Build step 'Execute shell' marked build as failure
Archiving artifacts
Sending artifact delta relative to PreCommit-YARN-Build #8849
Archived 29 artifacts
Archive block size is 32768
Received 83 blocks and 9055351 bytes
Compression is 23.1%
Took 2.3 sec
[description-setter] Could not determine description.
Recording test results
Email was triggered for: Failure
Sending email for trigger: Failure
###################################################################################
############################## FAILED TESTS (if any) ##############################
All tests passed
Failed: YARN-2923 PreCommit Build #8859
Posted by Apache Jenkins Server <je...@builds.apache.org>.
Jira: https://issues.apache.org/jira/browse/YARN-2923
Build: https://builds.apache.org/job/PreCommit-YARN-Build/8859/
###################################################################################
########################## LAST 60 LINES OF THE CONSOLE ###########################
[...truncated 365 lines...]
| +1 | findbugs | 4m 22s | The patch does not introduce any
| | | | new Findbugs (version 3.0.0)
| | | | warnings.
| +1 | yarn tests | 0m 23s | Tests passed in hadoop-yarn-api.
| -1 | yarn tests | 1m 56s | Tests failed in hadoop-yarn-common.
| -1 | yarn tests | 6m 16s | Tests failed in
| | | | hadoop-yarn-server-nodemanager.
| | | 55m 9s |
Reason | Tests
Failed unit tests | hadoop.yarn.util.TestRackResolver
| hadoop.yarn.server.nodemanager.TestNodeStatusUpdaterForLabels
|| Subsystem || Report/Notes ||
============================================================================
| Patch URL | http://issues.apache.org/jira/secure/attachment/12750760/YARN-2923.20150817-1.patch |
| Optional Tests | javadoc javac unit findbugs checkstyle |
| git revision | trunk / 13604bd |
| checkstyle | /home/jenkins/jenkins-slave/workspace/PreCommit-YARN-Build/patchprocess/diffcheckstylehadoop-yarn-api.txt |
| hadoop-yarn-api test log | /home/jenkins/jenkins-slave/workspace/PreCommit-YARN-Build/patchprocess/testrun_hadoop-yarn-api.txt |
| hadoop-yarn-common test log | /home/jenkins/jenkins-slave/workspace/PreCommit-YARN-Build/patchprocess/testrun_hadoop-yarn-common.txt |
| hadoop-yarn-server-nodemanager test log | /home/jenkins/jenkins-slave/workspace/PreCommit-YARN-Build/patchprocess/testrun_hadoop-yarn-server-nodemanager.txt |
| Test Results | https://builds.apache.org/job/PreCommit-YARN-Build/8859/testReport/ |
| Java | 1.7.0_55 |
| uname | Linux asf903.gq1.ygridcore.net 3.13.0-36-lowlatency #63-Ubuntu SMP PREEMPT Wed Sep 3 21:56:12 UTC 2014 x86_64 x86_64 x86_64 GNU/Linux |
============================================================================
============================================================================
Adding comment to JIRA
============================================================================
============================================================================
Comment added.
04f3da1e9603a7ec83465b7ac9293a88a14f5ab9 logged out
============================================================================
============================================================================
Finished build.
============================================================================
============================================================================
Build step 'Execute shell' marked build as failure
Archiving artifacts
Sending artifact delta relative to PreCommit-YARN-Build #8849
Archived 58 artifacts
Archive block size is 32768
Received 67 blocks and 29780208 bytes
Compression is 6.9%
Took 6.3 sec
[description-setter] Could not determine description.
Recording test results
Email was triggered for: Failure
Sending email for trigger: Failure
###################################################################################
############################## FAILED TESTS (if any) ##############################
2 tests failed.
FAILED: org.apache.hadoop.yarn.util.TestRackResolver.testCaching
Error Message:
expected:</[default-rack]> but was:</[rack1]>
Stack Trace:
org.junit.ComparisonFailure: expected:</[default-rack]> but was:</[rack1]>
at org.junit.Assert.assertEquals(Assert.java:115)
at org.junit.Assert.assertEquals(Assert.java:144)
at org.apache.hadoop.yarn.util.TestRackResolver.testCaching(TestRackResolver.java:102)
FAILED: org.apache.hadoop.yarn.server.nodemanager.TestNodeStatusUpdaterForLabels.testNodeStatusUpdaterForNodeLabels
Error Message:
null
Stack Trace:
java.lang.NullPointerException: null
at org.apache.hadoop.yarn.server.nodemanager.TestNodeStatusUpdaterForLabels.testNodeStatusUpdaterForNodeLabels(TestNodeStatusUpdaterForLabels.java:285)
Failed: YARN-3980 PreCommit Build #8858
Posted by Apache Jenkins Server <je...@builds.apache.org>.
Jira: https://issues.apache.org/jira/browse/YARN-3980
Build: https://builds.apache.org/job/PreCommit-YARN-Build/8858/
###################################################################################
########################## LAST 60 LINES OF THE CONSOLE ###########################
[...truncated 343 lines...]
| | | | new Findbugs (version 3.0.0)
| | | | warnings.
| +1 | tools/hadoop tests | 0m 56s | Tests passed in hadoop-sls.
| -1 | yarn tests | 47m 50s | Tests failed in
| | | | hadoop-yarn-server-resourcemanager
| | | | .
| | | 100m 47s |
Reason | Tests
Failed unit tests | hadoop.yarn.server.resourcemanager.scheduler.capacity.TestContainerAllocation
| hadoop.yarn.server.resourcemanager.security.TestRMDelegationTokens
Timed out tests | org.apache.hadoop.yarn.server.resourcemanager.TestRMRestart
|| Subsystem || Report/Notes ||
============================================================================
| Patch URL | http://issues.apache.org/jira/secure/attachment/12750755/YARN-3980-v2.patch |
| Optional Tests | javadoc javac unit findbugs checkstyle |
| git revision | trunk / 13604bd |
| javadoc | /home/jenkins/jenkins-slave/workspace/PreCommit-YARN-Build/patchprocess/diffJavadocWarnings.txt |
| checkstyle | /home/jenkins/jenkins-slave/workspace/PreCommit-YARN-Build/patchprocess/diffcheckstylehadoop-yarn-server-resourcemanager.txt |
| hadoop-sls test log | /home/jenkins/jenkins-slave/workspace/PreCommit-YARN-Build/patchprocess/testrun_hadoop-sls.txt |
| hadoop-yarn-server-resourcemanager test log | /home/jenkins/jenkins-slave/workspace/PreCommit-YARN-Build/patchprocess/testrun_hadoop-yarn-server-resourcemanager.txt |
| Test Results | https://builds.apache.org/job/PreCommit-YARN-Build/8858/testReport/ |
| Java | 1.7.0_55 |
| uname | Linux asf903.gq1.ygridcore.net 3.13.0-36-lowlatency #63-Ubuntu SMP PREEMPT Wed Sep 3 21:56:12 UTC 2014 x86_64 x86_64 x86_64 GNU/Linux |
============================================================================
============================================================================
Adding comment to JIRA
============================================================================
============================================================================
Comment added.
a613959da384cd1f9e06c265744a33d4a1c7cf8a logged out
============================================================================
============================================================================
Finished build.
============================================================================
============================================================================
Build step 'Execute shell' marked build as failure
Archiving artifacts
Sending artifact delta relative to PreCommit-YARN-Build #8849
Archived 45 artifacts
Archive block size is 32768
Received 47 blocks and 12297662 bytes
Compression is 11.1%
Took 2.8 sec
[description-setter] Could not determine description.
Recording test results
Email was triggered for: Failure
Sending email for trigger: Failure
###################################################################################
############################## FAILED TESTS (if any) ##############################
3 tests failed.
REGRESSION: org.apache.hadoop.yarn.server.resourcemanager.security.TestRMDelegationTokens.testRMDTMasterKeyStateOnRollingMasterKey
Error Message:
null
Stack Trace:
java.lang.AssertionError: null
at org.junit.Assert.fail(Assert.java:86)
at org.junit.Assert.assertTrue(Assert.java:41)
at org.junit.Assert.assertTrue(Assert.java:52)
at org.apache.hadoop.yarn.server.resourcemanager.security.TestRMDelegationTokens$TestRMDelegationTokenSecretManager.checkCurrentKeyInStateStore(TestRMDelegationTokens.java:208)
at org.apache.hadoop.yarn.server.resourcemanager.security.TestRMDelegationTokens.testRMDTMasterKeyStateOnRollingMasterKey(TestRMDelegationTokens.java:112)
FAILED: org.apache.hadoop.yarn.server.resourcemanager.scheduler.capacity.TestContainerAllocation.testAMContainerAllocationWhenDNSUnavailable
Error Message:
expected:<SCHEDULED> but was:<ALLOCATED>
Stack Trace:
java.lang.AssertionError: expected:<SCHEDULED> but was:<ALLOCATED>
at org.junit.Assert.fail(Assert.java:88)
at org.junit.Assert.failNotEquals(Assert.java:743)
at org.junit.Assert.assertEquals(Assert.java:118)
at org.junit.Assert.assertEquals(Assert.java:144)
at org.apache.hadoop.yarn.server.resourcemanager.scheduler.capacity.TestContainerAllocation.testAMContainerAllocationWhenDNSUnavailable(TestContainerAllocation.java:321)
FAILED: org.apache.hadoop.yarn.server.resourcemanager.scheduler.capacity.TestContainerAllocation.testNormalContainerAllocationWhenDNSUnavailable
Error Message:
expected:<0> but was:<1>
Stack Trace:
java.lang.AssertionError: expected:<0> but was:<1>
at org.junit.Assert.fail(Assert.java:88)
at org.junit.Assert.failNotEquals(Assert.java:743)
at org.junit.Assert.assertEquals(Assert.java:118)
at org.junit.Assert.assertEquals(Assert.java:555)
at org.junit.Assert.assertEquals(Assert.java:542)
at org.apache.hadoop.yarn.server.resourcemanager.scheduler.capacity.TestContainerAllocation.testNormalContainerAllocationWhenDNSUnavailable(TestContainerAllocation.java:206)
Failed: YARN-3980 PreCommit Build #8857
Posted by Apache Jenkins Server <je...@builds.apache.org>.
Jira: https://issues.apache.org/jira/browse/YARN-3980
Build: https://builds.apache.org/job/PreCommit-YARN-Build/8857/
###################################################################################
########################## LAST 60 LINES OF THE CONSOLE ###########################
[...truncated 344 lines...]
| | | | eclipse:eclipse.
| +1 | findbugs | 2m 30s | The patch does not introduce any
| | | | new Findbugs (version 3.0.0)
| | | | warnings.
| +1 | tools/hadoop tests | 0m 53s | Tests passed in hadoop-sls.
| -1 | yarn tests | 54m 15s | Tests failed in
| | | | hadoop-yarn-server-resourcemanager
| | | | .
| | | 98m 49s |
Reason | Tests
Failed unit tests | hadoop.yarn.server.resourcemanager.scheduler.capacity.TestContainerAllocation
|| Subsystem || Report/Notes ||
============================================================================
| Patch URL | http://issues.apache.org/jira/secure/attachment/12750748/YARN-3980-v1.patch |
| Optional Tests | javadoc javac unit findbugs checkstyle |
| git revision | trunk / 13604bd |
| javadoc | /home/jenkins/jenkins-slave/workspace/PreCommit-YARN-Build/patchprocess/diffJavadocWarnings.txt |
| checkstyle | /home/jenkins/jenkins-slave/workspace/PreCommit-YARN-Build/patchprocess/diffcheckstylehadoop-yarn-server-resourcemanager.txt |
| hadoop-sls test log | /home/jenkins/jenkins-slave/workspace/PreCommit-YARN-Build/patchprocess/testrun_hadoop-sls.txt |
| hadoop-yarn-server-resourcemanager test log | /home/jenkins/jenkins-slave/workspace/PreCommit-YARN-Build/patchprocess/testrun_hadoop-yarn-server-resourcemanager.txt |
| Test Results | https://builds.apache.org/job/PreCommit-YARN-Build/8857/testReport/ |
| Java | 1.7.0_55 |
| uname | Linux asf904.gq1.ygridcore.net 3.13.0-36-lowlatency #63-Ubuntu SMP PREEMPT Wed Sep 3 21:56:12 UTC 2014 x86_64 x86_64 x86_64 GNU/Linux |
============================================================================
============================================================================
Adding comment to JIRA
============================================================================
============================================================================
Comment added.
0ec86143dfa16f84dd4ec527b6124dc0051855c9 logged out
============================================================================
============================================================================
Finished build.
============================================================================
============================================================================
Build step 'Execute shell' marked build as failure
Archiving artifacts
Sending artifact delta relative to PreCommit-YARN-Build #8849
Archived 45 artifacts
Archive block size is 32768
Received 39 blocks and 12523331 bytes
Compression is 9.3%
Took 2.9 sec
[description-setter] Could not determine description.
Recording test results
Email was triggered for: Failure
Sending email for trigger: Failure
###################################################################################
############################## FAILED TESTS (if any) ##############################
2 tests failed.
FAILED: org.apache.hadoop.yarn.server.resourcemanager.scheduler.capacity.TestContainerAllocation.testAMContainerAllocationWhenDNSUnavailable
Error Message:
expected:<SCHEDULED> but was:<ALLOCATED>
Stack Trace:
java.lang.AssertionError: expected:<SCHEDULED> but was:<ALLOCATED>
at org.junit.Assert.fail(Assert.java:88)
at org.junit.Assert.failNotEquals(Assert.java:743)
at org.junit.Assert.assertEquals(Assert.java:118)
at org.junit.Assert.assertEquals(Assert.java:144)
at org.apache.hadoop.yarn.server.resourcemanager.scheduler.capacity.TestContainerAllocation.testAMContainerAllocationWhenDNSUnavailable(TestContainerAllocation.java:321)
FAILED: org.apache.hadoop.yarn.server.resourcemanager.scheduler.capacity.TestContainerAllocation.testNormalContainerAllocationWhenDNSUnavailable
Error Message:
expected:<0> but was:<1>
Stack Trace:
java.lang.AssertionError: expected:<0> but was:<1>
at org.junit.Assert.fail(Assert.java:88)
at org.junit.Assert.failNotEquals(Assert.java:743)
at org.junit.Assert.assertEquals(Assert.java:118)
at org.junit.Assert.assertEquals(Assert.java:555)
at org.junit.Assert.assertEquals(Assert.java:542)
at org.apache.hadoop.yarn.server.resourcemanager.scheduler.capacity.TestContainerAllocation.testNormalContainerAllocationWhenDNSUnavailable(TestContainerAllocation.java:206)
Failed: YARN-3980 PreCommit Build #8856
Posted by Apache Jenkins Server <je...@builds.apache.org>.
Jira: https://issues.apache.org/jira/browse/YARN-3980
Build: https://builds.apache.org/job/PreCommit-YARN-Build/8856/
###################################################################################
########################## LAST 60 LINES OF THE CONSOLE ###########################
[...truncated 171 lines...]
/home/jenkins/tools/maven/latest/bin/mvn clean test -DskipTests -DhadoopPatchProcess -Pnative -Ptest-patch > /home/jenkins/jenkins-slave/workspace/PreCommit-YARN-Build/patchprocess/patchJavacWarnings.txt 2>&1
Elapsed time: 8m 20s
-1 overall
| Vote | Subsystem | Runtime | Comment
============================================================================
| 0 | pre-patch | 17m 45s | Pre-patch trunk compilation is
| | | | healthy.
| +1 | @author | 0m 0s | The patch does not contain any
| | | | @author tags.
| +1 | tests included | 0m 0s | The patch appears to include 4 new
| | | | or modified test files.
| -1 | javac | 8m 20s | The patch appears to cause the build
| | | | to fail.
|| Subsystem || Report/Notes ||
============================================================================
| Patch URL | http://issues.apache.org/jira/secure/attachment/12750745/YARN-3980-v1.patch |
| Optional Tests | javadoc javac unit findbugs checkstyle |
| git revision | trunk / 13604bd |
============================================================================
============================================================================
Adding comment to JIRA
============================================================================
============================================================================
Comment added.
f3b5903722472779b468ba6b68f3c658ea8f8004 logged out
============================================================================
============================================================================
Finished build.
============================================================================
============================================================================
Build step 'Execute shell' marked build as failure
Archiving artifacts
Sending artifact delta relative to PreCommit-YARN-Build #8849
Archived 12 artifacts
Archive block size is 32768
Received 23 blocks and 5401368 bytes
Compression is 12.2%
Took 1.3 sec
[description-setter] Could not determine description.
Recording test results
Email was triggered for: Failure
Sending email for trigger: Failure
###################################################################################
############################## FAILED TESTS (if any) ##############################
No tests ran.
Failed: YARN-3980 PreCommit Build #8855
Posted by Apache Jenkins Server <je...@builds.apache.org>.
Jira: https://issues.apache.org/jira/browse/YARN-3980
Build: https://builds.apache.org/job/PreCommit-YARN-Build/8855/
###################################################################################
########################## LAST 60 LINES OF THE CONSOLE ###########################
[...truncated 159 lines...]
Elapsed time: 3m 35s
-1 overall
| Vote | Subsystem | Runtime | Comment
============================================================================
| 0 | pre-patch | 16m 19s | Pre-patch trunk compilation is
| | | | healthy.
| +1 | @author | 0m 0s | The patch does not contain any
| | | | @author tags.
| -1 | tests included | 0m 0s | The patch doesn't appear to include
| | | | any new or modified tests. Please
| | | | justify why no new tests are needed
| | | | for this patch. Also please list what
| | | | manual steps were performed to verify
| | | | this patch.
| -1 | javac | 3m 35s | The patch appears to cause the build
| | | | to fail.
|| Subsystem || Report/Notes ||
============================================================================
| Patch URL | http://issues.apache.org/jira/secure/attachment/12750738/YARN-3980-v0.patch |
| Optional Tests | javadoc javac unit findbugs checkstyle |
| git revision | trunk / 13604bd |
============================================================================
============================================================================
Adding comment to JIRA
============================================================================
============================================================================
Comment added.
71929fd9abe8630411919b94a0a7d7cd2f006e1c logged out
============================================================================
============================================================================
Finished build.
============================================================================
============================================================================
Build step 'Execute shell' marked build as failure
Archiving artifacts
Sending artifact delta relative to PreCommit-YARN-Build #8849
Archived 12 artifacts
Archive block size is 32768
Received 94 blocks and 2432395 bytes
Compression is 55.9%
Took 1 sec
[description-setter] Could not determine description.
Recording test results
Email was triggered for: Failure
Sending email for trigger: Failure
###################################################################################
############################## FAILED TESTS (if any) ##############################
No tests ran.
Failed: YARN-4055 PreCommit Build #8854
Posted by Apache Jenkins Server <je...@builds.apache.org>.
Jira: https://issues.apache.org/jira/browse/YARN-4055
Build: https://builds.apache.org/job/PreCommit-YARN-Build/8854/
###################################################################################
########################## LAST 60 LINES OF THE CONSOLE ###########################
[...truncated 349 lines...]
| | | | new Findbugs (version 3.0.0)
| | | | warnings.
| -1 | yarn tests | 7m 2s | Tests failed in hadoop-yarn-client.
| +1 | yarn tests | 0m 26s | Tests passed in
| | | | hadoop-yarn-server-common.
| +1 | yarn tests | 6m 12s | Tests passed in
| | | | hadoop-yarn-server-nodemanager.
| | | 56m 21s |
Reason | Tests
Failed unit tests | hadoop.yarn.client.api.impl.TestYarnClient
|| Subsystem || Report/Notes ||
============================================================================
| Patch URL | http://issues.apache.org/jira/secure/attachment/12750721/YARN-4055-v1.patch |
| Optional Tests | javac unit findbugs checkstyle javadoc |
| git revision | trunk / def1293 |
| Pre-patch Findbugs warnings | /home/jenkins/jenkins-slave/workspace/PreCommit-YARN-Build/patchprocess/trunkFindbugsWarningshadoop-yarn-server-common.html |
| whitespace | /home/jenkins/jenkins-slave/workspace/PreCommit-YARN-Build/patchprocess/whitespace.txt |
| hadoop-yarn-client test log | /home/jenkins/jenkins-slave/workspace/PreCommit-YARN-Build/patchprocess/testrun_hadoop-yarn-client.txt |
| hadoop-yarn-server-common test log | /home/jenkins/jenkins-slave/workspace/PreCommit-YARN-Build/patchprocess/testrun_hadoop-yarn-server-common.txt |
| hadoop-yarn-server-nodemanager test log | /home/jenkins/jenkins-slave/workspace/PreCommit-YARN-Build/patchprocess/testrun_hadoop-yarn-server-nodemanager.txt |
| Test Results | https://builds.apache.org/job/PreCommit-YARN-Build/8854/testReport/ |
| Java | 1.7.0_55 |
| uname | Linux asf903.gq1.ygridcore.net 3.13.0-36-lowlatency #63-Ubuntu SMP PREEMPT Wed Sep 3 21:56:12 UTC 2014 x86_64 x86_64 x86_64 GNU/Linux |
============================================================================
============================================================================
Adding comment to JIRA
============================================================================
============================================================================
Comment added.
d682f31e94613b5b7dc106eeaf949ae11b33857f logged out
============================================================================
============================================================================
Finished build.
============================================================================
============================================================================
Build step 'Execute shell' marked build as failure
Archiving artifacts
Sending artifact delta relative to PreCommit-YARN-Build #8849
Archived 55 artifacts
Archive block size is 32768
Received 48 blocks and 11929974 bytes
Compression is 11.6%
Took 3 sec
[description-setter] Could not determine description.
Recording test results
Email was triggered for: Failure
Sending email for trigger: Failure
###################################################################################
############################## FAILED TESTS (if any) ##############################
1 tests failed.
FAILED: org.apache.hadoop.yarn.client.api.impl.TestYarnClient.testReservationAPIs
Error Message:
org.apache.hadoop.yarn.server.resourcemanager.reservation.exceptions.PlanningException: The planning algorithm could not find a valid allocation for your request
at org.apache.hadoop.yarn.ipc.RPCUtil.getRemoteException(RPCUtil.java:38)
at org.apache.hadoop.yarn.server.resourcemanager.ClientRMService.submitReservation(ClientRMService.java:1143)
at org.apache.hadoop.yarn.api.impl.pb.service.ApplicationClientProtocolPBServiceImpl.submitReservation(ApplicationClientProtocolPBServiceImpl.java:423)
at org.apache.hadoop.yarn.proto.ApplicationClientProtocol$ApplicationClientProtocolService$2.callBlockingMethod(ApplicationClientProtocol.java:449)
at org.apache.hadoop.ipc.ProtobufRpcEngine$Server$ProtoBufRpcInvoker.call(ProtobufRpcEngine.java:636)
at org.apache.hadoop.ipc.RPC$Server.call(RPC.java:976)
at org.apache.hadoop.ipc.Server$Handler$1.run(Server.java:2174)
at org.apache.hadoop.ipc.Server$Handler$1.run(Server.java:2170)
at java.security.AccessController.doPrivileged(Native Method)
at javax.security.auth.Subject.doAs(Subject.java:415)
at org.apache.hadoop.security.UserGroupInformation.doAs(UserGroupInformation.java:1667)
at org.apache.hadoop.ipc.Server$Handler.run(Server.java:2168)
Caused by: org.apache.hadoop.yarn.server.resourcemanager.reservation.exceptions.PlanningException: The planning algorithm could not find a valid allocation for your request
at org.apache.hadoop.yarn.server.resourcemanager.reservation.planning.PlanningAlgorithm.allocateUser(PlanningAlgorithm.java:69)
at org.apache.hadoop.yarn.server.resourcemanager.reservation.planning.PlanningAlgorithm.createReservation(PlanningAlgorithm.java:140)
at org.apache.hadoop.yarn.server.resourcemanager.reservation.planning.TryManyReservationAgents.createReservation(TryManyReservationAgents.java:55)
at org.apache.hadoop.yarn.server.resourcemanager.reservation.planning.AlignedPlannerWithGreedy.createReservation(AlignedPlannerWithGreedy.java:84)
at org.apache.hadoop.yarn.server.resourcemanager.ClientRMService.submitReservation(ClientRMService.java:1126)
... 10 more
Stack Trace:
java.lang.AssertionError: org.apache.hadoop.yarn.server.resourcemanager.reservation.exceptions.PlanningException: The planning algorithm could not find a valid allocation for your request
at org.apache.hadoop.yarn.ipc.RPCUtil.getRemoteException(RPCUtil.java:38)
at org.apache.hadoop.yarn.server.resourcemanager.ClientRMService.submitReservation(ClientRMService.java:1143)
at org.apache.hadoop.yarn.api.impl.pb.service.ApplicationClientProtocolPBServiceImpl.submitReservation(ApplicationClientProtocolPBServiceImpl.java:423)
at org.apache.hadoop.yarn.proto.ApplicationClientProtocol$ApplicationClientProtocolService$2.callBlockingMethod(ApplicationClientProtocol.java:449)
at org.apache.hadoop.ipc.ProtobufRpcEngine$Server$ProtoBufRpcInvoker.call(ProtobufRpcEngine.java:636)
at org.apache.hadoop.ipc.RPC$Server.call(RPC.java:976)
at org.apache.hadoop.ipc.Server$Handler$1.run(Server.java:2174)
at org.apache.hadoop.ipc.Server$Handler$1.run(Server.java:2170)
at java.security.AccessController.doPrivileged(Native Method)
at javax.security.auth.Subject.doAs(Subject.java:415)
at org.apache.hadoop.security.UserGroupInformation.doAs(UserGroupInformation.java:1667)
at org.apache.hadoop.ipc.Server$Handler.run(Server.java:2168)
Caused by: org.apache.hadoop.yarn.server.resourcemanager.reservation.exceptions.PlanningException: The planning algorithm could not find a valid allocation for your request
at org.apache.hadoop.yarn.server.resourcemanager.reservation.planning.PlanningAlgorithm.allocateUser(PlanningAlgorithm.java:69)
at org.apache.hadoop.yarn.server.resourcemanager.reservation.planning.PlanningAlgorithm.createReservation(PlanningAlgorithm.java:140)
at org.apache.hadoop.yarn.server.resourcemanager.reservation.planning.TryManyReservationAgents.createReservation(TryManyReservationAgents.java:55)
at org.apache.hadoop.yarn.server.resourcemanager.reservation.planning.AlignedPlannerWithGreedy.createReservation(AlignedPlannerWithGreedy.java:84)
at org.apache.hadoop.yarn.server.resourcemanager.ClientRMService.submitReservation(ClientRMService.java:1126)
... 10 more
at org.junit.Assert.fail(Assert.java:88)
at org.apache.hadoop.yarn.client.api.impl.TestYarnClient.testReservationAPIs(TestYarnClient.java:1204)
Failed: YARN-4053 PreCommit Build #8853
Posted by Apache Jenkins Server <je...@builds.apache.org>.
Jira: https://issues.apache.org/jira/browse/YARN-4053
Build: https://builds.apache.org/job/PreCommit-YARN-Build/8853/
###################################################################################
########################## LAST 60 LINES OF THE CONSOLE ###########################
[...truncated 309 lines...]
| +1 | release audit | 0m 23s | The applied patch does not increase
| | | | the total number of release audit
| | | | warnings.
| +1 | checkstyle | 0m 16s | There were no new checkstyle
| | | | issues.
| +1 | whitespace | 0m 1s | The patch has no lines that end in
| | | | whitespace.
| +1 | install | 1m 26s | mvn install still works.
| +1 | eclipse:eclipse | 0m 40s | The patch built with
| | | | eclipse:eclipse.
| +1 | findbugs | 0m 52s | The patch does not introduce any
| | | | new Findbugs (version 3.0.0)
| | | | warnings.
| +1 | yarn tests | 1m 22s | Tests passed in
| | | | hadoop-yarn-server-timelineservice.
| | | 38m 58s |
|| Subsystem || Report/Notes ||
============================================================================
| Patch URL | http://issues.apache.org/jira/secure/attachment/12750693/YARN-4053-YARN-2928.01.patch |
| Optional Tests | javadoc javac unit findbugs checkstyle |
| git revision | YARN-2928 / f40c735 |
| hadoop-yarn-server-timelineservice test log | /home/jenkins/jenkins-slave/workspace/PreCommit-YARN-Build/patchprocess/testrun_hadoop-yarn-server-timelineservice.txt |
| Test Results | https://builds.apache.org/job/PreCommit-YARN-Build/8853/testReport/ |
| Java | 1.7.0_55 |
| uname | Linux asf909.gq1.ygridcore.net 3.13.0-36-lowlatency #63-Ubuntu SMP PREEMPT Wed Sep 3 21:56:12 UTC 2014 x86_64 x86_64 x86_64 GNU/Linux |
============================================================================
============================================================================
Adding comment to JIRA
============================================================================
============================================================================
Comment added.
55e9a14bfa714b610ca37c1cb26b2dd6244046ae logged out
============================================================================
============================================================================
Finished build.
============================================================================
============================================================================
Build step 'Execute shell' marked build as failure
Archiving artifacts
Sending artifact delta relative to PreCommit-YARN-Build #8849
Archived 27 artifacts
Archive block size is 32768
Received 30 blocks and 8748637 bytes
Compression is 10.1%
Took 2.3 sec
Description set: MAPREDUCE-6439
Recording test results
Email was triggered for: Failure
Sending email for trigger: Failure
###################################################################################
############################## FAILED TESTS (if any) ##############################
All tests passed