You are viewing a plain text version of this content. The canonical link for it is here.
Posted to dev@flume.apache.org by Apache Jenkins Server <je...@builds.apache.org> on 2012/09/07 03:27:02 UTC
Build failed in Jenkins: flume-1.3.0 #7
See <https://builds.apache.org/job/flume-1.3.0/7/changes>
Changes:
[jarcec] FLUME-1507. Have "Topology Design Considerations" in User Guide.
[hshreedharan] FLUME-1526. File Channel LogFile log message should be info, not warn.
[hshreedharan] FLUME-1509. HDFS sink should allow for the use of different timezones when resolving sink paths.
[mpercy] FLUME-1541. Implement failover for LoadBalancingSinkProcessor.
------------------------------------------
[...truncated 4787 lines...]
mojoSucceeded org.apache.maven.plugins:maven-compiler-plugin:2.3.2(default-compile)
mojoStarted org.apache.maven.plugins:maven-resources-plugin:2.4.3(default-testResources)[INFO] Using 'UTF-8' encoding to copy filtered resources.
[INFO] Copying 2 resources
[INFO] Copying 3 resources
[INFO]
[INFO] --- maven-resources-plugin:2.4.3:testResources (default-testResources) @ flume-ng-tests ---
mojoSucceeded org.apache.maven.plugins:maven-resources-plugin:2.4.3(default-testResources)
mojoStarted org.apache.maven.plugins:maven-compiler-plugin:2.3.2(default-testCompile)[INFO] Compiling 4 source files to <https://builds.apache.org/job/flume-1.3.0/ws/flume-ng-tests/target/test-classes>
[INFO]
[INFO] --- maven-compiler-plugin:2.3.2:testCompile (default-testCompile) @ flume-ng-tests ---
[INFO] -------------------------------------------------------------
[ERROR] COMPILATION ERROR :
[INFO] -------------------------------------------------------------
[ERROR] <https://builds.apache.org/job/flume-1.3.0/ws/flume-ng-tests/src/test/java/org/apache/flume/test/agent/TestRpcClientCommunicationFailure.java>:[23,23] cannot find symbol
symbol : class EventDeliveryException
location: package org.apache.flume
[ERROR] <https://builds.apache.org/job/flume-1.3.0/ws/flume-ng-tests/src/test/java/org/apache/flume/test/agent/TestRpcClientCommunicationFailure.java>:[24,27] package org.apache.flume.api does not exist
[ERROR] <https://builds.apache.org/job/flume-1.3.0/ws/flume-ng-tests/src/test/java/org/apache/flume/test/agent/TestRpcClientCommunicationFailure.java>:[25,27] package org.apache.flume.api does not exist
[ERROR] <https://builds.apache.org/job/flume-1.3.0/ws/flume-ng-tests/src/test/java/org/apache/flume/test/agent/TestRpcClientCommunicationFailure.java>:[26,29] cannot find symbol
symbol : class EventBuilder
location: package org.apache.flume.event
mojoFailed org.apache.maven.plugins:maven-compiler-plugin:2.3.2(default-testCompile)[ERROR] <https://builds.apache.org/job/flume-1.3.0/ws/flume-ng-tests/src/test/java/org/apache/flume/test/agent/TestRpcClient.java>:[21,27] package org.apache.flume.api does not exist
[ERROR] <https://builds.apache.org/job/flume-1.3.0/ws/flume-ng-tests/src/test/java/org/apache/flume/test/agent/TestRpcClient.java>:[22,27] package org.apache.flume.api does not exist
[ERROR] <https://builds.apache.org/job/flume-1.3.0/ws/flume-ng-tests/src/test/java/org/apache/flume/test/agent/TestRpcClient.java>:[23,29] cannot find symbol
symbol : class EventBuilder
location: package org.apache.flume.event
[ERROR] <https://builds.apache.org/job/flume-1.3.0/ws/flume-ng-tests/src/test/java/org/apache/flume/test/agent/TestRpcClientCommunicationFailure.java>:[42,7] cannot find symbol
symbol : class RpcClient
location: class org.apache.flume.test.agent.TestRpcClientCommunicationFailure
[ERROR] <https://builds.apache.org/job/flume-1.3.0/ws/flume-ng-tests/src/test/java/org/apache/flume/test/agent/TestRpcClientCommunicationFailure.java>:[42,26] cannot find symbol
symbol : variable RpcClientFactory
location: class org.apache.flume.test.agent.TestRpcClientCommunicationFailure
[ERROR] <https://builds.apache.org/job/flume-1.3.0/ws/flume-ng-tests/src/test/java/org/apache/flume/test/agent/TestRpcClientCommunicationFailure.java>:[46,23] cannot find symbol
symbol : variable EventBuilder
location: class org.apache.flume.test.agent.TestRpcClientCommunicationFailure
[ERROR] <https://builds.apache.org/job/flume-1.3.0/ws/flume-ng-tests/src/test/java/org/apache/flume/test/agent/TestRpcClientCommunicationFailure.java>:[54,23] cannot find symbol
symbol : variable EventBuilder
location: class org.apache.flume.test.agent.TestRpcClientCommunicationFailure
[ERROR] <https://builds.apache.org/job/flume-1.3.0/ws/flume-ng-tests/src/test/java/org/apache/flume/test/agent/TestRpcClientCommunicationFailure.java>:[56,16] cannot find symbol
symbol : class EventDeliveryException
location: class org.apache.flume.test.agent.TestRpcClientCommunicationFailure
[ERROR] <https://builds.apache.org/job/flume-1.3.0/ws/flume-ng-tests/src/test/java/org/apache/flume/test/agent/TestRpcClient.java>:[48,4] cannot find symbol
symbol : class RpcClient
location: class org.apache.flume.test.agent.TestRpcClient
[ERROR] <https://builds.apache.org/job/flume-1.3.0/ws/flume-ng-tests/src/test/java/org/apache/flume/test/agent/TestRpcClient.java>:[48,23] cannot find symbol
symbol : variable RpcClientFactory
location: class org.apache.flume.test.agent.TestRpcClient
[ERROR] <https://builds.apache.org/job/flume-1.3.0/ws/flume-ng-tests/src/test/java/org/apache/flume/test/agent/TestRpcClient.java>:[51,20] cannot find symbol
symbol : variable EventBuilder
location: class org.apache.flume.test.agent.TestRpcClient
[INFO] 15 errors
[INFO] -------------------------------------------------------------
projectFailed org.apache.flume:flume-ng-tests:1.3.0-SNAPSHOT
sessionEnded
[INFO] ------------------------------------------------------------------------
[INFO] Reactor Summary:
[INFO]
[INFO] Apache Flume ...................................... SUCCESS [1:37.527s]
[INFO] Flume NG SDK ...................................... SUCCESS [59.196s]
[INFO] Flume NG Configuration ............................ SUCCESS [11.837s]
[INFO] Flume NG Core ..................................... SUCCESS [2:32.425s]
[INFO] Flume NG Sinks .................................... SUCCESS [8.105s]
[INFO] Flume NG HDFS Sink ................................ SUCCESS [46.582s]
[INFO] Flume NG IRC Sink ................................. SUCCESS [9.341s]
[INFO] Flume NG HBase Sink ............................... FAILURE [9.021s]
[INFO] Flume Sources ..................................... SUCCESS [8.333s]
[INFO] Flume Scribe Source ............................... SUCCESS [8.910s]
[INFO] Flume NG Channels ................................. SUCCESS [6.631s]
[INFO] Flume NG JDBC channel ............................. SUCCESS [47.169s]
[INFO] Flume NG Node ..................................... SUCCESS [29.573s]
[INFO] Flume NG file-based channel ....................... SUCCESS [2:40.553s]
[INFO] Flume NG file backed Memory channel ............... SUCCESS [35.647s]
[INFO] Flume legacy Sources .............................. SUCCESS [7.763s]
[INFO] Flume legacy Avro source .......................... SUCCESS [11.810s]
[INFO] Flume legacy Thrift Source ........................ SUCCESS [9.794s]
[INFO] Flume NG Clients .................................. SUCCESS [9.136s]
[INFO] Flume NG Log4j Appender ........................... FAILURE [2.251s]
[INFO] Flume NG distribution ............................. SKIPPED
[INFO] Flume NG Integration Tests ........................ FAILURE [2.634s]
[INFO] ------------------------------------------------------------------------
[INFO] BUILD FAILURE
[INFO] ------------------------------------------------------------------------
[INFO] Total time: 12:20.360s
[INFO] Finished at: Fri Sep 07 01:26:29 UTC 2012
[INFO] Final Memory: 176M/406M
[INFO] ------------------------------------------------------------------------
Projects to build: [MavenProject: org.apache.flume:flume-parent:1.3.0-SNAPSHOT @ <https://builds.apache.org/job/flume-1.3.0/ws/pom.xml,> MavenProject: org.apache.flume:flume-ng-sdk:1.3.0-SNAPSHOT @ <https://builds.apache.org/job/flume-1.3.0/ws/flume-ng-sdk/pom.xml,> MavenProject: org.apache.flume:flume-ng-configuration:1.3.0-SNAPSHOT @ <https://builds.apache.org/job/flume-1.3.0/ws/flume-ng-configuration/pom.xml,> MavenProject: org.apache.flume:flume-ng-core:1.3.0-SNAPSHOT @ <https://builds.apache.org/job/flume-1.3.0/ws/flume-ng-core/pom.xml,> MavenProject: org.apache.flume:flume-ng-sinks:1.3.0-SNAPSHOT @ <https://builds.apache.org/job/flume-1.3.0/ws/flume-ng-sinks/pom.xml,> MavenProject: org.apache.flume.flume-ng-sinks:flume-hdfs-sink:1.3.0-SNAPSHOT @ <https://builds.apache.org/job/flume-1.3.0/ws/flume-ng-sinks/flume-hdfs-sink/pom.xml,> MavenProject: org.apache.flume.flume-ng-sinks:flume-irc-sink:1.3.0-SNAPSHOT @ <https://builds.apache.org/job/flume-1.3.0/ws/flume-ng-sinks/flume-irc-sink/pom.xml,> MavenProject: org.apache.flume.flume-ng-sinks:flume-ng-hbase-sink:1.3.0-SNAPSHOT @ <https://builds.apache.org/job/flume-1.3.0/ws/flume-ng-sinks/flume-ng-hbase-sink/pom.xml,> MavenProject: org.apache.flume:flume-ng-sources:1.3.0-SNAPSHOT @ <https://builds.apache.org/job/flume-1.3.0/ws/flume-ng-sources/pom.xml,> MavenProject: org.apache.flume.flume-ng-sources:flume-scribe-source:1.3.0-SNAPSHOT @ <https://builds.apache.org/job/flume-1.3.0/ws/flume-ng-sources/flume-scribe-source/pom.xml,> MavenProject: org.apache.flume:flume-ng-channels:1.3.0-SNAPSHOT @ <https://builds.apache.org/job/flume-1.3.0/ws/flume-ng-channels/pom.xml,> MavenProject: org.apache.flume.flume-ng-channels:flume-jdbc-channel:1.3.0-SNAPSHOT @ <https://builds.apache.org/job/flume-1.3.0/ws/flume-ng-channels/flume-jdbc-channel/pom.xml,> MavenProject: org.apache.flume:flume-ng-node:1.3.0-SNAPSHOT @ <https://builds.apache.org/job/flume-1.3.0/ws/flume-ng-node/pom.xml,> MavenProject: org.apache.flume.flume-ng-channels:flume-file-channel:1.3.0-SNAPSHOT @ <https://builds.apache.org/job/flume-1.3.0/ws/flume-ng-channels/flume-file-channel/pom.xml,> MavenProject: org.apache.flume.flume-ng-channels:flume-recoverable-memory-channel:1.3.0-SNAPSHOT @ <https://builds.apache.org/job/flume-1.3.0/ws/flume-ng-channels/flume-recoverable-memory-channel/pom.xml,> MavenProject: org.apache.flume:flume-ng-legacy-sources:1.3.0-SNAPSHOT @ <https://builds.apache.org/job/flume-1.3.0/ws/flume-ng-legacy-sources/pom.xml,> MavenProject: org.apache.flume.flume-ng-legacy-sources:flume-avro-source:1.3.0-SNAPSHOT @ <https://builds.apache.org/job/flume-1.3.0/ws/flume-ng-legacy-sources/flume-avro-source/pom.xml,> MavenProject: org.apache.flume.flume-ng-legacy-sources:flume-thrift-source:1.3.0-SNAPSHOT @ <https://builds.apache.org/job/flume-1.3.0/ws/flume-ng-legacy-sources/flume-thrift-source/pom.xml,> MavenProject: org.apache.flume:flume-ng-clients:1.3.0-SNAPSHOT @ <https://builds.apache.org/job/flume-1.3.0/ws/flume-ng-clients/pom.xml,> MavenProject: org.apache.flume.flume-ng-clients:flume-ng-log4jappender:1.3.0-SNAPSHOT @ <https://builds.apache.org/job/flume-1.3.0/ws/flume-ng-clients/flume-ng-log4jappender/pom.xml,> MavenProject: org.apache.flume:flume-ng-dist:1.3.0-SNAPSHOT @ <https://builds.apache.org/job/flume-1.3.0/ws/flume-ng-dist/pom.xml,> MavenProject: org.apache.flume:flume-ng-tests:1.3.0-SNAPSHOT @ <https://builds.apache.org/job/flume-1.3.0/ws/flume-ng-tests/pom.xml]>
[JENKINS] Archiving <https://builds.apache.org/job/flume-1.3.0/ws/flume-ng-legacy-sources/pom.xml> to /home/hudson/hudson/jobs/flume-1.3.0/modules/org.apache.flume$flume-ng-legacy-sources/builds/2012-09-07_01-13-55/archive/org.apache.flume/flume-ng-legacy-sources/1.3.0-SNAPSHOT/flume-ng-legacy-sources-1.3.0-SNAPSHOT.pom
[JENKINS] Archiving <https://builds.apache.org/job/flume-1.3.0/ws/flume-ng-channels/flume-file-channel/pom.xml> to /home/hudson/hudson/jobs/flume-1.3.0/modules/org.apache.flume.flume-ng-channels$flume-file-channel/builds/2012-09-07_01-13-55/archive/org.apache.flume.flume-ng-channels/flume-file-channel/1.3.0-SNAPSHOT/flume-file-channel-1.3.0-SNAPSHOT.pom
[JENKINS] Archiving <https://builds.apache.org/job/flume-1.3.0/ws/flume-ng-channels/flume-file-channel/target/flume-file-channel-1.3.0-SNAPSHOT.jar> to /home/hudson/hudson/jobs/flume-1.3.0/modules/org.apache.flume.flume-ng-channels$flume-file-channel/builds/2012-09-07_01-13-55/archive/org.apache.flume.flume-ng-channels/flume-file-channel/1.3.0-SNAPSHOT/flume-file-channel-1.3.0-SNAPSHOT.jar
[JENKINS] Archiving <https://builds.apache.org/job/flume-1.3.0/ws/flume-ng-core/pom.xml> to /home/hudson/hudson/jobs/flume-1.3.0/modules/org.apache.flume$flume-ng-core/builds/2012-09-07_01-13-55/archive/org.apache.flume/flume-ng-core/1.3.0-SNAPSHOT/flume-ng-core-1.3.0-SNAPSHOT.pom
[JENKINS] Archiving <https://builds.apache.org/job/flume-1.3.0/ws/flume-ng-core/target/flume-ng-core-1.3.0-SNAPSHOT.jar> to /home/hudson/hudson/jobs/flume-1.3.0/modules/org.apache.flume$flume-ng-core/builds/2012-09-07_01-13-55/archive/org.apache.flume/flume-ng-core/1.3.0-SNAPSHOT/flume-ng-core-1.3.0-SNAPSHOT.jar
[JENKINS] Archiving <https://builds.apache.org/job/flume-1.3.0/ws/flume-ng-sinks/flume-hdfs-sink/pom.xml> to /home/hudson/hudson/jobs/flume-1.3.0/modules/org.apache.flume.flume-ng-sinks$flume-hdfs-sink/builds/2012-09-07_01-13-55/archive/org.apache.flume.flume-ng-sinks/flume-hdfs-sink/1.3.0-SNAPSHOT/flume-hdfs-sink-1.3.0-SNAPSHOT.pom
[JENKINS] Archiving <https://builds.apache.org/job/flume-1.3.0/ws/flume-ng-sinks/flume-hdfs-sink/target/flume-hdfs-sink-1.3.0-SNAPSHOT.jar> to /home/hudson/hudson/jobs/flume-1.3.0/modules/org.apache.flume.flume-ng-sinks$flume-hdfs-sink/builds/2012-09-07_01-13-55/archive/org.apache.flume.flume-ng-sinks/flume-hdfs-sink/1.3.0-SNAPSHOT/flume-hdfs-sink-1.3.0-SNAPSHOT.jar
[JENKINS] Archiving <https://builds.apache.org/job/flume-1.3.0/ws/flume-ng-sources/pom.xml> to /home/hudson/hudson/jobs/flume-1.3.0/modules/org.apache.flume$flume-ng-sources/builds/2012-09-07_01-13-55/archive/org.apache.flume/flume-ng-sources/1.3.0-SNAPSHOT/flume-ng-sources-1.3.0-SNAPSHOT.pom
[JENKINS] Archiving <https://builds.apache.org/job/flume-1.3.0/ws/flume-ng-legacy-sources/flume-avro-source/pom.xml> to /home/hudson/hudson/jobs/flume-1.3.0/modules/org.apache.flume.flume-ng-legacy-sources$flume-avro-source/builds/2012-09-07_01-13-55/archive/org.apache.flume.flume-ng-legacy-sources/flume-avro-source/1.3.0-SNAPSHOT/flume-avro-source-1.3.0-SNAPSHOT.pom
[JENKINS] Archiving <https://builds.apache.org/job/flume-1.3.0/ws/flume-ng-legacy-sources/flume-avro-source/target/flume-avro-source-1.3.0-SNAPSHOT.jar> to /home/hudson/hudson/jobs/flume-1.3.0/modules/org.apache.flume.flume-ng-legacy-sources$flume-avro-source/builds/2012-09-07_01-13-55/archive/org.apache.flume.flume-ng-legacy-sources/flume-avro-source/1.3.0-SNAPSHOT/flume-avro-source-1.3.0-SNAPSHOT.jar
[JENKINS] Archiving <https://builds.apache.org/job/flume-1.3.0/ws/flume-ng-node/pom.xml> to /home/hudson/hudson/jobs/flume-1.3.0/modules/org.apache.flume$flume-ng-node/builds/2012-09-07_01-13-55/archive/org.apache.flume/flume-ng-node/1.3.0-SNAPSHOT/flume-ng-node-1.3.0-SNAPSHOT.pom
[JENKINS] Archiving <https://builds.apache.org/job/flume-1.3.0/ws/flume-ng-node/target/flume-ng-node-1.3.0-SNAPSHOT.jar> to /home/hudson/hudson/jobs/flume-1.3.0/modules/org.apache.flume$flume-ng-node/builds/2012-09-07_01-13-55/archive/org.apache.flume/flume-ng-node/1.3.0-SNAPSHOT/flume-ng-node-1.3.0-SNAPSHOT.jar
[JENKINS] Archiving <https://builds.apache.org/job/flume-1.3.0/ws/flume-ng-legacy-sources/flume-thrift-source/pom.xml> to /home/hudson/hudson/jobs/flume-1.3.0/modules/org.apache.flume.flume-ng-legacy-sources$flume-thrift-source/builds/2012-09-07_01-13-55/archive/org.apache.flume.flume-ng-legacy-sources/flume-thrift-source/1.3.0-SNAPSHOT/flume-thrift-source-1.3.0-SNAPSHOT.pom
[JENKINS] Archiving <https://builds.apache.org/job/flume-1.3.0/ws/flume-ng-legacy-sources/flume-thrift-source/target/flume-thrift-source-1.3.0-SNAPSHOT.jar> to /home/hudson/hudson/jobs/flume-1.3.0/modules/org.apache.flume.flume-ng-legacy-sources$flume-thrift-source/builds/2012-09-07_01-13-55/archive/org.apache.flume.flume-ng-legacy-sources/flume-thrift-source/1.3.0-SNAPSHOT/flume-thrift-source-1.3.0-SNAPSHOT.jar
[JENKINS] Archiving <https://builds.apache.org/job/flume-1.3.0/ws/flume-ng-sources/flume-scribe-source/pom.xml> to /home/hudson/hudson/jobs/flume-1.3.0/modules/org.apache.flume.flume-ng-sources$flume-scribe-source/builds/2012-09-07_01-13-55/archive/org.apache.flume.flume-ng-sources/flume-scribe-source/1.3.0-SNAPSHOT/flume-scribe-source-1.3.0-SNAPSHOT.pom
[JENKINS] Archiving <https://builds.apache.org/job/flume-1.3.0/ws/flume-ng-sources/flume-scribe-source/target/flume-scribe-source-1.3.0-SNAPSHOT.jar> to /home/hudson/hudson/jobs/flume-1.3.0/modules/org.apache.flume.flume-ng-sources$flume-scribe-source/builds/2012-09-07_01-13-55/archive/org.apache.flume.flume-ng-sources/flume-scribe-source/1.3.0-SNAPSHOT/flume-scribe-source-1.3.0-SNAPSHOT.jar
[JENKINS] Archiving <https://builds.apache.org/job/flume-1.3.0/ws/flume-ng-tests/pom.xml> to /home/hudson/hudson/jobs/flume-1.3.0/modules/org.apache.flume$flume-ng-tests/builds/2012-09-07_01-13-55/archive/org.apache.flume/flume-ng-tests/1.3.0-SNAPSHOT/flume-ng-tests-1.3.0-SNAPSHOT.pom
[JENKINS] Archiving <https://builds.apache.org/job/flume-1.3.0/ws/flume-ng-sinks/flume-irc-sink/pom.xml> to /home/hudson/hudson/jobs/flume-1.3.0/modules/org.apache.flume.flume-ng-sinks$flume-irc-sink/builds/2012-09-07_01-13-55/archive/org.apache.flume.flume-ng-sinks/flume-irc-sink/1.3.0-SNAPSHOT/flume-irc-sink-1.3.0-SNAPSHOT.pom
[JENKINS] Archiving <https://builds.apache.org/job/flume-1.3.0/ws/flume-ng-sinks/flume-irc-sink/target/flume-irc-sink-1.3.0-SNAPSHOT.jar> to /home/hudson/hudson/jobs/flume-1.3.0/modules/org.apache.flume.flume-ng-sinks$flume-irc-sink/builds/2012-09-07_01-13-55/archive/org.apache.flume.flume-ng-sinks/flume-irc-sink/1.3.0-SNAPSHOT/flume-irc-sink-1.3.0-SNAPSHOT.jar
[JENKINS] Archiving <https://builds.apache.org/job/flume-1.3.0/ws/flume-ng-configuration/pom.xml> to /home/hudson/hudson/jobs/flume-1.3.0/modules/org.apache.flume$flume-ng-configuration/builds/2012-09-07_01-13-55/archive/org.apache.flume/flume-ng-configuration/1.3.0-SNAPSHOT/flume-ng-configuration-1.3.0-SNAPSHOT.pom
[JENKINS] Archiving <https://builds.apache.org/job/flume-1.3.0/ws/flume-ng-configuration/target/flume-ng-configuration-1.3.0-SNAPSHOT.jar> to /home/hudson/hudson/jobs/flume-1.3.0/modules/org.apache.flume$flume-ng-configuration/builds/2012-09-07_01-13-55/archive/org.apache.flume/flume-ng-configuration/1.3.0-SNAPSHOT/flume-ng-configuration-1.3.0-SNAPSHOT.jar
[JENKINS] Archiving <https://builds.apache.org/job/flume-1.3.0/ws/flume-ng-sdk/pom.xml> to /home/hudson/hudson/jobs/flume-1.3.0/modules/org.apache.flume$flume-ng-sdk/builds/2012-09-07_01-13-55/archive/org.apache.flume/flume-ng-sdk/1.3.0-SNAPSHOT/flume-ng-sdk-1.3.0-SNAPSHOT.pom
[JENKINS] Archiving <https://builds.apache.org/job/flume-1.3.0/ws/flume-ng-sdk/target/flume-ng-sdk-1.3.0-SNAPSHOT.jar> to /home/hudson/hudson/jobs/flume-1.3.0/modules/org.apache.flume$flume-ng-sdk/builds/2012-09-07_01-13-55/archive/org.apache.flume/flume-ng-sdk/1.3.0-SNAPSHOT/flume-ng-sdk-1.3.0-SNAPSHOT.jar
[JENKINS] Archiving <https://builds.apache.org/job/flume-1.3.0/ws/flume-ng-clients/pom.xml> to /home/hudson/hudson/jobs/flume-1.3.0/modules/org.apache.flume$flume-ng-clients/builds/2012-09-07_01-13-55/archive/org.apache.flume/flume-ng-clients/1.3.0-SNAPSHOT/flume-ng-clients-1.3.0-SNAPSHOT.pom
[JENKINS] Archiving <https://builds.apache.org/job/flume-1.3.0/ws/flume-ng-dist/pom.xml> to /home/hudson/hudson/jobs/flume-1.3.0/modules/org.apache.flume$flume-ng-dist/builds/2012-09-07_01-13-55/archive/org.apache.flume/flume-ng-dist/1.3.0-SNAPSHOT/flume-ng-dist-1.3.0-SNAPSHOT.pom
[JENKINS] Archiving <https://builds.apache.org/job/flume-1.3.0/ws/pom.xml> to /home/hudson/hudson/jobs/flume-1.3.0/modules/org.apache.flume$flume-parent/builds/2012-09-07_01-13-55/archive/org.apache.flume/flume-parent/1.3.0-SNAPSHOT/flume-parent-1.3.0-SNAPSHOT.pom
[JENKINS] Archiving <https://builds.apache.org/job/flume-1.3.0/ws/target/flume-parent-1.3.0-SNAPSHOT-javadoc.jar> to /home/hudson/hudson/jobs/flume-1.3.0/modules/org.apache.flume$flume-parent/builds/2012-09-07_01-13-55/archive/org.apache.flume/flume-parent/1.3.0-SNAPSHOT/flume-parent-1.3.0-SNAPSHOT-javadoc.jar
[JENKINS] Archiving <https://builds.apache.org/job/flume-1.3.0/ws/target/flume-parent-1.3.0-SNAPSHOT-site.xml> to /home/hudson/hudson/jobs/flume-1.3.0/modules/org.apache.flume$flume-parent/builds/2012-09-07_01-13-55/archive/org.apache.flume/flume-parent/1.3.0-SNAPSHOT/flume-parent-1.3.0-SNAPSHOT-site.xml
[JENKINS] Archiving <https://builds.apache.org/job/flume-1.3.0/ws/flume-ng-channels/flume-recoverable-memory-channel/pom.xml> to /home/hudson/hudson/jobs/flume-1.3.0/modules/org.apache.flume.flume-ng-channels$flume-recoverable-memory-channel/builds/2012-09-07_01-13-55/archive/org.apache.flume.flume-ng-channels/flume-recoverable-memory-channel/1.3.0-SNAPSHOT/flume-recoverable-memory-channel-1.3.0-SNAPSHOT.pom
[JENKINS] Archiving <https://builds.apache.org/job/flume-1.3.0/ws/flume-ng-channels/flume-recoverable-memory-channel/target/flume-recoverable-memory-channel-1.3.0-SNAPSHOT.jar> to /home/hudson/hudson/jobs/flume-1.3.0/modules/org.apache.flume.flume-ng-channels$flume-recoverable-memory-channel/builds/2012-09-07_01-13-55/archive/org.apache.flume.flume-ng-channels/flume-recoverable-memory-channel/1.3.0-SNAPSHOT/flume-recoverable-memory-channel-1.3.0-SNAPSHOT.jar
[JENKINS] Archiving <https://builds.apache.org/job/flume-1.3.0/ws/flume-ng-sinks/flume-ng-hbase-sink/pom.xml> to /home/hudson/hudson/jobs/flume-1.3.0/modules/org.apache.flume.flume-ng-sinks$flume-ng-hbase-sink/builds/2012-09-07_01-13-55/archive/org.apache.flume.flume-ng-sinks/flume-ng-hbase-sink/1.3.0-SNAPSHOT/flume-ng-hbase-sink-1.3.0-SNAPSHOT.pom
[JENKINS] Archiving <https://builds.apache.org/job/flume-1.3.0/ws/flume-ng-clients/flume-ng-log4jappender/pom.xml> to /home/hudson/hudson/jobs/flume-1.3.0/modules/org.apache.flume.flume-ng-clients$flume-ng-log4jappender/builds/2012-09-07_01-13-55/archive/org.apache.flume.flume-ng-clients/flume-ng-log4jappender/1.3.0-SNAPSHOT/flume-ng-log4jappender-1.3.0-SNAPSHOT.pom
[JENKINS] Archiving <https://builds.apache.org/job/flume-1.3.0/ws/flume-ng-channels/pom.xml> to /home/hudson/hudson/jobs/flume-1.3.0/modules/org.apache.flume$flume-ng-channels/builds/2012-09-07_01-13-55/archive/org.apache.flume/flume-ng-channels/1.3.0-SNAPSHOT/flume-ng-channels-1.3.0-SNAPSHOT.pom
[JENKINS] Archiving <https://builds.apache.org/job/flume-1.3.0/ws/flume-ng-sinks/pom.xml> to /home/hudson/hudson/jobs/flume-1.3.0/modules/org.apache.flume$flume-ng-sinks/builds/2012-09-07_01-13-55/archive/org.apache.flume/flume-ng-sinks/1.3.0-SNAPSHOT/flume-ng-sinks-1.3.0-SNAPSHOT.pom
[JENKINS] Archiving <https://builds.apache.org/job/flume-1.3.0/ws/flume-ng-channels/flume-jdbc-channel/pom.xml> to /home/hudson/hudson/jobs/flume-1.3.0/modules/org.apache.flume.flume-ng-channels$flume-jdbc-channel/builds/2012-09-07_01-13-55/archive/org.apache.flume.flume-ng-channels/flume-jdbc-channel/1.3.0-SNAPSHOT/flume-jdbc-channel-1.3.0-SNAPSHOT.pom
[JENKINS] Archiving <https://builds.apache.org/job/flume-1.3.0/ws/flume-ng-channels/flume-jdbc-channel/target/flume-jdbc-channel-1.3.0-SNAPSHOT.jar> to /home/hudson/hudson/jobs/flume-1.3.0/modules/org.apache.flume.flume-ng-channels$flume-jdbc-channel/builds/2012-09-07_01-13-55/archive/org.apache.flume.flume-ng-channels/flume-jdbc-channel/1.3.0-SNAPSHOT/flume-jdbc-channel-1.3.0-SNAPSHOT.jar
Waiting for Jenkins to finish collecting data
mavenExecutionResult exceptions not empty
message : Failed to execute goal org.apache.maven.plugins:maven-compiler-plugin:2.3.2:compile (default-compile) on project flume-ng-hbase-sink: Compilation failure
cause : Compilation failure
Stack trace :
org.apache.maven.lifecycle.LifecycleExecutionException: Failed to execute goal org.apache.maven.plugins:maven-compiler-plugin:2.3.2:compile (default-compile) on project flume-ng-hbase-sink: Compilation failure
at org.apache.maven.lifecycle.internal.MojoExecutor.execute(MojoExecutor.java:213)
at org.apache.maven.lifecycle.internal.MojoExecutor.execute(MojoExecutor.java:153)
at org.apache.maven.lifecycle.internal.MojoExecutor.execute(MojoExecutor.java:145)
at org.apache.maven.lifecycle.internal.LifecycleModuleBuilder.buildProject(LifecycleModuleBuilder.java:84)
at org.apache.maven.lifecycle.internal.LifecycleModuleBuilder.buildProject(LifecycleModuleBuilder.java:59)
at org.apache.maven.lifecycle.internal.LifecycleStarter.singleThreadedBuild(LifecycleStarter.java:183)
at org.apache.maven.lifecycle.internal.LifecycleStarter.execute(LifecycleStarter.java:161)
at org.apache.maven.DefaultMaven.doExecute(DefaultMaven.java:319)
at org.apache.maven.DefaultMaven.execute(DefaultMaven.java:156)
at org.jvnet.hudson.maven3.launcher.Maven3Launcher.main(Maven3Launcher.java:79)
at sun.reflect.NativeMethodAccessorImpl.invoke0(Native Method)
at sun.reflect.NativeMethodAccessorImpl.invoke(NativeMethodAccessorImpl.java:39)
at sun.reflect.DelegatingMethodAccessorImpl.invoke(DelegatingMethodAccessorImpl.java:25)
at java.lang.reflect.Method.invoke(Method.java:597)
at org.codehaus.plexus.classworlds.launcher.Launcher.launchStandard(Launcher.java:329)
at org.codehaus.plexus.classworlds.launcher.Launcher.launch(Launcher.java:239)
at org.jvnet.hudson.maven3.agent.Maven3Main.launch(Maven3Main.java:158)
at hudson.maven.Maven3Builder.call(Maven3Builder.java:98)
at hudson.maven.Maven3Builder.call(Maven3Builder.java:64)
at hudson.remoting.UserRequest.perform(UserRequest.java:118)
at hudson.remoting.UserRequest.perform(UserRequest.java:48)
at hudson.remoting.Request$2.run(Request.java:326)
at hudson.remoting.InterceptingExecutorService$1.call(InterceptingExecutorService.java:72)
at java.util.concurrent.FutureTask$Sync.innerRun(FutureTask.java:303)
at java.util.concurrent.FutureTask.run(FutureTask.java:138)
at java.util.concurrent.ThreadPoolExecutor$Worker.runTask(ThreadPoolExecutor.java:886)
at java.util.concurrent.ThreadPoolExecutor$Worker.run(ThreadPoolExecutor.java:908)
at java.lang.Thread.run(Thread.java:662)
Caused by: org.apache.maven.plugin.CompilationFailureException: Compilation failure
at org.apache.maven.plugin.AbstractCompilerMojo.execute(AbstractCompilerMojo.java:656)
at org.apache.maven.plugin.CompilerMojo.execute(CompilerMojo.java:128)
at org.apache.maven.plugin.DefaultBuildPluginManager.executeMojo(DefaultBuildPluginManager.java:101)
at org.apache.maven.lifecycle.internal.MojoExecutor.execute(MojoExecutor.java:209)
... 27 more
message : Failed to execute goal org.apache.maven.plugins:maven-compiler-plugin:2.3.2:testCompile (default-testCompile) on project flume-ng-log4jappender: Compilation failure
cause : Compilation failure
Stack trace :
org.apache.maven.lifecycle.LifecycleExecutionException: Failed to execute goal org.apache.maven.plugins:maven-compiler-plugin:2.3.2:testCompile (default-testCompile) on project flume-ng-log4jappender: Compilation failure
at org.apache.maven.lifecycle.internal.MojoExecutor.execute(MojoExecutor.java:213)
at org.apache.maven.lifecycle.internal.MojoExecutor.execute(MojoExecutor.java:153)
at org.apache.maven.lifecycle.internal.MojoExecutor.execute(MojoExecutor.java:145)
at org.apache.maven.lifecycle.internal.LifecycleModuleBuilder.buildProject(LifecycleModuleBuilder.java:84)
at org.apache.maven.lifecycle.internal.LifecycleModuleBuilder.buildProject(LifecycleModuleBuilder.java:59)
at org.apache.maven.lifecycle.internal.LifecycleStarter.singleThreadedBuild(LifecycleStarter.java:183)
at org.apache.maven.lifecycle.internal.LifecycleStarter.execute(LifecycleStarter.java:161)
at org.apache.maven.DefaultMaven.doExecute(DefaultMaven.java:319)
at org.apache.maven.DefaultMaven.execute(DefaultMaven.java:156)
at org.jvnet.hudson.maven3.launcher.Maven3Launcher.main(Maven3Launcher.java:79)
at sun.reflect.NativeMethodAccessorImpl.invoke0(Native Method)
at sun.reflect.NativeMethodAccessorImpl.invoke(NativeMethodAccessorImpl.java:39)
at sun.reflect.DelegatingMethodAccessorImpl.invoke(DelegatingMethodAccessorImpl.java:25)
at java.lang.reflect.Method.invoke(Method.java:597)
at org.codehaus.plexus.classworlds.launcher.Launcher.launchStandard(Launcher.java:329)
at org.codehaus.plexus.classworlds.launcher.Launcher.launch(Launcher.java:239)
at org.jvnet.hudson.maven3.agent.Maven3Main.launch(Maven3Main.java:158)
at hudson.maven.Maven3Builder.call(Maven3Builder.java:98)
at hudson.maven.Maven3Builder.call(Maven3Builder.java:64)
at hudson.remoting.UserRequest.perform(UserRequest.java:118)
at hudson.remoting.UserRequest.perform(UserRequest.java:48)
at hudson.remoting.Request$2.run(Request.java:326)
at hudson.remoting.InterceptingExecutorService$1.call(InterceptingExecutorService.java:72)
at java.util.concurrent.FutureTask$Sync.innerRun(FutureTask.java:303)
at java.util.concurrent.FutureTask.run(FutureTask.java:138)
at java.util.concurrent.ThreadPoolExecutor$Worker.runTask(ThreadPoolExecutor.java:886)
at java.util.concurrent.ThreadPoolExecutor$Worker.run(ThreadPoolExecutor.java:908)
at java.lang.Thread.run(Thread.java:662)
Caused by: org.apache.maven.plugin.CompilationFailureException: Compilation failure
at org.apache.maven.plugin.AbstractCompilerMojo.execute(AbstractCompilerMojo.java:656)
at org.apache.maven.plugin.TestCompilerMojo.execute(TestCompilerMojo.java:161)
at org.apache.maven.plugin.DefaultBuildPluginManager.executeMojo(DefaultBuildPluginManager.java:101)
at org.apache.maven.lifecycle.internal.MojoExecutor.execute(MojoExecutor.java:209)
... 27 more
message : Failed to execute goal org.apache.maven.plugins:maven-compiler-plugin:2.3.2:testCompile (default-testCompile) on project flume-ng-tests: Compilation failure
cause : Compilation failure
Stack trace :
org.apache.maven.lifecycle.LifecycleExecutionException: Failed to execute goal org.apache.maven.plugins:maven-compiler-plugin:2.3.2:testCompile (default-testCompile) on project flume-ng-tests: Compilation failure
at org.apache.maven.lifecycle.internal.MojoExecutor.execute(MojoExecutor.java:213)
at org.apache.maven.lifecycle.internal.MojoExecutor.execute(MojoExecutor.java:153)
at org.apache.maven.lifecycle.internal.MojoExecutor.execute(MojoExecutor.java:145)
at org.apache.maven.lifecycle.internal.LifecycleModuleBuilder.buildProject(LifecycleModuleBuilder.java:84)
at org.apache.maven.lifecycle.internal.LifecycleModuleBuilder.buildProject(LifecycleModuleBuilder.java:59)
at org.apache.maven.lifecycle.internal.LifecycleStarter.singleThreadedBuild(LifecycleStarter.java:183)
at org.apache.maven.lifecycle.internal.LifecycleStarter.execute(LifecycleStarter.java:161)
at org.apache.maven.DefaultMaven.doExecute(DefaultMaven.java:319)
at org.apache.maven.DefaultMaven.execute(DefaultMaven.java:156)
at org.jvnet.hudson.maven3.launcher.Maven3Launcher.main(Maven3Launcher.java:79)
at sun.reflect.NativeMethodAccessorImpl.invoke0(Native Method)
at sun.reflect.NativeMethodAccessorImpl.invoke(NativeMethodAccessorImpl.java:39)
at sun.reflect.DelegatingMethodAccessorImpl.invoke(DelegatingMethodAccessorImpl.java:25)
at java.lang.reflect.Method.invoke(Method.java:597)
at org.codehaus.plexus.classworlds.launcher.Launcher.launchStandard(Launcher.java:329)
at org.codehaus.plexus.classworlds.launcher.Launcher.launch(Launcher.java:239)
at org.jvnet.hudson.maven3.agent.Maven3Main.launch(Maven3Main.java:158)
at hudson.maven.Maven3Builder.call(Maven3Builder.java:98)
at hudson.maven.Maven3Builder.call(Maven3Builder.java:64)
at hudson.remoting.UserRequest.perform(UserRequest.java:118)
at hudson.remoting.UserRequest.perform(UserRequest.java:48)
at hudson.remoting.Request$2.run(Request.java:326)
at hudson.remoting.InterceptingExecutorService$1.call(InterceptingExecutorService.java:72)
at java.util.concurrent.FutureTask$Sync.innerRun(FutureTask.java:303)
at java.util.concurrent.FutureTask.run(FutureTask.java:138)
at java.util.concurrent.ThreadPoolExecutor$Worker.runTask(ThreadPoolExecutor.java:886)
at java.util.concurrent.ThreadPoolExecutor$Worker.run(ThreadPoolExecutor.java:908)
at java.lang.Thread.run(Thread.java:662)
Caused by: org.apache.maven.plugin.CompilationFailureException: Compilation failure
at org.apache.maven.plugin.AbstractCompilerMojo.execute(AbstractCompilerMojo.java:656)
at org.apache.maven.plugin.TestCompilerMojo.execute(TestCompilerMojo.java:161)
at org.apache.maven.plugin.DefaultBuildPluginManager.executeMojo(DefaultBuildPluginManager.java:101)
at org.apache.maven.lifecycle.internal.MojoExecutor.execute(MojoExecutor.java:209)
... 27 more
Maven failed with error.
channel stopped
[WARNINGS] Skipping publisher since build result is FAILURE
Updating FLUME-1526
Updating FLUME-1541
Updating FLUME-1509
Updating FLUME-1507
Build failed in Jenkins: flume-1.3.0 #13
Posted by Apache Jenkins Server <je...@builds.apache.org>.
See <https://builds.apache.org/job/flume-1.3.0/13/changes>
Changes:
[brock] FLUME-1662: Convert null body in events into zero length arrays
[hshreedharan] FLUME-1652. Logutils.getLogs could throw NPE.
[hshreedharan] FLUME-1664. Logutils.getLogs remove unneeded directory check.
[brock] FLUME-1371: ElasticSearch Sink
[brock] FLUME-1371: ElasticSearch Sink
[hshreedharan] FLUME-1645. Add hdfs.fileSuffix property to HDFSEventSink.
[brock] FLUME-1659: JSON Handler should return simple events, not JSONEvents
[brock] FLUME-946: Allow multiplexing channel selector to specify optional channels
[brock] FLUME-1653: Update Hadoop-23 profile to point to hadoop-2 alpha artifacts
[brock] FLUME-1671: Add support for custom components to MonitoredCounterGroup
[hshreedharan] FLUME-1675. Ignore netbeans config files in rat & git.
[mpercy] FLUME-1673. MonitoredCounterGroup publishes this reference to platform MBean server in constructor.
[mpercy] FLUME-1425. Create a SpoolDirectory Source and Client.
[brock] FLUME-1681: Disable empty-file unit test for Spooling File Reader
[brock] FLUME-1683: Fix Time Granularity Bug in SpoolingFileLineReader
[hshreedharan] FLUME-1629. Add Audience/Stability annotations
[hshreedharan] FLUME-1684. Re-enable empty file unit test
[hshreedharan] FLUME-1656. flume-ng script disregards stderr from hadoop command when finding hadoop jars.
[brock] FLUME-1690: Elastic Search Sink doesn't run it's unit tests
[hshreedharan] FLUME-1655. Doc update needed for Regex Filtering Interceptor
[brock] FLUME-1689: BodyTextSerializer should allow an option not to add a newline to each serialized event
[mpercy] FLUME-1277. Error parsing Syslog rfc 3164 messages with null values.
[brock] FLUME-1692: MultiportSyslogTCPSource user documentation and nickname
[brock] FLUME-1693: Update release notes
[jarcec] FLUME-1694: Fix LICENSE file for binary artifacts
[brock] FLUME-1696: Fix tarball names and directories
[brock] FLUME-1696: Update build instructions as Flume build requires more memory
[brock] FLUME-1697: Update CHANGELOG after 1.3.0 RC0
[brock] FLUME-1698: Update RELEASE-NOTES
[brock] FLUME-1701: StagedInstall has -dist hard coded
[mpercy] FLUME-1705. SpoolDirectory short name points at the wrong class.
[will] FLUME-1706. Website for 1.3 fails to build.
[mpercy] FLUME-1707. Update FlumeDevGuide
[brock] FLUME-1657: Regex Extractor Interceptor
[brock] Revert "FLUME-1657: Regex Extractor Interceptor"
[brock] FLUME-1657: Regex Extractor Interceptor
[brock] FLUME-1712: Regex Extractor Interceptor tests have timezone issues
[brock] FLUME-1711: Update Flume User Guide
[brock] FLUME-1716: Update CHANGELOG for rc3
[brock] FLUME-1720: LICENSE file contain entry for protobuf-<version>.jar, however proper artifact name is protobuf-java-<version>.jar
[hshreedharan] FLUME-1723. AsyncHBase and Avro bring in different versions of Netty.
[mpercy] FLUME-1719. Example export command in README do not properly close the string
[brock] FLUME-1660. Close "idle" hdfs handles.
[brock] FLUME-1736: SpoolingFileLineReader must close the reader before renaming
[brock] FLUME-1727: Update CHANGELOG for rc4
[brock] FLUME-1728: Upate CHANGELOG for flume-1.3.0 rc4 to include FLUME-1660
[brock] FLUME-1729: Add sign profile to sign/calculate hash of jars
------------------------------------------
[...truncated 7816 lines...]
[INFO]
[INFO] --- maven-compiler-plugin:2.3.2:testCompile (default-testCompile) @ flume-ng-tests ---
mojoSucceeded org.apache.maven.plugins:maven-compiler-plugin:2.3.2(default-testCompile)
mojoStarted org.apache.maven.plugins:maven-surefire-plugin:2.12(default-test)[INFO] Surefire report directory: <https://builds.apache.org/job/flume-1.3.0/ws/flume-ng-tests/target/surefire-reports>
-------------------------------------------------------
T E S T S
-------------------------------------------------------
-------------------------------------------------------
T E S T S
-------------------------------------------------------
[INFO]
[INFO] --- maven-surefire-plugin:2.12:test (default-test) @ flume-ng-tests ---
Running org.apache.flume.test.agent.TestFileChannel
Tests run: 1, Failures: 0, Errors: 0, Skipped: 0, Time elapsed: 17.92 sec
Running org.apache.flume.test.agent.TestRpcClientCommunicationFailure
Tests run: 1, Failures: 0, Errors: 0, Skipped: 0, Time elapsed: 8.137 sec
Running org.apache.flume.test.agent.TestRpcClient
Tests run: 1, Failures: 0, Errors: 0, Skipped: 0, Time elapsed: 8.245 sec
Results :
Tests run: 3, Failures: 0, Errors: 0, Skipped: 0
mojoSucceeded org.apache.maven.plugins:maven-surefire-plugin:2.12(default-test)
[JENKINS] Recording test results
mojoStarted org.apache.rat:apache-rat-plugin:0.7(test.rat)[INFO] Exclude: .idea/
[INFO] Exclude: **/*.iml
[INFO] Exclude: **/nb-configuration.xml
[INFO] Exclude: .git/
[INFO] Exclude: .gitignore
[INFO] Exclude: .repository/
[INFO] Exclude: **/*.diff
[INFO] Exclude: **/*.patch
[INFO] Exclude: **/*.avsc
[INFO] Exclude: **/docs/**
[INFO]
[INFO] --- apache-rat-plugin:0.7:check (test.rat) @ flume-ng-tests ---
mojoSucceeded org.apache.rat:apache-rat-plugin:0.7(test.rat)
mojoStarted org.apache.maven.plugins:maven-jar-plugin:2.3.1(default-jar)
[INFO] [INFO] Building jar: <https://builds.apache.org/job/flume-1.3.0/ws/flume-ng-tests/target/flume-ng-tests-1.3.0.jar>
[INFO] --- maven-jar-plugin:2.3.1:jar (default-jar) @ flume-ng-tests ---
mojoSucceeded org.apache.maven.plugins:maven-jar-plugin:2.3.1(default-jar)
Downloading: http://repo1.maven.org/maven2/com/stumbleupon/async/maven-metadata.xml
Downloading: http://repo1.maven.org/maven2/com/stumbleupon/async/maven-metadata.xml
Downloading: http://repository.apache.org/snapshots/com/stumbleupon/async/maven-metadata.xml
Downloading: http://repository.jboss.org/nexus/content/groups/public/com/stumbleupon/async/maven-metadata.xml
Downloaded: http://repo1.maven.org/maven2/com/stumbleupon/async/maven-metadata.xml (389 B at 38.0 KB/sec)
Downloaded: http://repo1.maven.org/maven2/com/stumbleupon/async/maven-metadata.xml (389 B at 42.2 KB/sec)
Downloading: https://oss.sonatype.org/content/repositories/snapshots/com/stumbleupon/async/maven-metadata.xml
Downloaded: http://repository.jboss.org/nexus/content/groups/public/com/stumbleupon/async/maven-metadata.xml (358 B at 2.2 KB/sec)
Downloaded: https://oss.sonatype.org/content/repositories/snapshots/com/stumbleupon/async/maven-metadata.xml (361 B at 0.5 KB/sec)
Downloading: http://repo1.maven.org/maven2/org/apache/zookeeper/zookeeper/maven-metadata.xml
Downloading: http://repository.jboss.org/nexus/content/groups/public/org/apache/zookeeper/zookeeper/maven-metadata.xml
Downloading: http://repository.apache.org/snapshots/org/apache/zookeeper/zookeeper/maven-metadata.xml
Downloading: http://repo1.maven.org/maven2/org/apache/zookeeper/zookeeper/maven-metadata.xml
Downloaded: http://repo1.maven.org/maven2/org/apache/zookeeper/zookeeper/maven-metadata.xml (708 B at 115.2 KB/sec)
Downloading: https://oss.sonatype.org/content/repositories/snapshots/org/apache/zookeeper/zookeeper/maven-metadata.xml
Downloaded: http://repo1.maven.org/maven2/org/apache/zookeeper/zookeeper/maven-metadata.xml (708 B at 115.2 KB/sec)
Downloading: http://repo1.maven.org/maven2/org/slf4j/jcl-over-slf4j/maven-metadata.xml
Downloading: http://repository.jboss.org/nexus/content/groups/public/org/slf4j/jcl-over-slf4j/maven-metadata.xml
Downloading: http://repository.apache.org/snapshots/org/slf4j/jcl-over-slf4j/maven-metadata.xml
Downloading: http://repo1.maven.org/maven2/org/slf4j/jcl-over-slf4j/maven-metadata.xml
Downloaded: http://repo1.maven.org/maven2/org/slf4j/jcl-over-slf4j/maven-metadata.xml (2 KB at 171.5 KB/sec)
Downloaded: http://repo1.maven.org/maven2/org/slf4j/jcl-over-slf4j/maven-metadata.xml (2 KB at 171.5 KB/sec)
Downloading: https://oss.sonatype.org/content/repositories/snapshots/org/slf4j/jcl-over-slf4j/maven-metadata.xml
Downloading: http://repository.jboss.org/nexus/content/groups/public/com/stumbleupon/async/maven-metadata.xml
Downloading: http://repo1.maven.org/maven2/com/stumbleupon/async/maven-metadata.xml
Downloading: http://repo1.maven.org/maven2/com/stumbleupon/async/maven-metadata.xml
Downloading: http://repository.apache.org/snapshots/com/stumbleupon/async/maven-metadata.xml
Downloaded: http://repo1.maven.org/maven2/com/stumbleupon/async/maven-metadata.xml (389 B at 76.0 KB/sec)
Downloaded: http://repo1.maven.org/maven2/com/stumbleupon/async/maven-metadata.xml (389 B at 76.0 KB/sec)
Downloading: https://oss.sonatype.org/content/repositories/snapshots/com/stumbleupon/async/maven-metadata.xml
Downloaded: http://repository.jboss.org/nexus/content/groups/public/com/stumbleupon/async/maven-metadata.xml (358 B at 1.8 KB/sec)
Downloaded: https://oss.sonatype.org/content/repositories/snapshots/com/stumbleupon/async/maven-metadata.xml (361 B at 0.5 KB/sec)
Downloading: http://repo1.maven.org/maven2/org/apache/zookeeper/zookeeper/maven-metadata.xml
Downloading: http://repository.jboss.org/nexus/content/groups/public/org/apache/zookeeper/zookeeper/maven-metadata.xml
Downloading: http://repository.apache.org/snapshots/org/apache/zookeeper/zookeeper/maven-metadata.xml
Downloading: http://repo1.maven.org/maven2/org/apache/zookeeper/zookeeper/maven-metadata.xml
Downloaded: http://repo1.maven.org/maven2/org/apache/zookeeper/zookeeper/maven-metadata.xml (708 B at 115.2 KB/sec)
Downloaded: http://repo1.maven.org/maven2/org/apache/zookeeper/zookeeper/maven-metadata.xml (708 B at 98.8 KB/sec)
Downloading: https://oss.sonatype.org/content/repositories/snapshots/org/apache/zookeeper/zookeeper/maven-metadata.xml
Downloading: http://repository.jboss.org/nexus/content/groups/public/org/slf4j/jcl-over-slf4j/maven-metadata.xml
Downloading: http://repo1.maven.org/maven2/org/slf4j/jcl-over-slf4j/maven-metadata.xml
Downloading: http://repository.apache.org/snapshots/org/slf4j/jcl-over-slf4j/maven-metadata.xml
Downloading: http://repo1.maven.org/maven2/org/slf4j/jcl-over-slf4j/maven-metadata.xml
Downloaded: http://repo1.maven.org/maven2/org/slf4j/jcl-over-slf4j/maven-metadata.xml (2 KB at 171.5 KB/sec)
Downloading: https://oss.sonatype.org/content/repositories/snapshots/org/slf4j/jcl-over-slf4j/maven-metadata.xml
Downloaded: http://repo1.maven.org/maven2/org/slf4j/jcl-over-slf4j/maven-metadata.xml (2 KB at 171.5 KB/sec)
mojoStarted org.apache.maven.plugins:maven-javadoc-plugin:2.8.1(javadoc-jar)
[INFO]
[INFO] --- maven-javadoc-plugin:2.8.1:aggregate-jar (javadoc-jar) @ flume-ng-tests ---
mojoSucceeded org.apache.maven.plugins:maven-javadoc-plugin:2.8.1(javadoc-jar)
[INFO] configuring report plugin org.apache.maven.plugins:maven-project-info-reports-plugin:2.4
mojoStarted org.apache.maven.plugins:maven-site-plugin:3.1(flume-site)[INFO] Parent project loaded from repository: org.apache:apache:pom:9
[INFO] Relativizing decoration links with respect to project URL: http://www.apache.org/flume-parent/flume-ng-tests/
[INFO] Rendering site with org.apache.maven.skins:maven-fluido-skin:jar:1.0 skin.
[INFO] Generating "Project Team" report --- maven-project-info-reports-plugin:2.4
[INFO] Generating "Mailing Lists" report --- maven-project-info-reports-plugin:2.4
[INFO]
[INFO] --- maven-site-plugin:3.1:site (flume-site) @ flume-ng-tests ---
[INFO] Generating "Issue Tracking" report --- maven-project-info-reports-plugin:2.4
[INFO] Generating "Project License" report --- maven-project-info-reports-plugin:2.4
mojoSucceeded org.apache.maven.plugins:maven-site-plugin:3.1(flume-site)
[JENKINS] Archiving site from <https://builds.apache.org/job/flume-1.3.0/ws/flume-ng-tests/target/site> to /home/hudson/hudson/jobs/flume-1.3.0/site/flume-ng-tests
mojoStarted org.apache.maven.plugins:maven-site-plugin:3.1(flume-site-dist)[INFO] Using this base directory for staging: <https://builds.apache.org/job/flume-1.3.0/ws/flume-ng-tests/target/docs>
[INFO] Parent project loaded from repository: org.apache:apache:pom:9
file://<https://builds.apache.org/job/flume-1.3.0/ws/flume-ng-tests/target/docs/> - Session: Opened
[INFO] Pushing <https://builds.apache.org/job/flume-1.3.0/ws/flume-ng-tests/target/site>
[INFO] >>> to file://<https://builds.apache.org/job/flume-1.3.0/ws/flume-ng-tests/target/docs/flume-ng-tests>
file://<https://builds.apache.org/job/flume-1.3.0/ws/flume-ng-tests/target/docs/> - Session: Disconnecting
file://<https://builds.apache.org/job/flume-1.3.0/ws/flume-ng-tests/target/docs/> - Session: Disconnected
[INFO]
[INFO] --- maven-site-plugin:3.1:stage (flume-site-dist) @ flume-ng-tests ---
mojoSucceeded org.apache.maven.plugins:maven-site-plugin:3.1(flume-site-dist)
mojoStarted org.apache.maven.plugins:maven-site-plugin:3.1(attach-descriptor)
[INFO]
[INFO] --- maven-site-plugin:3.1:attach-descriptor (attach-descriptor) @ flume-ng-tests ---
mojoSucceeded org.apache.maven.plugins:maven-site-plugin:3.1(attach-descriptor)
projectSucceeded org.apache.flume:flume-ng-tests:1.3.0
sessionEnded
[INFO] ------------------------------------------------------------------------
[INFO] Reactor Summary:
[INFO]
[INFO] Apache Flume ...................................... SUCCESS [1:56.473s]
[INFO] Flume NG SDK ...................................... SUCCESS [1:19.761s]
[INFO] Flume NG Configuration ............................ SUCCESS [11.102s]
[INFO] Flume NG Core ..................................... SUCCESS [3:02.576s]
[INFO] Flume NG Sinks .................................... SUCCESS [8.091s]
[INFO] Flume NG HDFS Sink ................................ SUCCESS [48.042s]
[INFO] Flume NG IRC Sink ................................. SUCCESS [8.950s]
[INFO] Flume NG HBase Sink ............................... SUCCESS [1:26.629s]
[INFO] Flume NG ElasticSearch Sink ....................... SUCCESS [20.833s]
[INFO] Flume Sources ..................................... SUCCESS [7.477s]
[INFO] Flume Scribe Source ............................... SUCCESS [8.750s]
[INFO] Flume NG Channels ................................. SUCCESS [7.479s]
[INFO] Flume NG JDBC channel ............................. SUCCESS [48.318s]
[INFO] Flume NG Node ..................................... SUCCESS [30.577s]
[INFO] Flume NG file-based channel ....................... SUCCESS [4:07.392s]
[INFO] Flume NG file backed Memory channel ............... SUCCESS [34.813s]
[INFO] Flume legacy Sources .............................. SUCCESS [7.148s]
[INFO] Flume legacy Avro source .......................... SUCCESS [10.966s]
[INFO] Flume legacy Thrift Source ........................ SUCCESS [11.487s]
[INFO] Flume NG Clients .................................. SUCCESS [6.808s]
[INFO] Flume NG Log4j Appender ........................... SUCCESS [11.031s]
[INFO] Flume NG distribution ............................. SUCCESS [21.370s]
[INFO] Flume NG Integration Tests ........................ SUCCESS [46.080s]
[INFO] ------------------------------------------------------------------------
[INFO] BUILD SUCCESS
[INFO] ------------------------------------------------------------------------
[INFO] Total time: 17:49.649s
[INFO] Finished at: Tue Nov 20 21:27:08 UTC 2012
[INFO] Final Memory: 208M/515M
[INFO] ------------------------------------------------------------------------
Projects to build: [MavenProject: org.apache.flume:flume-parent:1.3.0 @ <https://builds.apache.org/job/flume-1.3.0/ws/pom.xml,> MavenProject: org.apache.flume:flume-ng-sdk:1.3.0 @ <https://builds.apache.org/job/flume-1.3.0/ws/flume-ng-sdk/pom.xml,> MavenProject: org.apache.flume:flume-ng-configuration:1.3.0 @ <https://builds.apache.org/job/flume-1.3.0/ws/flume-ng-configuration/pom.xml,> MavenProject: org.apache.flume:flume-ng-core:1.3.0 @ <https://builds.apache.org/job/flume-1.3.0/ws/flume-ng-core/pom.xml,> MavenProject: org.apache.flume:flume-ng-sinks:1.3.0 @ <https://builds.apache.org/job/flume-1.3.0/ws/flume-ng-sinks/pom.xml,> MavenProject: org.apache.flume.flume-ng-sinks:flume-hdfs-sink:1.3.0 @ <https://builds.apache.org/job/flume-1.3.0/ws/flume-ng-sinks/flume-hdfs-sink/pom.xml,> MavenProject: org.apache.flume.flume-ng-sinks:flume-irc-sink:1.3.0 @ <https://builds.apache.org/job/flume-1.3.0/ws/flume-ng-sinks/flume-irc-sink/pom.xml,> MavenProject: org.apache.flume.flume-ng-sinks:flume-ng-hbase-sink:1.3.0 @ <https://builds.apache.org/job/flume-1.3.0/ws/flume-ng-sinks/flume-ng-hbase-sink/pom.xml,> MavenProject: org.apache.flume.flume-ng-sinks:flume-ng-elasticsearch-sink:1.3.0 @ <https://builds.apache.org/job/flume-1.3.0/ws/flume-ng-sinks/flume-ng-elasticsearch-sink/pom.xml,> MavenProject: org.apache.flume:flume-ng-sources:1.3.0 @ <https://builds.apache.org/job/flume-1.3.0/ws/flume-ng-sources/pom.xml,> MavenProject: org.apache.flume.flume-ng-sources:flume-scribe-source:1.3.0 @ <https://builds.apache.org/job/flume-1.3.0/ws/flume-ng-sources/flume-scribe-source/pom.xml,> MavenProject: org.apache.flume:flume-ng-channels:1.3.0 @ <https://builds.apache.org/job/flume-1.3.0/ws/flume-ng-channels/pom.xml,> MavenProject: org.apache.flume.flume-ng-channels:flume-jdbc-channel:1.3.0 @ <https://builds.apache.org/job/flume-1.3.0/ws/flume-ng-channels/flume-jdbc-channel/pom.xml,> MavenProject: org.apache.flume:flume-ng-node:1.3.0 @ <https://builds.apache.org/job/flume-1.3.0/ws/flume-ng-node/pom.xml,> MavenProject: org.apache.flume.flume-ng-channels:flume-file-channel:1.3.0 @ <https://builds.apache.org/job/flume-1.3.0/ws/flume-ng-channels/flume-file-channel/pom.xml,> MavenProject: org.apache.flume.flume-ng-channels:flume-recoverable-memory-channel:1.3.0 @ <https://builds.apache.org/job/flume-1.3.0/ws/flume-ng-channels/flume-recoverable-memory-channel/pom.xml,> MavenProject: org.apache.flume:flume-ng-legacy-sources:1.3.0 @ <https://builds.apache.org/job/flume-1.3.0/ws/flume-ng-legacy-sources/pom.xml,> MavenProject: org.apache.flume.flume-ng-legacy-sources:flume-avro-source:1.3.0 @ <https://builds.apache.org/job/flume-1.3.0/ws/flume-ng-legacy-sources/flume-avro-source/pom.xml,> MavenProject: org.apache.flume.flume-ng-legacy-sources:flume-thrift-source:1.3.0 @ <https://builds.apache.org/job/flume-1.3.0/ws/flume-ng-legacy-sources/flume-thrift-source/pom.xml,> MavenProject: org.apache.flume:flume-ng-clients:1.3.0 @ <https://builds.apache.org/job/flume-1.3.0/ws/flume-ng-clients/pom.xml,> MavenProject: org.apache.flume.flume-ng-clients:flume-ng-log4jappender:1.3.0 @ <https://builds.apache.org/job/flume-1.3.0/ws/flume-ng-clients/flume-ng-log4jappender/pom.xml,> MavenProject: org.apache.flume:flume-ng-dist:1.3.0 @ <https://builds.apache.org/job/flume-1.3.0/ws/flume-ng-dist/pom.xml,> MavenProject: org.apache.flume:flume-ng-tests:1.3.0 @ <https://builds.apache.org/job/flume-1.3.0/ws/flume-ng-tests/pom.xml]>
[JENKINS] Archiving <https://builds.apache.org/job/flume-1.3.0/ws/flume-ng-legacy-sources/pom.xml> to /home/hudson/hudson/jobs/flume-1.3.0/modules/org.apache.flume$flume-ng-legacy-sources/builds/2012-11-20_21-09-01/archive/org.apache.flume/flume-ng-legacy-sources/1.3.0/flume-ng-legacy-sources-1.3.0.pom
[JENKINS] Archiving <https://builds.apache.org/job/flume-1.3.0/ws/flume-ng-channels/flume-file-channel/pom.xml> to /home/hudson/hudson/jobs/flume-1.3.0/modules/org.apache.flume.flume-ng-channels$flume-file-channel/builds/2012-11-20_21-09-01/archive/org.apache.flume.flume-ng-channels/flume-file-channel/1.3.0/flume-file-channel-1.3.0.pom
[JENKINS] Archiving <https://builds.apache.org/job/flume-1.3.0/ws/flume-ng-channels/flume-file-channel/target/flume-file-channel-1.3.0.jar> to /home/hudson/hudson/jobs/flume-1.3.0/modules/org.apache.flume.flume-ng-channels$flume-file-channel/builds/2012-11-20_21-09-01/archive/org.apache.flume.flume-ng-channels/flume-file-channel/1.3.0/flume-file-channel-1.3.0.jar
[JENKINS] Archiving <https://builds.apache.org/job/flume-1.3.0/ws/flume-ng-core/pom.xml> to /home/hudson/hudson/jobs/flume-1.3.0/modules/org.apache.flume$flume-ng-core/builds/2012-11-20_21-09-01/archive/org.apache.flume/flume-ng-core/1.3.0/flume-ng-core-1.3.0.pom
[JENKINS] Archiving <https://builds.apache.org/job/flume-1.3.0/ws/flume-ng-core/target/flume-ng-core-1.3.0.jar> to /home/hudson/hudson/jobs/flume-1.3.0/modules/org.apache.flume$flume-ng-core/builds/2012-11-20_21-09-01/archive/org.apache.flume/flume-ng-core/1.3.0/flume-ng-core-1.3.0.jar
[JENKINS] Archiving <https://builds.apache.org/job/flume-1.3.0/ws/flume-ng-sinks/flume-ng-elasticsearch-sink/pom.xml> to /home/hudson/hudson/jobs/flume-1.3.0/modules/org.apache.flume.flume-ng-sinks$flume-ng-elasticsearch-sink/builds/2012-11-20_21-09-01/archive/org.apache.flume.flume-ng-sinks/flume-ng-elasticsearch-sink/1.3.0/flume-ng-elasticsearch-sink-1.3.0.pom
[JENKINS] Archiving <https://builds.apache.org/job/flume-1.3.0/ws/flume-ng-sinks/flume-ng-elasticsearch-sink/target/flume-ng-elasticsearch-sink-1.3.0.jar> to /home/hudson/hudson/jobs/flume-1.3.0/modules/org.apache.flume.flume-ng-sinks$flume-ng-elasticsearch-sink/builds/2012-11-20_21-09-01/archive/org.apache.flume.flume-ng-sinks/flume-ng-elasticsearch-sink/1.3.0/flume-ng-elasticsearch-sink-1.3.0.jar
[JENKINS] Archiving <https://builds.apache.org/job/flume-1.3.0/ws/flume-ng-sinks/flume-hdfs-sink/pom.xml> to /home/hudson/hudson/jobs/flume-1.3.0/modules/org.apache.flume.flume-ng-sinks$flume-hdfs-sink/builds/2012-11-20_21-09-01/archive/org.apache.flume.flume-ng-sinks/flume-hdfs-sink/1.3.0/flume-hdfs-sink-1.3.0.pom
[JENKINS] Archiving <https://builds.apache.org/job/flume-1.3.0/ws/flume-ng-sinks/flume-hdfs-sink/target/flume-hdfs-sink-1.3.0.jar> to /home/hudson/hudson/jobs/flume-1.3.0/modules/org.apache.flume.flume-ng-sinks$flume-hdfs-sink/builds/2012-11-20_21-09-01/archive/org.apache.flume.flume-ng-sinks/flume-hdfs-sink/1.3.0/flume-hdfs-sink-1.3.0.jar
[JENKINS] Archiving <https://builds.apache.org/job/flume-1.3.0/ws/flume-ng-sources/pom.xml> to /home/hudson/hudson/jobs/flume-1.3.0/modules/org.apache.flume$flume-ng-sources/builds/2012-11-20_21-09-01/archive/org.apache.flume/flume-ng-sources/1.3.0/flume-ng-sources-1.3.0.pom
[JENKINS] Archiving <https://builds.apache.org/job/flume-1.3.0/ws/flume-ng-legacy-sources/flume-avro-source/pom.xml> to /home/hudson/hudson/jobs/flume-1.3.0/modules/org.apache.flume.flume-ng-legacy-sources$flume-avro-source/builds/2012-11-20_21-09-01/archive/org.apache.flume.flume-ng-legacy-sources/flume-avro-source/1.3.0/flume-avro-source-1.3.0.pom
[JENKINS] Archiving <https://builds.apache.org/job/flume-1.3.0/ws/flume-ng-legacy-sources/flume-avro-source/target/flume-avro-source-1.3.0.jar> to /home/hudson/hudson/jobs/flume-1.3.0/modules/org.apache.flume.flume-ng-legacy-sources$flume-avro-source/builds/2012-11-20_21-09-01/archive/org.apache.flume.flume-ng-legacy-sources/flume-avro-source/1.3.0/flume-avro-source-1.3.0.jar
[JENKINS] Archiving <https://builds.apache.org/job/flume-1.3.0/ws/flume-ng-node/pom.xml> to /home/hudson/hudson/jobs/flume-1.3.0/modules/org.apache.flume$flume-ng-node/builds/2012-11-20_21-09-01/archive/org.apache.flume/flume-ng-node/1.3.0/flume-ng-node-1.3.0.pom
[JENKINS] Archiving <https://builds.apache.org/job/flume-1.3.0/ws/flume-ng-node/target/flume-ng-node-1.3.0.jar> to /home/hudson/hudson/jobs/flume-1.3.0/modules/org.apache.flume$flume-ng-node/builds/2012-11-20_21-09-01/archive/org.apache.flume/flume-ng-node/1.3.0/flume-ng-node-1.3.0.jar
[JENKINS] Archiving <https://builds.apache.org/job/flume-1.3.0/ws/flume-ng-legacy-sources/flume-thrift-source/pom.xml> to /home/hudson/hudson/jobs/flume-1.3.0/modules/org.apache.flume.flume-ng-legacy-sources$flume-thrift-source/builds/2012-11-20_21-09-01/archive/org.apache.flume.flume-ng-legacy-sources/flume-thrift-source/1.3.0/flume-thrift-source-1.3.0.pom
[JENKINS] Archiving <https://builds.apache.org/job/flume-1.3.0/ws/flume-ng-legacy-sources/flume-thrift-source/target/flume-thrift-source-1.3.0.jar> to /home/hudson/hudson/jobs/flume-1.3.0/modules/org.apache.flume.flume-ng-legacy-sources$flume-thrift-source/builds/2012-11-20_21-09-01/archive/org.apache.flume.flume-ng-legacy-sources/flume-thrift-source/1.3.0/flume-thrift-source-1.3.0.jar
[JENKINS] Archiving <https://builds.apache.org/job/flume-1.3.0/ws/flume-ng-sources/flume-scribe-source/pom.xml> to /home/hudson/hudson/jobs/flume-1.3.0/modules/org.apache.flume.flume-ng-sources$flume-scribe-source/builds/2012-11-20_21-09-01/archive/org.apache.flume.flume-ng-sources/flume-scribe-source/1.3.0/flume-scribe-source-1.3.0.pom
[JENKINS] Archiving <https://builds.apache.org/job/flume-1.3.0/ws/flume-ng-sources/flume-scribe-source/target/flume-scribe-source-1.3.0.jar> to /home/hudson/hudson/jobs/flume-1.3.0/modules/org.apache.flume.flume-ng-sources$flume-scribe-source/builds/2012-11-20_21-09-01/archive/org.apache.flume.flume-ng-sources/flume-scribe-source/1.3.0/flume-scribe-source-1.3.0.jar
[JENKINS] Archiving <https://builds.apache.org/job/flume-1.3.0/ws/flume-ng-tests/pom.xml> to /home/hudson/hudson/jobs/flume-1.3.0/modules/org.apache.flume$flume-ng-tests/builds/2012-11-20_21-09-01/archive/org.apache.flume/flume-ng-tests/1.3.0/flume-ng-tests-1.3.0.pom
[JENKINS] Archiving <https://builds.apache.org/job/flume-1.3.0/ws/flume-ng-tests/target/flume-ng-tests-1.3.0.jar> to /home/hudson/hudson/jobs/flume-1.3.0/modules/org.apache.flume$flume-ng-tests/builds/2012-11-20_21-09-01/archive/org.apache.flume/flume-ng-tests/1.3.0/flume-ng-tests-1.3.0.jar
[JENKINS] Archiving <https://builds.apache.org/job/flume-1.3.0/ws/flume-ng-sinks/flume-irc-sink/pom.xml> to /home/hudson/hudson/jobs/flume-1.3.0/modules/org.apache.flume.flume-ng-sinks$flume-irc-sink/builds/2012-11-20_21-09-01/archive/org.apache.flume.flume-ng-sinks/flume-irc-sink/1.3.0/flume-irc-sink-1.3.0.pom
[JENKINS] Archiving <https://builds.apache.org/job/flume-1.3.0/ws/flume-ng-sinks/flume-irc-sink/target/flume-irc-sink-1.3.0.jar> to /home/hudson/hudson/jobs/flume-1.3.0/modules/org.apache.flume.flume-ng-sinks$flume-irc-sink/builds/2012-11-20_21-09-01/archive/org.apache.flume.flume-ng-sinks/flume-irc-sink/1.3.0/flume-irc-sink-1.3.0.jar
[JENKINS] Archiving <https://builds.apache.org/job/flume-1.3.0/ws/flume-ng-configuration/pom.xml> to /home/hudson/hudson/jobs/flume-1.3.0/modules/org.apache.flume$flume-ng-configuration/builds/2012-11-20_21-09-01/archive/org.apache.flume/flume-ng-configuration/1.3.0/flume-ng-configuration-1.3.0.pom
[JENKINS] Archiving <https://builds.apache.org/job/flume-1.3.0/ws/flume-ng-configuration/target/flume-ng-configuration-1.3.0.jar> to /home/hudson/hudson/jobs/flume-1.3.0/modules/org.apache.flume$flume-ng-configuration/builds/2012-11-20_21-09-01/archive/org.apache.flume/flume-ng-configuration/1.3.0/flume-ng-configuration-1.3.0.jar
[JENKINS] Archiving <https://builds.apache.org/job/flume-1.3.0/ws/flume-ng-sdk/pom.xml> to /home/hudson/hudson/jobs/flume-1.3.0/modules/org.apache.flume$flume-ng-sdk/builds/2012-11-20_21-09-01/archive/org.apache.flume/flume-ng-sdk/1.3.0/flume-ng-sdk-1.3.0.pom
[JENKINS] Archiving <https://builds.apache.org/job/flume-1.3.0/ws/flume-ng-sdk/target/flume-ng-sdk-1.3.0.jar> to /home/hudson/hudson/jobs/flume-1.3.0/modules/org.apache.flume$flume-ng-sdk/builds/2012-11-20_21-09-01/archive/org.apache.flume/flume-ng-sdk/1.3.0/flume-ng-sdk-1.3.0.jar
[JENKINS] Archiving <https://builds.apache.org/job/flume-1.3.0/ws/flume-ng-clients/pom.xml> to /home/hudson/hudson/jobs/flume-1.3.0/modules/org.apache.flume$flume-ng-clients/builds/2012-11-20_21-09-01/archive/org.apache.flume/flume-ng-clients/1.3.0/flume-ng-clients-1.3.0.pom
[JENKINS] Archiving <https://builds.apache.org/job/flume-1.3.0/ws/flume-ng-dist/pom.xml> to /home/hudson/hudson/jobs/flume-1.3.0/modules/org.apache.flume$flume-ng-dist/builds/2012-11-20_21-09-01/archive/org.apache.flume/flume-ng-dist/1.3.0/flume-ng-dist-1.3.0.pom
[JENKINS] Archiving <https://builds.apache.org/job/flume-1.3.0/ws/flume-ng-dist/target/apache-flume-1.3.0-bin.tar.gz> to /home/hudson/hudson/jobs/flume-1.3.0/modules/org.apache.flume$flume-ng-dist/builds/2012-11-20_21-09-01/archive/org.apache.flume/flume-ng-dist/1.3.0/flume-ng-dist-1.3.0-bin.tar.gz
[JENKINS] Archiving <https://builds.apache.org/job/flume-1.3.0/ws/flume-ng-dist/target/apache-flume-1.3.0-src.tar.gz> to /home/hudson/hudson/jobs/flume-1.3.0/modules/org.apache.flume$flume-ng-dist/builds/2012-11-20_21-09-01/archive/org.apache.flume/flume-ng-dist/1.3.0/flume-ng-dist-1.3.0-src.tar.gz
[JENKINS] Archiving <https://builds.apache.org/job/flume-1.3.0/ws/pom.xml> to /home/hudson/hudson/jobs/flume-1.3.0/modules/org.apache.flume$flume-parent/builds/2012-11-20_21-09-01/archive/org.apache.flume/flume-parent/1.3.0/flume-parent-1.3.0.pom
[JENKINS] Archiving <https://builds.apache.org/job/flume-1.3.0/ws/target/flume-parent-1.3.0-javadoc.jar> to /home/hudson/hudson/jobs/flume-1.3.0/modules/org.apache.flume$flume-parent/builds/2012-11-20_21-09-01/archive/org.apache.flume/flume-parent/1.3.0/flume-parent-1.3.0-javadoc.jar
[JENKINS] Archiving <https://builds.apache.org/job/flume-1.3.0/ws/target/flume-parent-1.3.0-site.xml> to /home/hudson/hudson/jobs/flume-1.3.0/modules/org.apache.flume$flume-parent/builds/2012-11-20_21-09-01/archive/org.apache.flume/flume-parent/1.3.0/flume-parent-1.3.0-site.xml
[JENKINS] Archiving <https://builds.apache.org/job/flume-1.3.0/ws/flume-ng-channels/flume-recoverable-memory-channel/pom.xml> to /home/hudson/hudson/jobs/flume-1.3.0/modules/org.apache.flume.flume-ng-channels$flume-recoverable-memory-channel/builds/2012-11-20_21-09-01/archive/org.apache.flume.flume-ng-channels/flume-recoverable-memory-channel/1.3.0/flume-recoverable-memory-channel-1.3.0.pom
[JENKINS] Archiving <https://builds.apache.org/job/flume-1.3.0/ws/flume-ng-channels/flume-recoverable-memory-channel/target/flume-recoverable-memory-channel-1.3.0.jar> to /home/hudson/hudson/jobs/flume-1.3.0/modules/org.apache.flume.flume-ng-channels$flume-recoverable-memory-channel/builds/2012-11-20_21-09-01/archive/org.apache.flume.flume-ng-channels/flume-recoverable-memory-channel/1.3.0/flume-recoverable-memory-channel-1.3.0.jar
[JENKINS] Archiving <https://builds.apache.org/job/flume-1.3.0/ws/flume-ng-sinks/flume-ng-hbase-sink/pom.xml> to /home/hudson/hudson/jobs/flume-1.3.0/modules/org.apache.flume.flume-ng-sinks$flume-ng-hbase-sink/builds/2012-11-20_21-09-01/archive/org.apache.flume.flume-ng-sinks/flume-ng-hbase-sink/1.3.0/flume-ng-hbase-sink-1.3.0.pom
[JENKINS] Archiving <https://builds.apache.org/job/flume-1.3.0/ws/flume-ng-sinks/flume-ng-hbase-sink/target/flume-ng-hbase-sink-1.3.0.jar> to /home/hudson/hudson/jobs/flume-1.3.0/modules/org.apache.flume.flume-ng-sinks$flume-ng-hbase-sink/builds/2012-11-20_21-09-01/archive/org.apache.flume.flume-ng-sinks/flume-ng-hbase-sink/1.3.0/flume-ng-hbase-sink-1.3.0.jar
[JENKINS] Archiving <https://builds.apache.org/job/flume-1.3.0/ws/flume-ng-clients/flume-ng-log4jappender/pom.xml> to /home/hudson/hudson/jobs/flume-1.3.0/modules/org.apache.flume.flume-ng-clients$flume-ng-log4jappender/builds/2012-11-20_21-09-01/archive/org.apache.flume.flume-ng-clients/flume-ng-log4jappender/1.3.0/flume-ng-log4jappender-1.3.0.pom
[JENKINS] Archiving <https://builds.apache.org/job/flume-1.3.0/ws/flume-ng-clients/flume-ng-log4jappender/target/flume-ng-log4jappender-1.3.0.jar> to /home/hudson/hudson/jobs/flume-1.3.0/modules/org.apache.flume.flume-ng-clients$flume-ng-log4jappender/builds/2012-11-20_21-09-01/archive/org.apache.flume.flume-ng-clients/flume-ng-log4jappender/1.3.0/flume-ng-log4jappender-1.3.0.jar
[JENKINS] Archiving <https://builds.apache.org/job/flume-1.3.0/ws/flume-ng-channels/pom.xml> to /home/hudson/hudson/jobs/flume-1.3.0/modules/org.apache.flume$flume-ng-channels/builds/2012-11-20_21-09-01/archive/org.apache.flume/flume-ng-channels/1.3.0/flume-ng-channels-1.3.0.pom
[JENKINS] Archiving <https://builds.apache.org/job/flume-1.3.0/ws/flume-ng-sinks/pom.xml> to /home/hudson/hudson/jobs/flume-1.3.0/modules/org.apache.flume$flume-ng-sinks/builds/2012-11-20_21-09-01/archive/org.apache.flume/flume-ng-sinks/1.3.0/flume-ng-sinks-1.3.0.pom
[JENKINS] Archiving <https://builds.apache.org/job/flume-1.3.0/ws/flume-ng-channels/flume-jdbc-channel/pom.xml> to /home/hudson/hudson/jobs/flume-1.3.0/modules/org.apache.flume.flume-ng-channels$flume-jdbc-channel/builds/2012-11-20_21-09-01/archive/org.apache.flume.flume-ng-channels/flume-jdbc-channel/1.3.0/flume-jdbc-channel-1.3.0.pom
[JENKINS] Archiving <https://builds.apache.org/job/flume-1.3.0/ws/flume-ng-channels/flume-jdbc-channel/target/flume-jdbc-channel-1.3.0.jar> to /home/hudson/hudson/jobs/flume-1.3.0/modules/org.apache.flume.flume-ng-channels$flume-jdbc-channel/builds/2012-11-20_21-09-01/archive/org.apache.flume.flume-ng-channels/flume-jdbc-channel/1.3.0/flume-jdbc-channel-1.3.0.jar
Waiting for Jenkins to finish collecting data
channel stopped
[WARNINGS] Parsing warnings in console log with parser AcuCobol Compiler
Maven RedeployPublisher use remote ubuntu1 maven settings from : /home/jenkins/.m2/settings.xml
[INFO] Deployment in https://repository.apache.org/content/repositories/snapshots (id=apache.snapshots.https,uniqueVersion=true)
Deploying the main artifact flume-ng-channels-1.3.0.pom
Uploading: https://repository.apache.org/content/repositories/snapshots/org/apache/flume/flume-ng-channels/1.3.0/flume-ng-channels-1.3.0.pom
ERROR: Failed to deploy artifacts: Could not transfer artifact org.apache.flume:flume-ng-channels:pom:1.3.0 from/to apache.snapshots.https (https://repository.apache.org/content/repositories/snapshots): Failed to transfer file: https://repository.apache.org/content/repositories/snapshots/org/apache/flume/flume-ng-channels/1.3.0/flume-ng-channels-1.3.0.pom. Return code is: 400, ReasonPhrase:Bad Request.
org.apache.maven.artifact.deployer.ArtifactDeploymentException: Failed to deploy artifacts: Could not transfer artifact org.apache.flume:flume-ng-channels:pom:1.3.0 from/to apache.snapshots.https (https://repository.apache.org/content/repositories/snapshots): Failed to transfer file: https://repository.apache.org/content/repositories/snapshots/org/apache/flume/flume-ng-channels/1.3.0/flume-ng-channels-1.3.0.pom. Return code is: 400, ReasonPhrase:Bad Request.
at org.apache.maven.artifact.deployer.DefaultArtifactDeployer.deploy(DefaultArtifactDeployer.java:141)
at hudson.maven.reporters.MavenArtifactRecord.deploy(MavenArtifactRecord.java:190)
at hudson.maven.RedeployPublisher.perform(RedeployPublisher.java:174)
at hudson.tasks.BuildStepMonitor$1.perform(BuildStepMonitor.java:19)
at hudson.model.AbstractBuild$AbstractBuildExecution.perform(AbstractBuild.java:717)
at hudson.model.AbstractBuild$AbstractBuildExecution.performAllBuildSteps(AbstractBuild.java:692)
at hudson.maven.MavenModuleSetBuild$MavenModuleSetBuildExecution.post2(MavenModuleSetBuild.java:994)
at hudson.model.AbstractBuild$AbstractBuildExecution.post(AbstractBuild.java:639)
at hudson.model.Run.execute(Run.java:1527)
at hudson.maven.MavenModuleSetBuild.run(MavenModuleSetBuild.java:477)
at hudson.model.ResourceController.execute(ResourceController.java:88)
at hudson.model.Executor.run(Executor.java:236)
Caused by: org.sonatype.aether.deployment.DeploymentException: Failed to deploy artifacts: Could not transfer artifact org.apache.flume:flume-ng-channels:pom:1.3.0 from/to apache.snapshots.https (https://repository.apache.org/content/repositories/snapshots): Failed to transfer file: https://repository.apache.org/content/repositories/snapshots/org/apache/flume/flume-ng-channels/1.3.0/flume-ng-channels-1.3.0.pom. Return code is: 400, ReasonPhrase:Bad Request.
at org.sonatype.aether.impl.internal.DefaultDeployer.deploy(DefaultDeployer.java:280)
at org.sonatype.aether.impl.internal.DefaultDeployer.deploy(DefaultDeployer.java:211)
at org.sonatype.aether.impl.internal.DefaultRepositorySystem.deploy(DefaultRepositorySystem.java:443)
at org.apache.maven.artifact.deployer.DefaultArtifactDeployer.deploy(DefaultArtifactDeployer.java:137)
... 11 more
Caused by: org.sonatype.aether.transfer.ArtifactTransferException: Could not transfer artifact org.apache.flume:flume-ng-channels:pom:1.3.0 from/to apache.snapshots.https (https://repository.apache.org/content/repositories/snapshots): Failed to transfer file: https://repository.apache.org/content/repositories/snapshots/org/apache/flume/flume-ng-channels/1.3.0/flume-ng-channels-1.3.0.pom. Return code is: 400, ReasonPhrase:Bad Request.
at org.sonatype.aether.connector.wagon.WagonRepositoryConnector$4.wrap(WagonRepositoryConnector.java:951)
at org.sonatype.aether.connector.wagon.WagonRepositoryConnector$4.wrap(WagonRepositoryConnector.java:941)
at org.sonatype.aether.connector.wagon.WagonRepositoryConnector$PutTask.run(WagonRepositoryConnector.java:837)
at org.sonatype.aether.connector.wagon.WagonRepositoryConnector.put(WagonRepositoryConnector.java:467)
at org.sonatype.aether.impl.internal.DefaultDeployer.deploy(DefaultDeployer.java:274)
... 14 more
Caused by: org.apache.maven.wagon.TransferFailedException: Failed to transfer file: https://repository.apache.org/content/repositories/snapshots/org/apache/flume/flume-ng-channels/1.3.0/flume-ng-channels-1.3.0.pom. Return code is: 400, ReasonPhrase:Bad Request.
at org.apache.maven.wagon.shared.http4.AbstractHttpClientWagon.put(AbstractHttpClientWagon.java:562)
at org.apache.maven.wagon.shared.http4.AbstractHttpClientWagon.put(AbstractHttpClientWagon.java:471)
at org.apache.maven.wagon.shared.http4.AbstractHttpClientWagon.put(AbstractHttpClientWagon.java:451)
at org.sonatype.aether.connector.wagon.WagonRepositoryConnector$PutTask.run(WagonRepositoryConnector.java:811)
... 16 more
[INFO] Deployment failed after 0.42 sec
Build step 'Deploy artifacts to Maven repository' changed build result to FAILURE
Error updating JIRA issues. Saving issues for next build.
com.atlassian.jira.rpc.exception.RemotePermissionException: This issue does not exist or you don't have permission to view it.
Build failed in Jenkins: flume-1.3.0 #12
Posted by Apache Jenkins Server <je...@builds.apache.org>.
See <https://builds.apache.org/job/flume-1.3.0/12/changes>
Changes:
[mpercy] FLUME-1199. Add HTTP Post Source.
------------------------------------------
[...truncated 7506 lines...]
-------------------------------------------------------
T E S T S
-------------------------------------------------------
[INFO] --- maven-surefire-plugin:2.12:test (default-test) @ flume-ng-tests ---
Running org.apache.flume.test.agent.TestFileChannel
Tests run: 1, Failures: 0, Errors: 0, Skipped: 0, Time elapsed: 17.633 sec
Running org.apache.flume.test.agent.TestRpcClientCommunicationFailure
Tests run: 1, Failures: 0, Errors: 0, Skipped: 0, Time elapsed: 8.03 sec
Running org.apache.flume.test.agent.TestRpcClient
Tests run: 1, Failures: 0, Errors: 0, Skipped: 0, Time elapsed: 8.164 sec
Results :
Tests run: 3, Failures: 0, Errors: 0, Skipped: 0
mojoSucceeded org.apache.maven.plugins:maven-surefire-plugin:2.12(default-test)
[JENKINS] Recording test results
mojoStarted org.apache.rat:apache-rat-plugin:0.7(test.rat)[INFO] Exclude: .idea/
[INFO] Exclude: **/*.iml
[INFO] Exclude: .git/
[INFO] Exclude: .gitignore
[INFO] Exclude: .repository/
[INFO] Exclude: **/*.diff
[INFO] Exclude: **/*.patch
[INFO] Exclude: **/*.avsc
[INFO] Exclude: **/docs/**
[INFO]
[INFO] --- apache-rat-plugin:0.7:check (test.rat) @ flume-ng-tests ---
mojoSucceeded org.apache.rat:apache-rat-plugin:0.7(test.rat)
mojoStarted org.apache.maven.plugins:maven-jar-plugin:2.3.1(default-jar)
[INFO] [INFO] Building jar: <https://builds.apache.org/job/flume-1.3.0/ws/flume-ng-tests/target/flume-ng-tests-1.3.0.jar>
[INFO] --- maven-jar-plugin:2.3.1:jar (default-jar) @ flume-ng-tests ---
mojoSucceeded org.apache.maven.plugins:maven-jar-plugin:2.3.1(default-jar)
Downloading: http://repo1.maven.org/maven2/org/jboss/netty/netty/maven-metadata.xml
Downloading: http://repo1.maven.org/maven2/org/jboss/netty/netty/maven-metadata.xml
Downloading: http://repository.jboss.org/nexus/content/groups/public/org/jboss/netty/netty/maven-metadata.xml
Downloading: http://repository.apache.org/snapshots/org/jboss/netty/netty/maven-metadata.xml
Downloaded: http://repo1.maven.org/maven2/org/jboss/netty/netty/maven-metadata.xml (2 KB at 142.7 KB/sec)
Downloaded: http://repo1.maven.org/maven2/org/jboss/netty/netty/maven-metadata.xml (2 KB at 142.7 KB/sec)
Downloading: https://oss.sonatype.org/content/repositories/snapshots/org/jboss/netty/netty/maven-metadata.xml
Downloaded: http://repository.jboss.org/nexus/content/groups/public/org/jboss/netty/netty/maven-metadata.xml (2 KB at 13.5 KB/sec)
Downloading: http://repo1.maven.org/maven2/com/stumbleupon/async/maven-metadata.xml
Downloading: http://repository.jboss.org/nexus/content/groups/public/com/stumbleupon/async/maven-metadata.xml
Downloading: http://repository.apache.org/snapshots/com/stumbleupon/async/maven-metadata.xml
Downloading: http://repo1.maven.org/maven2/com/stumbleupon/async/maven-metadata.xml
Downloading: https://oss.sonatype.org/content/repositories/snapshots/com/stumbleupon/async/maven-metadata.xml
Downloaded: http://repo1.maven.org/maven2/com/stumbleupon/async/maven-metadata.xml (358 B at 4.7 KB/sec)
Downloaded: http://repo1.maven.org/maven2/com/stumbleupon/async/maven-metadata.xml (358 B at 4.7 KB/sec)
Downloaded: http://repository.jboss.org/nexus/content/groups/public/com/stumbleupon/async/maven-metadata.xml (358 B at 2.3 KB/sec)
Downloaded: https://oss.sonatype.org/content/repositories/snapshots/com/stumbleupon/async/maven-metadata.xml (361 B at 0.5 KB/sec)
Downloading: http://repo1.maven.org/maven2/org/apache/zookeeper/zookeeper/maven-metadata.xml
Downloading: http://repository.jboss.org/nexus/content/groups/public/org/apache/zookeeper/zookeeper/maven-metadata.xml
Downloading: http://repository.apache.org/snapshots/org/apache/zookeeper/zookeeper/maven-metadata.xml
Downloading: http://repo1.maven.org/maven2/org/apache/zookeeper/zookeeper/maven-metadata.xml
Downloaded: http://repo1.maven.org/maven2/org/apache/zookeeper/zookeeper/maven-metadata.xml (677 B at 94.4 KB/sec)
Downloaded: http://repo1.maven.org/maven2/org/apache/zookeeper/zookeeper/maven-metadata.xml (677 B at 94.4 KB/sec)
Downloading: https://oss.sonatype.org/content/repositories/snapshots/org/apache/zookeeper/zookeeper/maven-metadata.xml
Downloading: http://repo1.maven.org/maven2/org/slf4j/jcl-over-slf4j/maven-metadata.xml
Downloading: http://repository.jboss.org/nexus/content/groups/public/org/slf4j/jcl-over-slf4j/maven-metadata.xml
Downloading: http://repository.apache.org/snapshots/org/slf4j/jcl-over-slf4j/maven-metadata.xml
Downloading: http://repo1.maven.org/maven2/org/slf4j/jcl-over-slf4j/maven-metadata.xml
Downloaded: http://repo1.maven.org/maven2/org/slf4j/jcl-over-slf4j/maven-metadata.xml (2 KB at 64.3 KB/sec)
Downloading: https://oss.sonatype.org/content/repositories/snapshots/org/slf4j/jcl-over-slf4j/maven-metadata.xml
Downloaded: http://repo1.maven.org/maven2/org/slf4j/jcl-over-slf4j/maven-metadata.xml (2 KB at 60.5 KB/sec)
Downloading: http://repo1.maven.org/maven2/org/jboss/netty/netty/maven-metadata.xml
Downloading: http://repository.jboss.org/nexus/content/groups/public/org/jboss/netty/netty/maven-metadata.xml
Downloading: http://repository.apache.org/snapshots/org/jboss/netty/netty/maven-metadata.xml
Downloading: http://repo1.maven.org/maven2/org/jboss/netty/netty/maven-metadata.xml
Downloaded: http://repo1.maven.org/maven2/org/jboss/netty/netty/maven-metadata.xml (2 KB at 261.6 KB/sec)
Downloaded: http://repo1.maven.org/maven2/org/jboss/netty/netty/maven-metadata.xml (2 KB at 261.6 KB/sec)
Downloading: https://oss.sonatype.org/content/repositories/snapshots/org/jboss/netty/netty/maven-metadata.xml
Downloaded: http://repository.jboss.org/nexus/content/groups/public/org/jboss/netty/netty/maven-metadata.xml (2 KB at 13.1 KB/sec)
Downloading: http://repo1.maven.org/maven2/com/stumbleupon/async/maven-metadata.xml
Downloading: http://repository.jboss.org/nexus/content/groups/public/com/stumbleupon/async/maven-metadata.xml
Downloading: http://repo1.maven.org/maven2/com/stumbleupon/async/maven-metadata.xml
Downloading: http://repository.apache.org/snapshots/com/stumbleupon/async/maven-metadata.xml
Downloaded: http://repo1.maven.org/maven2/com/stumbleupon/async/maven-metadata.xml (358 B at 58.3 KB/sec)
Downloading: https://oss.sonatype.org/content/repositories/snapshots/com/stumbleupon/async/maven-metadata.xml
Downloaded: http://repo1.maven.org/maven2/com/stumbleupon/async/maven-metadata.xml (358 B at 31.8 KB/sec)
Downloaded: http://repository.jboss.org/nexus/content/groups/public/com/stumbleupon/async/maven-metadata.xml (358 B at 2.7 KB/sec)
Downloaded: https://oss.sonatype.org/content/repositories/snapshots/com/stumbleupon/async/maven-metadata.xml (361 B at 0.5 KB/sec)
Downloading: http://repository.jboss.org/nexus/content/groups/public/org/apache/zookeeper/zookeeper/maven-metadata.xml
Downloading: http://repository.apache.org/snapshots/org/apache/zookeeper/zookeeper/maven-metadata.xml
Downloading: http://repo1.maven.org/maven2/org/apache/zookeeper/zookeeper/maven-metadata.xml
Downloading: http://repo1.maven.org/maven2/org/apache/zookeeper/zookeeper/maven-metadata.xml
Downloaded: http://repo1.maven.org/maven2/org/apache/zookeeper/zookeeper/maven-metadata.xml (677 B at 94.4 KB/sec)
Downloading: https://oss.sonatype.org/content/repositories/snapshots/org/apache/zookeeper/zookeeper/maven-metadata.xml
Downloaded: http://repo1.maven.org/maven2/org/apache/zookeeper/zookeeper/maven-metadata.xml (677 B at 82.6 KB/sec)
Downloading: http://repo1.maven.org/maven2/org/slf4j/jcl-over-slf4j/maven-metadata.xml
Downloading: http://repository.jboss.org/nexus/content/groups/public/org/slf4j/jcl-over-slf4j/maven-metadata.xml
Downloading: http://repository.apache.org/snapshots/org/slf4j/jcl-over-slf4j/maven-metadata.xml
Downloading: http://repo1.maven.org/maven2/org/slf4j/jcl-over-slf4j/maven-metadata.xml
Downloaded: http://repo1.maven.org/maven2/org/slf4j/jcl-over-slf4j/maven-metadata.xml (2 KB at 128.7 KB/sec)
Downloading: https://oss.sonatype.org/content/repositories/snapshots/org/slf4j/jcl-over-slf4j/maven-metadata.xml
Downloaded: http://repo1.maven.org/maven2/org/slf4j/jcl-over-slf4j/maven-metadata.xml (2 KB at 102.9 KB/sec)
mojoStarted org.apache.maven.plugins:maven-javadoc-plugin:2.8.1(javadoc-jar)
[INFO]
[INFO] --- maven-javadoc-plugin:2.8.1:aggregate-jar (javadoc-jar) @ flume-ng-tests ---
mojoSucceeded org.apache.maven.plugins:maven-javadoc-plugin:2.8.1(javadoc-jar)
[INFO] configuring report plugin org.apache.maven.plugins:maven-project-info-reports-plugin:2.4
mojoStarted org.apache.maven.plugins:maven-site-plugin:3.1(flume-site)[INFO] Parent project loaded from repository: org.apache:apache:pom:9
[INFO] Relativizing decoration links with respect to project URL: http://www.apache.org/flume-parent/flume-ng-tests/
[INFO] Rendering site with org.apache.maven.skins:maven-fluido-skin:jar:1.0 skin.
[INFO] Generating "Project Team" report --- maven-project-info-reports-plugin:2.4
[INFO] Generating "Mailing Lists" report --- maven-project-info-reports-plugin:2.4
[INFO]
[INFO] --- maven-site-plugin:3.1:site (flume-site) @ flume-ng-tests ---
[INFO] Generating "Issue Tracking" report --- maven-project-info-reports-plugin:2.4
[INFO] Generating "Project License" report --- maven-project-info-reports-plugin:2.4
mojoSucceeded org.apache.maven.plugins:maven-site-plugin:3.1(flume-site)
[JENKINS] Archiving site from <https://builds.apache.org/job/flume-1.3.0/ws/flume-ng-tests/target/site> to /home/hudson/hudson/jobs/flume-1.3.0/site/flume-ng-tests
mojoStarted org.apache.maven.plugins:maven-site-plugin:3.1(flume-site-dist)[INFO] Using this base directory for staging: <https://builds.apache.org/job/flume-1.3.0/ws/flume-ng-tests/target/docs>
[INFO] Parent project loaded from repository: org.apache:apache:pom:9
file://<https://builds.apache.org/job/flume-1.3.0/ws/flume-ng-tests/target/docs/> - Session: Opened
[INFO] Pushing <https://builds.apache.org/job/flume-1.3.0/ws/flume-ng-tests/target/site>
[INFO] >>> to file://<https://builds.apache.org/job/flume-1.3.0/ws/flume-ng-tests/target/docs/flume-ng-tests>
file://<https://builds.apache.org/job/flume-1.3.0/ws/flume-ng-tests/target/docs/> - Session: Disconnecting
file://<https://builds.apache.org/job/flume-1.3.0/ws/flume-ng-tests/target/docs/> - Session: Disconnected
[INFO]
[INFO] --- maven-site-plugin:3.1:stage (flume-site-dist) @ flume-ng-tests ---
mojoSucceeded org.apache.maven.plugins:maven-site-plugin:3.1(flume-site-dist)
mojoStarted org.apache.maven.plugins:maven-site-plugin:3.1(attach-descriptor)
[INFO]
[INFO] --- maven-site-plugin:3.1:attach-descriptor (attach-descriptor) @ flume-ng-tests ---
mojoSucceeded org.apache.maven.plugins:maven-site-plugin:3.1(attach-descriptor)
projectSucceeded org.apache.flume:flume-ng-tests:1.3.0
sessionEnded
[INFO] ------------------------------------------------------------------------
[INFO] Reactor Summary:
[INFO]
[INFO] Apache Flume ...................................... SUCCESS [1:43.993s]
[INFO] Flume NG SDK ...................................... SUCCESS [1:19.262s]
[INFO] Flume NG Configuration ............................ SUCCESS [16.506s]
[INFO] Flume NG Core ..................................... SUCCESS [3:01.498s]
[INFO] Flume NG Sinks .................................... SUCCESS [7.835s]
[INFO] Flume NG HDFS Sink ................................ SUCCESS [55.120s]
[INFO] Flume NG IRC Sink ................................. SUCCESS [9.145s]
[INFO] Flume NG HBase Sink ............................... SUCCESS [1:35.186s]
[INFO] Flume Sources ..................................... SUCCESS [7.927s]
[INFO] Flume Scribe Source ............................... SUCCESS [9.887s]
[INFO] Flume NG Channels ................................. SUCCESS [7.483s]
[INFO] Flume NG JDBC channel ............................. SUCCESS [42.767s]
[INFO] Flume NG Node ..................................... SUCCESS [30.556s]
[INFO] Flume NG file-based channel ....................... SUCCESS [4:10.544s]
[INFO] Flume NG file backed Memory channel ............... SUCCESS [35.720s]
[INFO] Flume legacy Sources .............................. SUCCESS [7.816s]
[INFO] Flume legacy Avro source .......................... SUCCESS [11.581s]
[INFO] Flume legacy Thrift Source ........................ SUCCESS [10.380s]
[INFO] Flume NG Clients .................................. SUCCESS [8.268s]
[INFO] Flume NG Log4j Appender ........................... SUCCESS [13.353s]
[INFO] Flume NG distribution ............................. SUCCESS [21.660s]
[INFO] Flume NG Integration Tests ........................ SUCCESS [46.658s]
[INFO] ------------------------------------------------------------------------
[INFO] BUILD SUCCESS
[INFO] ------------------------------------------------------------------------
[INFO] Total time: 17:40.188s
[INFO] Finished at: Fri Oct 19 15:47:10 UTC 2012
[INFO] Final Memory: 192M/403M
[INFO] ------------------------------------------------------------------------
Projects to build: [MavenProject: org.apache.flume:flume-parent:1.3.0 @ <https://builds.apache.org/job/flume-1.3.0/ws/pom.xml,> MavenProject: org.apache.flume:flume-ng-sdk:1.3.0 @ <https://builds.apache.org/job/flume-1.3.0/ws/flume-ng-sdk/pom.xml,> MavenProject: org.apache.flume:flume-ng-configuration:1.3.0 @ <https://builds.apache.org/job/flume-1.3.0/ws/flume-ng-configuration/pom.xml,> MavenProject: org.apache.flume:flume-ng-core:1.3.0 @ <https://builds.apache.org/job/flume-1.3.0/ws/flume-ng-core/pom.xml,> MavenProject: org.apache.flume:flume-ng-sinks:1.3.0 @ <https://builds.apache.org/job/flume-1.3.0/ws/flume-ng-sinks/pom.xml,> MavenProject: org.apache.flume.flume-ng-sinks:flume-hdfs-sink:1.3.0 @ <https://builds.apache.org/job/flume-1.3.0/ws/flume-ng-sinks/flume-hdfs-sink/pom.xml,> MavenProject: org.apache.flume.flume-ng-sinks:flume-irc-sink:1.3.0 @ <https://builds.apache.org/job/flume-1.3.0/ws/flume-ng-sinks/flume-irc-sink/pom.xml,> MavenProject: org.apache.flume.flume-ng-sinks:flume-ng-hbase-sink:1.3.0 @ <https://builds.apache.org/job/flume-1.3.0/ws/flume-ng-sinks/flume-ng-hbase-sink/pom.xml,> MavenProject: org.apache.flume:flume-ng-sources:1.3.0 @ <https://builds.apache.org/job/flume-1.3.0/ws/flume-ng-sources/pom.xml,> MavenProject: org.apache.flume.flume-ng-sources:flume-scribe-source:1.3.0 @ <https://builds.apache.org/job/flume-1.3.0/ws/flume-ng-sources/flume-scribe-source/pom.xml,> MavenProject: org.apache.flume:flume-ng-channels:1.3.0 @ <https://builds.apache.org/job/flume-1.3.0/ws/flume-ng-channels/pom.xml,> MavenProject: org.apache.flume.flume-ng-channels:flume-jdbc-channel:1.3.0 @ <https://builds.apache.org/job/flume-1.3.0/ws/flume-ng-channels/flume-jdbc-channel/pom.xml,> MavenProject: org.apache.flume:flume-ng-node:1.3.0 @ <https://builds.apache.org/job/flume-1.3.0/ws/flume-ng-node/pom.xml,> MavenProject: org.apache.flume.flume-ng-channels:flume-file-channel:1.3.0 @ <https://builds.apache.org/job/flume-1.3.0/ws/flume-ng-channels/flume-file-channel/pom.xml,> MavenProject: org.apache.flume.flume-ng-channels:flume-recoverable-memory-channel:1.3.0 @ <https://builds.apache.org/job/flume-1.3.0/ws/flume-ng-channels/flume-recoverable-memory-channel/pom.xml,> MavenProject: org.apache.flume:flume-ng-legacy-sources:1.3.0 @ <https://builds.apache.org/job/flume-1.3.0/ws/flume-ng-legacy-sources/pom.xml,> MavenProject: org.apache.flume.flume-ng-legacy-sources:flume-avro-source:1.3.0 @ <https://builds.apache.org/job/flume-1.3.0/ws/flume-ng-legacy-sources/flume-avro-source/pom.xml,> MavenProject: org.apache.flume.flume-ng-legacy-sources:flume-thrift-source:1.3.0 @ <https://builds.apache.org/job/flume-1.3.0/ws/flume-ng-legacy-sources/flume-thrift-source/pom.xml,> MavenProject: org.apache.flume:flume-ng-clients:1.3.0 @ <https://builds.apache.org/job/flume-1.3.0/ws/flume-ng-clients/pom.xml,> MavenProject: org.apache.flume.flume-ng-clients:flume-ng-log4jappender:1.3.0 @ <https://builds.apache.org/job/flume-1.3.0/ws/flume-ng-clients/flume-ng-log4jappender/pom.xml,> MavenProject: org.apache.flume:flume-ng-dist:1.3.0 @ <https://builds.apache.org/job/flume-1.3.0/ws/flume-ng-dist/pom.xml,> MavenProject: org.apache.flume:flume-ng-tests:1.3.0 @ <https://builds.apache.org/job/flume-1.3.0/ws/flume-ng-tests/pom.xml]>
[JENKINS] Archiving <https://builds.apache.org/job/flume-1.3.0/ws/flume-ng-legacy-sources/pom.xml> to /home/hudson/hudson/jobs/flume-1.3.0/modules/org.apache.flume$flume-ng-legacy-sources/builds/2012-10-19_15-29-09/archive/org.apache.flume/flume-ng-legacy-sources/1.3.0/flume-ng-legacy-sources-1.3.0.pom
[JENKINS] Archiving <https://builds.apache.org/job/flume-1.3.0/ws/flume-ng-channels/flume-file-channel/pom.xml> to /home/hudson/hudson/jobs/flume-1.3.0/modules/org.apache.flume.flume-ng-channels$flume-file-channel/builds/2012-10-19_15-29-09/archive/org.apache.flume.flume-ng-channels/flume-file-channel/1.3.0/flume-file-channel-1.3.0.pom
[JENKINS] Archiving <https://builds.apache.org/job/flume-1.3.0/ws/flume-ng-channels/flume-file-channel/target/flume-file-channel-1.3.0.jar> to /home/hudson/hudson/jobs/flume-1.3.0/modules/org.apache.flume.flume-ng-channels$flume-file-channel/builds/2012-10-19_15-29-09/archive/org.apache.flume.flume-ng-channels/flume-file-channel/1.3.0/flume-file-channel-1.3.0.jar
[JENKINS] Archiving <https://builds.apache.org/job/flume-1.3.0/ws/flume-ng-core/pom.xml> to /home/hudson/hudson/jobs/flume-1.3.0/modules/org.apache.flume$flume-ng-core/builds/2012-10-19_15-29-09/archive/org.apache.flume/flume-ng-core/1.3.0/flume-ng-core-1.3.0.pom
[JENKINS] Archiving <https://builds.apache.org/job/flume-1.3.0/ws/flume-ng-core/target/flume-ng-core-1.3.0.jar> to /home/hudson/hudson/jobs/flume-1.3.0/modules/org.apache.flume$flume-ng-core/builds/2012-10-19_15-29-09/archive/org.apache.flume/flume-ng-core/1.3.0/flume-ng-core-1.3.0.jar
[JENKINS] Archiving <https://builds.apache.org/job/flume-1.3.0/ws/flume-ng-sinks/flume-hdfs-sink/pom.xml> to /home/hudson/hudson/jobs/flume-1.3.0/modules/org.apache.flume.flume-ng-sinks$flume-hdfs-sink/builds/2012-10-19_15-29-09/archive/org.apache.flume.flume-ng-sinks/flume-hdfs-sink/1.3.0/flume-hdfs-sink-1.3.0.pom
[JENKINS] Archiving <https://builds.apache.org/job/flume-1.3.0/ws/flume-ng-sinks/flume-hdfs-sink/target/flume-hdfs-sink-1.3.0.jar> to /home/hudson/hudson/jobs/flume-1.3.0/modules/org.apache.flume.flume-ng-sinks$flume-hdfs-sink/builds/2012-10-19_15-29-09/archive/org.apache.flume.flume-ng-sinks/flume-hdfs-sink/1.3.0/flume-hdfs-sink-1.3.0.jar
[JENKINS] Archiving <https://builds.apache.org/job/flume-1.3.0/ws/flume-ng-sources/pom.xml> to /home/hudson/hudson/jobs/flume-1.3.0/modules/org.apache.flume$flume-ng-sources/builds/2012-10-19_15-29-09/archive/org.apache.flume/flume-ng-sources/1.3.0/flume-ng-sources-1.3.0.pom
[JENKINS] Archiving <https://builds.apache.org/job/flume-1.3.0/ws/flume-ng-legacy-sources/flume-avro-source/pom.xml> to /home/hudson/hudson/jobs/flume-1.3.0/modules/org.apache.flume.flume-ng-legacy-sources$flume-avro-source/builds/2012-10-19_15-29-09/archive/org.apache.flume.flume-ng-legacy-sources/flume-avro-source/1.3.0/flume-avro-source-1.3.0.pom
[JENKINS] Archiving <https://builds.apache.org/job/flume-1.3.0/ws/flume-ng-legacy-sources/flume-avro-source/target/flume-avro-source-1.3.0.jar> to /home/hudson/hudson/jobs/flume-1.3.0/modules/org.apache.flume.flume-ng-legacy-sources$flume-avro-source/builds/2012-10-19_15-29-09/archive/org.apache.flume.flume-ng-legacy-sources/flume-avro-source/1.3.0/flume-avro-source-1.3.0.jar
[JENKINS] Archiving <https://builds.apache.org/job/flume-1.3.0/ws/flume-ng-node/pom.xml> to /home/hudson/hudson/jobs/flume-1.3.0/modules/org.apache.flume$flume-ng-node/builds/2012-10-19_15-29-09/archive/org.apache.flume/flume-ng-node/1.3.0/flume-ng-node-1.3.0.pom
[JENKINS] Archiving <https://builds.apache.org/job/flume-1.3.0/ws/flume-ng-node/target/flume-ng-node-1.3.0.jar> to /home/hudson/hudson/jobs/flume-1.3.0/modules/org.apache.flume$flume-ng-node/builds/2012-10-19_15-29-09/archive/org.apache.flume/flume-ng-node/1.3.0/flume-ng-node-1.3.0.jar
[JENKINS] Archiving <https://builds.apache.org/job/flume-1.3.0/ws/flume-ng-legacy-sources/flume-thrift-source/pom.xml> to /home/hudson/hudson/jobs/flume-1.3.0/modules/org.apache.flume.flume-ng-legacy-sources$flume-thrift-source/builds/2012-10-19_15-29-09/archive/org.apache.flume.flume-ng-legacy-sources/flume-thrift-source/1.3.0/flume-thrift-source-1.3.0.pom
[JENKINS] Archiving <https://builds.apache.org/job/flume-1.3.0/ws/flume-ng-legacy-sources/flume-thrift-source/target/flume-thrift-source-1.3.0.jar> to /home/hudson/hudson/jobs/flume-1.3.0/modules/org.apache.flume.flume-ng-legacy-sources$flume-thrift-source/builds/2012-10-19_15-29-09/archive/org.apache.flume.flume-ng-legacy-sources/flume-thrift-source/1.3.0/flume-thrift-source-1.3.0.jar
[JENKINS] Archiving <https://builds.apache.org/job/flume-1.3.0/ws/flume-ng-sources/flume-scribe-source/pom.xml> to /home/hudson/hudson/jobs/flume-1.3.0/modules/org.apache.flume.flume-ng-sources$flume-scribe-source/builds/2012-10-19_15-29-09/archive/org.apache.flume.flume-ng-sources/flume-scribe-source/1.3.0/flume-scribe-source-1.3.0.pom
[JENKINS] Archiving <https://builds.apache.org/job/flume-1.3.0/ws/flume-ng-sources/flume-scribe-source/target/flume-scribe-source-1.3.0.jar> to /home/hudson/hudson/jobs/flume-1.3.0/modules/org.apache.flume.flume-ng-sources$flume-scribe-source/builds/2012-10-19_15-29-09/archive/org.apache.flume.flume-ng-sources/flume-scribe-source/1.3.0/flume-scribe-source-1.3.0.jar
[JENKINS] Archiving <https://builds.apache.org/job/flume-1.3.0/ws/flume-ng-tests/pom.xml> to /home/hudson/hudson/jobs/flume-1.3.0/modules/org.apache.flume$flume-ng-tests/builds/2012-10-19_15-29-09/archive/org.apache.flume/flume-ng-tests/1.3.0/flume-ng-tests-1.3.0.pom
[JENKINS] Archiving <https://builds.apache.org/job/flume-1.3.0/ws/flume-ng-tests/target/flume-ng-tests-1.3.0.jar> to /home/hudson/hudson/jobs/flume-1.3.0/modules/org.apache.flume$flume-ng-tests/builds/2012-10-19_15-29-09/archive/org.apache.flume/flume-ng-tests/1.3.0/flume-ng-tests-1.3.0.jar
[JENKINS] Archiving <https://builds.apache.org/job/flume-1.3.0/ws/flume-ng-sinks/flume-irc-sink/pom.xml> to /home/hudson/hudson/jobs/flume-1.3.0/modules/org.apache.flume.flume-ng-sinks$flume-irc-sink/builds/2012-10-19_15-29-09/archive/org.apache.flume.flume-ng-sinks/flume-irc-sink/1.3.0/flume-irc-sink-1.3.0.pom
[JENKINS] Archiving <https://builds.apache.org/job/flume-1.3.0/ws/flume-ng-sinks/flume-irc-sink/target/flume-irc-sink-1.3.0.jar> to /home/hudson/hudson/jobs/flume-1.3.0/modules/org.apache.flume.flume-ng-sinks$flume-irc-sink/builds/2012-10-19_15-29-09/archive/org.apache.flume.flume-ng-sinks/flume-irc-sink/1.3.0/flume-irc-sink-1.3.0.jar
[JENKINS] Archiving <https://builds.apache.org/job/flume-1.3.0/ws/flume-ng-configuration/pom.xml> to /home/hudson/hudson/jobs/flume-1.3.0/modules/org.apache.flume$flume-ng-configuration/builds/2012-10-19_15-29-09/archive/org.apache.flume/flume-ng-configuration/1.3.0/flume-ng-configuration-1.3.0.pom
[JENKINS] Archiving <https://builds.apache.org/job/flume-1.3.0/ws/flume-ng-configuration/target/flume-ng-configuration-1.3.0.jar> to /home/hudson/hudson/jobs/flume-1.3.0/modules/org.apache.flume$flume-ng-configuration/builds/2012-10-19_15-29-09/archive/org.apache.flume/flume-ng-configuration/1.3.0/flume-ng-configuration-1.3.0.jar
[JENKINS] Archiving <https://builds.apache.org/job/flume-1.3.0/ws/flume-ng-sdk/pom.xml> to /home/hudson/hudson/jobs/flume-1.3.0/modules/org.apache.flume$flume-ng-sdk/builds/2012-10-19_15-29-09/archive/org.apache.flume/flume-ng-sdk/1.3.0/flume-ng-sdk-1.3.0.pom
[JENKINS] Archiving <https://builds.apache.org/job/flume-1.3.0/ws/flume-ng-sdk/target/flume-ng-sdk-1.3.0.jar> to /home/hudson/hudson/jobs/flume-1.3.0/modules/org.apache.flume$flume-ng-sdk/builds/2012-10-19_15-29-09/archive/org.apache.flume/flume-ng-sdk/1.3.0/flume-ng-sdk-1.3.0.jar
[JENKINS] Archiving <https://builds.apache.org/job/flume-1.3.0/ws/flume-ng-clients/pom.xml> to /home/hudson/hudson/jobs/flume-1.3.0/modules/org.apache.flume$flume-ng-clients/builds/2012-10-19_15-29-09/archive/org.apache.flume/flume-ng-clients/1.3.0/flume-ng-clients-1.3.0.pom
[JENKINS] Archiving <https://builds.apache.org/job/flume-1.3.0/ws/flume-ng-dist/pom.xml> to /home/hudson/hudson/jobs/flume-1.3.0/modules/org.apache.flume$flume-ng-dist/builds/2012-10-19_15-29-09/archive/org.apache.flume/flume-ng-dist/1.3.0/flume-ng-dist-1.3.0.pom
[JENKINS] Archiving <https://builds.apache.org/job/flume-1.3.0/ws/flume-ng-dist/target/apache-flume-1.3.0-dist.tar.gz> to /home/hudson/hudson/jobs/flume-1.3.0/modules/org.apache.flume$flume-ng-dist/builds/2012-10-19_15-29-09/archive/org.apache.flume/flume-ng-dist/1.3.0/flume-ng-dist-1.3.0-dist.tar.gz
[JENKINS] Archiving <https://builds.apache.org/job/flume-1.3.0/ws/flume-ng-dist/target/apache-flume-1.3.0-src.tar.gz> to /home/hudson/hudson/jobs/flume-1.3.0/modules/org.apache.flume$flume-ng-dist/builds/2012-10-19_15-29-09/archive/org.apache.flume/flume-ng-dist/1.3.0/flume-ng-dist-1.3.0-src.tar.gz
[JENKINS] Archiving <https://builds.apache.org/job/flume-1.3.0/ws/pom.xml> to /home/hudson/hudson/jobs/flume-1.3.0/modules/org.apache.flume$flume-parent/builds/2012-10-19_15-29-09/archive/org.apache.flume/flume-parent/1.3.0/flume-parent-1.3.0.pom
[JENKINS] Archiving <https://builds.apache.org/job/flume-1.3.0/ws/target/flume-parent-1.3.0-javadoc.jar> to /home/hudson/hudson/jobs/flume-1.3.0/modules/org.apache.flume$flume-parent/builds/2012-10-19_15-29-09/archive/org.apache.flume/flume-parent/1.3.0/flume-parent-1.3.0-javadoc.jar
[JENKINS] Archiving <https://builds.apache.org/job/flume-1.3.0/ws/target/flume-parent-1.3.0-site.xml> to /home/hudson/hudson/jobs/flume-1.3.0/modules/org.apache.flume$flume-parent/builds/2012-10-19_15-29-09/archive/org.apache.flume/flume-parent/1.3.0/flume-parent-1.3.0-site.xml
[JENKINS] Archiving <https://builds.apache.org/job/flume-1.3.0/ws/flume-ng-channels/flume-recoverable-memory-channel/pom.xml> to /home/hudson/hudson/jobs/flume-1.3.0/modules/org.apache.flume.flume-ng-channels$flume-recoverable-memory-channel/builds/2012-10-19_15-29-09/archive/org.apache.flume.flume-ng-channels/flume-recoverable-memory-channel/1.3.0/flume-recoverable-memory-channel-1.3.0.pom
[JENKINS] Archiving <https://builds.apache.org/job/flume-1.3.0/ws/flume-ng-channels/flume-recoverable-memory-channel/target/flume-recoverable-memory-channel-1.3.0.jar> to /home/hudson/hudson/jobs/flume-1.3.0/modules/org.apache.flume.flume-ng-channels$flume-recoverable-memory-channel/builds/2012-10-19_15-29-09/archive/org.apache.flume.flume-ng-channels/flume-recoverable-memory-channel/1.3.0/flume-recoverable-memory-channel-1.3.0.jar
[JENKINS] Archiving <https://builds.apache.org/job/flume-1.3.0/ws/flume-ng-sinks/flume-ng-hbase-sink/pom.xml> to /home/hudson/hudson/jobs/flume-1.3.0/modules/org.apache.flume.flume-ng-sinks$flume-ng-hbase-sink/builds/2012-10-19_15-29-09/archive/org.apache.flume.flume-ng-sinks/flume-ng-hbase-sink/1.3.0/flume-ng-hbase-sink-1.3.0.pom
[JENKINS] Archiving <https://builds.apache.org/job/flume-1.3.0/ws/flume-ng-sinks/flume-ng-hbase-sink/target/flume-ng-hbase-sink-1.3.0.jar> to /home/hudson/hudson/jobs/flume-1.3.0/modules/org.apache.flume.flume-ng-sinks$flume-ng-hbase-sink/builds/2012-10-19_15-29-09/archive/org.apache.flume.flume-ng-sinks/flume-ng-hbase-sink/1.3.0/flume-ng-hbase-sink-1.3.0.jar
[JENKINS] Archiving <https://builds.apache.org/job/flume-1.3.0/ws/flume-ng-clients/flume-ng-log4jappender/pom.xml> to /home/hudson/hudson/jobs/flume-1.3.0/modules/org.apache.flume.flume-ng-clients$flume-ng-log4jappender/builds/2012-10-19_15-29-09/archive/org.apache.flume.flume-ng-clients/flume-ng-log4jappender/1.3.0/flume-ng-log4jappender-1.3.0.pom
[JENKINS] Archiving <https://builds.apache.org/job/flume-1.3.0/ws/flume-ng-clients/flume-ng-log4jappender/target/flume-ng-log4jappender-1.3.0.jar> to /home/hudson/hudson/jobs/flume-1.3.0/modules/org.apache.flume.flume-ng-clients$flume-ng-log4jappender/builds/2012-10-19_15-29-09/archive/org.apache.flume.flume-ng-clients/flume-ng-log4jappender/1.3.0/flume-ng-log4jappender-1.3.0.jar
[JENKINS] Archiving <https://builds.apache.org/job/flume-1.3.0/ws/flume-ng-channels/pom.xml> to /home/hudson/hudson/jobs/flume-1.3.0/modules/org.apache.flume$flume-ng-channels/builds/2012-10-19_15-29-09/archive/org.apache.flume/flume-ng-channels/1.3.0/flume-ng-channels-1.3.0.pom
[JENKINS] Archiving <https://builds.apache.org/job/flume-1.3.0/ws/flume-ng-sinks/pom.xml> to /home/hudson/hudson/jobs/flume-1.3.0/modules/org.apache.flume$flume-ng-sinks/builds/2012-10-19_15-29-09/archive/org.apache.flume/flume-ng-sinks/1.3.0/flume-ng-sinks-1.3.0.pom
[JENKINS] Archiving <https://builds.apache.org/job/flume-1.3.0/ws/flume-ng-channels/flume-jdbc-channel/pom.xml> to /home/hudson/hudson/jobs/flume-1.3.0/modules/org.apache.flume.flume-ng-channels$flume-jdbc-channel/builds/2012-10-19_15-29-09/archive/org.apache.flume.flume-ng-channels/flume-jdbc-channel/1.3.0/flume-jdbc-channel-1.3.0.pom
[JENKINS] Archiving <https://builds.apache.org/job/flume-1.3.0/ws/flume-ng-channels/flume-jdbc-channel/target/flume-jdbc-channel-1.3.0.jar> to /home/hudson/hudson/jobs/flume-1.3.0/modules/org.apache.flume.flume-ng-channels$flume-jdbc-channel/builds/2012-10-19_15-29-09/archive/org.apache.flume.flume-ng-channels/flume-jdbc-channel/1.3.0/flume-jdbc-channel-1.3.0.jar
Waiting for Jenkins to finish collecting data
channel stopped
[WARNINGS] Parsing warnings in console log with parser AcuCobol Compiler
Maven RedeployPublisher use remote ubuntu1 maven settings from : /home/jenkins/.m2/settings.xml
[INFO] Deployment in https://repository.apache.org/content/repositories/snapshots (id=apache.snapshots.https,uniqueVersion=true)
Deploying the main artifact flume-ng-channels-1.3.0.pom
Uploading: https://repository.apache.org/content/repositories/snapshots/org/apache/flume/flume-ng-channels/1.3.0/flume-ng-channels-1.3.0.pom
ERROR: Failed to deploy artifacts: Could not transfer artifact org.apache.flume:flume-ng-channels:pom:1.3.0 from/to apache.snapshots.https (https://repository.apache.org/content/repositories/snapshots): Failed to transfer file: https://repository.apache.org/content/repositories/snapshots/org/apache/flume/flume-ng-channels/1.3.0/flume-ng-channels-1.3.0.pom. Return code is: 400, ReasonPhrase:Bad Request.
org.apache.maven.artifact.deployer.ArtifactDeploymentException: Failed to deploy artifacts: Could not transfer artifact org.apache.flume:flume-ng-channels:pom:1.3.0 from/to apache.snapshots.https (https://repository.apache.org/content/repositories/snapshots): Failed to transfer file: https://repository.apache.org/content/repositories/snapshots/org/apache/flume/flume-ng-channels/1.3.0/flume-ng-channels-1.3.0.pom. Return code is: 400, ReasonPhrase:Bad Request.
at org.apache.maven.artifact.deployer.DefaultArtifactDeployer.deploy(DefaultArtifactDeployer.java:141)
at hudson.maven.reporters.MavenArtifactRecord.deploy(MavenArtifactRecord.java:190)
at hudson.maven.RedeployPublisher.perform(RedeployPublisher.java:174)
at hudson.tasks.BuildStepMonitor$1.perform(BuildStepMonitor.java:19)
at hudson.model.AbstractBuild$AbstractBuildExecution.perform(AbstractBuild.java:717)
at hudson.model.AbstractBuild$AbstractBuildExecution.performAllBuildSteps(AbstractBuild.java:692)
at hudson.maven.MavenModuleSetBuild$MavenModuleSetBuildExecution.post2(MavenModuleSetBuild.java:994)
at hudson.model.AbstractBuild$AbstractBuildExecution.post(AbstractBuild.java:639)
at hudson.model.Run.execute(Run.java:1527)
at hudson.maven.MavenModuleSetBuild.run(MavenModuleSetBuild.java:477)
at hudson.model.ResourceController.execute(ResourceController.java:88)
at hudson.model.Executor.run(Executor.java:236)
Caused by: org.sonatype.aether.deployment.DeploymentException: Failed to deploy artifacts: Could not transfer artifact org.apache.flume:flume-ng-channels:pom:1.3.0 from/to apache.snapshots.https (https://repository.apache.org/content/repositories/snapshots): Failed to transfer file: https://repository.apache.org/content/repositories/snapshots/org/apache/flume/flume-ng-channels/1.3.0/flume-ng-channels-1.3.0.pom. Return code is: 400, ReasonPhrase:Bad Request.
at org.sonatype.aether.impl.internal.DefaultDeployer.deploy(DefaultDeployer.java:280)
at org.sonatype.aether.impl.internal.DefaultDeployer.deploy(DefaultDeployer.java:211)
at org.sonatype.aether.impl.internal.DefaultRepositorySystem.deploy(DefaultRepositorySystem.java:443)
at org.apache.maven.artifact.deployer.DefaultArtifactDeployer.deploy(DefaultArtifactDeployer.java:137)
... 11 more
Caused by: org.sonatype.aether.transfer.ArtifactTransferException: Could not transfer artifact org.apache.flume:flume-ng-channels:pom:1.3.0 from/to apache.snapshots.https (https://repository.apache.org/content/repositories/snapshots): Failed to transfer file: https://repository.apache.org/content/repositories/snapshots/org/apache/flume/flume-ng-channels/1.3.0/flume-ng-channels-1.3.0.pom. Return code is: 400, ReasonPhrase:Bad Request.
at org.sonatype.aether.connector.wagon.WagonRepositoryConnector$4.wrap(WagonRepositoryConnector.java:951)
at org.sonatype.aether.connector.wagon.WagonRepositoryConnector$4.wrap(WagonRepositoryConnector.java:941)
at org.sonatype.aether.connector.wagon.WagonRepositoryConnector$PutTask.run(WagonRepositoryConnector.java:837)
at org.sonatype.aether.connector.wagon.WagonRepositoryConnector.put(WagonRepositoryConnector.java:467)
at org.sonatype.aether.impl.internal.DefaultDeployer.deploy(DefaultDeployer.java:274)
... 14 more
Caused by: org.apache.maven.wagon.TransferFailedException: Failed to transfer file: https://repository.apache.org/content/repositories/snapshots/org/apache/flume/flume-ng-channels/1.3.0/flume-ng-channels-1.3.0.pom. Return code is: 400, ReasonPhrase:Bad Request.
at org.apache.maven.wagon.shared.http4.AbstractHttpClientWagon.put(AbstractHttpClientWagon.java:562)
at org.apache.maven.wagon.shared.http4.AbstractHttpClientWagon.put(AbstractHttpClientWagon.java:471)
at org.apache.maven.wagon.shared.http4.AbstractHttpClientWagon.put(AbstractHttpClientWagon.java:451)
at org.sonatype.aether.connector.wagon.WagonRepositoryConnector$PutTask.run(WagonRepositoryConnector.java:811)
... 16 more
[INFO] Deployment failed after 0.49 sec
Build step 'Deploy artifacts to Maven repository' changed build result to FAILURE
Updating FLUME-1199
Build failed in Jenkins: flume-1.3.0 #11
Posted by Apache Jenkins Server <je...@builds.apache.org>.
See <https://builds.apache.org/job/flume-1.3.0/11/changes>
Changes:
[hshreedharan] FLUME-1650. Fix flume-ng-hbase-sink compilation against Hadoop 2.X.
[mpercy] FLUME-1651. In the hadoop-0.23 profile HBase version needs to be at least 0.94.2.
[mpercy] FLUME-1638. LoadBalancingRpcClient depends on com.google.common.collect.Maps.
[brock] FLUME-1622: MemoryChannel throws NPE if the event has no body
[brock] FLUME-1620: Update flume user guide for LoadBalancingSinkProcessor with the backoff changes.
[brock] FLUME-1337: Add IDEA files to .gitignore
------------------------------------------
[...truncated 7471 lines...]
Running org.apache.flume.test.agent.TestFileChannel
Tests run: 1, Failures: 0, Errors: 0, Skipped: 0, Time elapsed: 17.705 sec
Running org.apache.flume.test.agent.TestRpcClientCommunicationFailure
Tests run: 1, Failures: 0, Errors: 0, Skipped: 0, Time elapsed: 8.128 sec
Running org.apache.flume.test.agent.TestRpcClient
Tests run: 1, Failures: 0, Errors: 0, Skipped: 0, Time elapsed: 8.052 sec
Results :
Tests run: 3, Failures: 0, Errors: 0, Skipped: 0
mojoSucceeded org.apache.maven.plugins:maven-surefire-plugin:2.12(default-test)
[JENKINS] Recording test results
mojoStarted org.apache.rat:apache-rat-plugin:0.7(test.rat)[INFO] Exclude: .idea/
[INFO] Exclude: **/*.iml
[INFO] Exclude: .git/
[INFO] Exclude: .gitignore
[INFO] Exclude: .repository/
[INFO] Exclude: **/*.diff
[INFO] Exclude: **/*.patch
[INFO] Exclude: **/*.avsc
[INFO] Exclude: **/docs/**
[INFO]
[INFO] --- apache-rat-plugin:0.7:check (test.rat) @ flume-ng-tests ---
mojoSucceeded org.apache.rat:apache-rat-plugin:0.7(test.rat)
mojoStarted org.apache.maven.plugins:maven-jar-plugin:2.3.1(default-jar)
[INFO]
[INFO] --- maven-jar-plugin:2.3.1:jar (default-jar) @ flume-ng-tests ---
[INFO] Building jar: <https://builds.apache.org/job/flume-1.3.0/ws/flume-ng-tests/target/flume-ng-tests-1.3.0.jar>
mojoSucceeded org.apache.maven.plugins:maven-jar-plugin:2.3.1(default-jar)
Downloading: http://repo1.maven.org/maven2/org/jboss/netty/netty/maven-metadata.xml
Downloading: http://repository.jboss.org/nexus/content/groups/public/org/jboss/netty/netty/maven-metadata.xml
Downloading: http://repo1.maven.org/maven2/org/jboss/netty/netty/maven-metadata.xml
Downloading: http://repository.apache.org/snapshots/org/jboss/netty/netty/maven-metadata.xml
Downloaded: http://repo1.maven.org/maven2/org/jboss/netty/netty/maven-metadata.xml (2 KB at 58.1 KB/sec)
Downloaded: http://repo1.maven.org/maven2/org/jboss/netty/netty/maven-metadata.xml (2 KB at 56.0 KB/sec)
Downloading: https://oss.sonatype.org/content/repositories/snapshots/org/jboss/netty/netty/maven-metadata.xml
Downloaded: http://repository.jboss.org/nexus/content/groups/public/org/jboss/netty/netty/maven-metadata.xml (2 KB at 5.6 KB/sec)
Downloading: http://repo1.maven.org/maven2/com/stumbleupon/async/maven-metadata.xml
Downloading: http://repository.jboss.org/nexus/content/groups/public/com/stumbleupon/async/maven-metadata.xml
Downloading: http://repo1.maven.org/maven2/com/stumbleupon/async/maven-metadata.xml
Downloading: http://repository.apache.org/snapshots/com/stumbleupon/async/maven-metadata.xml
Downloaded: http://repo1.maven.org/maven2/com/stumbleupon/async/maven-metadata.xml (358 B at 69.9 KB/sec)
Downloading: https://oss.sonatype.org/content/repositories/snapshots/com/stumbleupon/async/maven-metadata.xml
Downloaded: http://repo1.maven.org/maven2/com/stumbleupon/async/maven-metadata.xml (358 B at 43.7 KB/sec)
Downloaded: http://repository.jboss.org/nexus/content/groups/public/com/stumbleupon/async/maven-metadata.xml (358 B at 0.6 KB/sec)
Downloaded: https://oss.sonatype.org/content/repositories/snapshots/com/stumbleupon/async/maven-metadata.xml (361 B at 0.5 KB/sec)
Downloading: http://repo1.maven.org/maven2/org/apache/zookeeper/zookeeper/maven-metadata.xml
Downloading: http://repository.jboss.org/nexus/content/groups/public/org/apache/zookeeper/zookeeper/maven-metadata.xml
Downloading: http://repository.apache.org/snapshots/org/apache/zookeeper/zookeeper/maven-metadata.xml
Downloading: http://repo1.maven.org/maven2/org/apache/zookeeper/zookeeper/maven-metadata.xml
Downloaded: http://repo1.maven.org/maven2/org/apache/zookeeper/zookeeper/maven-metadata.xml (677 B at 110.2 KB/sec)
Downloaded: http://repo1.maven.org/maven2/org/apache/zookeeper/zookeeper/maven-metadata.xml (677 B at 94.4 KB/sec)
Downloading: https://oss.sonatype.org/content/repositories/snapshots/org/apache/zookeeper/zookeeper/maven-metadata.xml
Downloading: http://repository.jboss.org/nexus/content/groups/public/org/slf4j/jcl-over-slf4j/maven-metadata.xml
Downloading: http://repo1.maven.org/maven2/org/slf4j/jcl-over-slf4j/maven-metadata.xml
Downloading: http://repo1.maven.org/maven2/org/slf4j/jcl-over-slf4j/maven-metadata.xml
Downloading: http://repository.apache.org/snapshots/org/slf4j/jcl-over-slf4j/maven-metadata.xml
Downloaded: http://repo1.maven.org/maven2/org/slf4j/jcl-over-slf4j/maven-metadata.xml (2 KB at 171.5 KB/sec)
Downloading: https://oss.sonatype.org/content/repositories/snapshots/org/slf4j/jcl-over-slf4j/maven-metadata.xml
Downloaded: http://repo1.maven.org/maven2/org/slf4j/jcl-over-slf4j/maven-metadata.xml (2 KB at 147.0 KB/sec)
Downloading: http://repo1.maven.org/maven2/org/jboss/netty/netty/maven-metadata.xml
Downloading: http://repo1.maven.org/maven2/org/jboss/netty/netty/maven-metadata.xml
Downloading: http://repository.apache.org/snapshots/org/jboss/netty/netty/maven-metadata.xml
Downloading: http://repository.jboss.org/nexus/content/groups/public/org/jboss/netty/netty/maven-metadata.xml
Downloaded: http://repo1.maven.org/maven2/org/jboss/netty/netty/maven-metadata.xml (2 KB at 261.6 KB/sec)
Downloading: https://oss.sonatype.org/content/repositories/snapshots/org/jboss/netty/netty/maven-metadata.xml
Downloaded: http://repo1.maven.org/maven2/org/jboss/netty/netty/maven-metadata.xml (2 KB at 224.2 KB/sec)
Downloaded: http://repository.jboss.org/nexus/content/groups/public/org/jboss/netty/netty/maven-metadata.xml (2 KB at 5.1 KB/sec)
Downloading: http://repo1.maven.org/maven2/com/stumbleupon/async/maven-metadata.xml
Downloading: http://repository.apache.org/snapshots/com/stumbleupon/async/maven-metadata.xml
Downloading: http://repository.jboss.org/nexus/content/groups/public/com/stumbleupon/async/maven-metadata.xml
Downloading: http://repo1.maven.org/maven2/com/stumbleupon/async/maven-metadata.xml
Downloaded: http://repo1.maven.org/maven2/com/stumbleupon/async/maven-metadata.xml (358 B at 38.8 KB/sec)
Downloaded: http://repo1.maven.org/maven2/com/stumbleupon/async/maven-metadata.xml (358 B at 43.7 KB/sec)
Downloading: https://oss.sonatype.org/content/repositories/snapshots/com/stumbleupon/async/maven-metadata.xml
Downloaded: http://repository.jboss.org/nexus/content/groups/public/com/stumbleupon/async/maven-metadata.xml (358 B at 0.7 KB/sec)
Downloaded: https://oss.sonatype.org/content/repositories/snapshots/com/stumbleupon/async/maven-metadata.xml (361 B at 0.5 KB/sec)
Downloading: http://repo1.maven.org/maven2/org/apache/zookeeper/zookeeper/maven-metadata.xml
Downloading: http://repository.apache.org/snapshots/org/apache/zookeeper/zookeeper/maven-metadata.xml
Downloading: http://repo1.maven.org/maven2/org/apache/zookeeper/zookeeper/maven-metadata.xml
Downloading: http://repository.jboss.org/nexus/content/groups/public/org/apache/zookeeper/zookeeper/maven-metadata.xml
Downloaded: http://repo1.maven.org/maven2/org/apache/zookeeper/zookeeper/maven-metadata.xml (677 B at 110.2 KB/sec)
Downloaded: http://repo1.maven.org/maven2/org/apache/zookeeper/zookeeper/maven-metadata.xml (677 B at 94.4 KB/sec)
Downloading: https://oss.sonatype.org/content/repositories/snapshots/org/apache/zookeeper/zookeeper/maven-metadata.xml
Downloading: http://repo1.maven.org/maven2/org/slf4j/jcl-over-slf4j/maven-metadata.xml
Downloading: http://repo1.maven.org/maven2/org/slf4j/jcl-over-slf4j/maven-metadata.xml
Downloading: http://repository.jboss.org/nexus/content/groups/public/org/slf4j/jcl-over-slf4j/maven-metadata.xml
Downloading: http://repository.apache.org/snapshots/org/slf4j/jcl-over-slf4j/maven-metadata.xml
Downloaded: http://repo1.maven.org/maven2/org/slf4j/jcl-over-slf4j/maven-metadata.xml (2 KB at 171.5 KB/sec)
Downloaded: http://repo1.maven.org/maven2/org/slf4j/jcl-over-slf4j/maven-metadata.xml (2 KB at 147.0 KB/sec)
Downloading: https://oss.sonatype.org/content/repositories/snapshots/org/slf4j/jcl-over-slf4j/maven-metadata.xml
mojoStarted org.apache.maven.plugins:maven-javadoc-plugin:2.8.1(javadoc-jar)
[INFO]
[INFO] --- maven-javadoc-plugin:2.8.1:aggregate-jar (javadoc-jar) @ flume-ng-tests ---
mojoSucceeded org.apache.maven.plugins:maven-javadoc-plugin:2.8.1(javadoc-jar)
mojoStarted org.apache.maven.plugins:maven-site-plugin:3.1(flume-site)[INFO] configuring report plugin org.apache.maven.plugins:maven-project-info-reports-plugin:2.4
[INFO] Parent project loaded from repository: org.apache:apache:pom:9
[INFO] Relativizing decoration links with respect to project URL: http://www.apache.org/flume-parent/flume-ng-tests/
[INFO] Rendering site with org.apache.maven.skins:maven-fluido-skin:jar:1.0 skin.
[INFO] Generating "Project Team" report --- maven-project-info-reports-plugin:2.4
[INFO]
[INFO] --- maven-site-plugin:3.1:site (flume-site) @ flume-ng-tests ---
[INFO] Generating "Mailing Lists" report --- maven-project-info-reports-plugin:2.4
[INFO] Generating "Issue Tracking" report --- maven-project-info-reports-plugin:2.4
[INFO] Generating "Project License" report --- maven-project-info-reports-plugin:2.4
mojoSucceeded org.apache.maven.plugins:maven-site-plugin:3.1(flume-site)
[JENKINS] Archiving site from <https://builds.apache.org/job/flume-1.3.0/ws/flume-ng-tests/target/site> to /home/hudson/hudson/jobs/flume-1.3.0/site/flume-ng-tests
mojoStarted org.apache.maven.plugins:maven-site-plugin:3.1(flume-site-dist)[INFO] Using this base directory for staging: <https://builds.apache.org/job/flume-1.3.0/ws/flume-ng-tests/target/docs>
[INFO] Parent project loaded from repository: org.apache:apache:pom:9
file://<https://builds.apache.org/job/flume-1.3.0/ws/flume-ng-tests/target/docs/> - Session: Opened
[INFO] Pushing <https://builds.apache.org/job/flume-1.3.0/ws/flume-ng-tests/target/site>
[INFO] >>> to file://<https://builds.apache.org/job/flume-1.3.0/ws/flume-ng-tests/target/docs/flume-ng-tests>
file://<https://builds.apache.org/job/flume-1.3.0/ws/flume-ng-tests/target/docs/> - Session: Disconnecting
file://<https://builds.apache.org/job/flume-1.3.0/ws/flume-ng-tests/target/docs/> - Session: Disconnected
[INFO]
[INFO] --- maven-site-plugin:3.1:stage (flume-site-dist) @ flume-ng-tests ---
mojoSucceeded org.apache.maven.plugins:maven-site-plugin:3.1(flume-site-dist)
mojoStarted org.apache.maven.plugins:maven-site-plugin:3.1(attach-descriptor)
[INFO]
[INFO] --- maven-site-plugin:3.1:attach-descriptor (attach-descriptor) @ flume-ng-tests ---
mojoSucceeded org.apache.maven.plugins:maven-site-plugin:3.1(attach-descriptor)
projectSucceeded org.apache.flume:flume-ng-tests:1.3.0
sessionEnded
[INFO] ------------------------------------------------------------------------
[INFO] Reactor Summary:
[INFO]
[INFO] Apache Flume ...................................... SUCCESS [1:42.605s]
[INFO] Flume NG SDK ...................................... SUCCESS [1:16.871s]
[INFO] Flume NG Configuration ............................ SUCCESS [10.560s]
[INFO] Flume NG Core ..................................... SUCCESS [2:55.406s]
[INFO] Flume NG Sinks .................................... SUCCESS [6.592s]
[INFO] Flume NG HDFS Sink ................................ SUCCESS [47.182s]
[INFO] Flume NG IRC Sink ................................. SUCCESS [8.967s]
[INFO] Flume NG HBase Sink ............................... SUCCESS [1:27.586s]
[INFO] Flume Sources ..................................... SUCCESS [8.952s]
[INFO] Flume Scribe Source ............................... SUCCESS [8.664s]
[INFO] Flume NG Channels ................................. SUCCESS [6.583s]
[INFO] Flume NG JDBC channel ............................. SUCCESS [48.563s]
[INFO] Flume NG Node ..................................... SUCCESS [29.651s]
[INFO] Flume NG file-based channel ....................... SUCCESS [4:09.181s]
[INFO] Flume NG file backed Memory channel ............... SUCCESS [34.817s]
[INFO] Flume legacy Sources .............................. SUCCESS [7.526s]
[INFO] Flume legacy Avro source .......................... SUCCESS [11.672s]
[INFO] Flume legacy Thrift Source ........................ SUCCESS [11.012s]
[INFO] Flume NG Clients .................................. SUCCESS [6.330s]
[INFO] Flume NG Log4j Appender ........................... SUCCESS [10.754s]
[INFO] Flume NG distribution ............................. SUCCESS [27.436s]
[INFO] Flume NG Integration Tests ........................ SUCCESS [48.330s]
[INFO] ------------------------------------------------------------------------
[INFO] BUILD SUCCESS
[INFO] ------------------------------------------------------------------------
[INFO] Total time: 17:10.899s
[INFO] Finished at: Fri Oct 19 00:07:46 UTC 2012
[INFO] Final Memory: 195M/493M
[INFO] ------------------------------------------------------------------------
Projects to build: [MavenProject: org.apache.flume:flume-parent:1.3.0 @ <https://builds.apache.org/job/flume-1.3.0/ws/pom.xml,> MavenProject: org.apache.flume:flume-ng-sdk:1.3.0 @ <https://builds.apache.org/job/flume-1.3.0/ws/flume-ng-sdk/pom.xml,> MavenProject: org.apache.flume:flume-ng-configuration:1.3.0 @ <https://builds.apache.org/job/flume-1.3.0/ws/flume-ng-configuration/pom.xml,> MavenProject: org.apache.flume:flume-ng-core:1.3.0 @ <https://builds.apache.org/job/flume-1.3.0/ws/flume-ng-core/pom.xml,> MavenProject: org.apache.flume:flume-ng-sinks:1.3.0 @ <https://builds.apache.org/job/flume-1.3.0/ws/flume-ng-sinks/pom.xml,> MavenProject: org.apache.flume.flume-ng-sinks:flume-hdfs-sink:1.3.0 @ <https://builds.apache.org/job/flume-1.3.0/ws/flume-ng-sinks/flume-hdfs-sink/pom.xml,> MavenProject: org.apache.flume.flume-ng-sinks:flume-irc-sink:1.3.0 @ <https://builds.apache.org/job/flume-1.3.0/ws/flume-ng-sinks/flume-irc-sink/pom.xml,> MavenProject: org.apache.flume.flume-ng-sinks:flume-ng-hbase-sink:1.3.0 @ <https://builds.apache.org/job/flume-1.3.0/ws/flume-ng-sinks/flume-ng-hbase-sink/pom.xml,> MavenProject: org.apache.flume:flume-ng-sources:1.3.0 @ <https://builds.apache.org/job/flume-1.3.0/ws/flume-ng-sources/pom.xml,> MavenProject: org.apache.flume.flume-ng-sources:flume-scribe-source:1.3.0 @ <https://builds.apache.org/job/flume-1.3.0/ws/flume-ng-sources/flume-scribe-source/pom.xml,> MavenProject: org.apache.flume:flume-ng-channels:1.3.0 @ <https://builds.apache.org/job/flume-1.3.0/ws/flume-ng-channels/pom.xml,> MavenProject: org.apache.flume.flume-ng-channels:flume-jdbc-channel:1.3.0 @ <https://builds.apache.org/job/flume-1.3.0/ws/flume-ng-channels/flume-jdbc-channel/pom.xml,> MavenProject: org.apache.flume:flume-ng-node:1.3.0 @ <https://builds.apache.org/job/flume-1.3.0/ws/flume-ng-node/pom.xml,> MavenProject: org.apache.flume.flume-ng-channels:flume-file-channel:1.3.0 @ <https://builds.apache.org/job/flume-1.3.0/ws/flume-ng-channels/flume-file-channel/pom.xml,> MavenProject: org.apache.flume.flume-ng-channels:flume-recoverable-memory-channel:1.3.0 @ <https://builds.apache.org/job/flume-1.3.0/ws/flume-ng-channels/flume-recoverable-memory-channel/pom.xml,> MavenProject: org.apache.flume:flume-ng-legacy-sources:1.3.0 @ <https://builds.apache.org/job/flume-1.3.0/ws/flume-ng-legacy-sources/pom.xml,> MavenProject: org.apache.flume.flume-ng-legacy-sources:flume-avro-source:1.3.0 @ <https://builds.apache.org/job/flume-1.3.0/ws/flume-ng-legacy-sources/flume-avro-source/pom.xml,> MavenProject: org.apache.flume.flume-ng-legacy-sources:flume-thrift-source:1.3.0 @ <https://builds.apache.org/job/flume-1.3.0/ws/flume-ng-legacy-sources/flume-thrift-source/pom.xml,> MavenProject: org.apache.flume:flume-ng-clients:1.3.0 @ <https://builds.apache.org/job/flume-1.3.0/ws/flume-ng-clients/pom.xml,> MavenProject: org.apache.flume.flume-ng-clients:flume-ng-log4jappender:1.3.0 @ <https://builds.apache.org/job/flume-1.3.0/ws/flume-ng-clients/flume-ng-log4jappender/pom.xml,> MavenProject: org.apache.flume:flume-ng-dist:1.3.0 @ <https://builds.apache.org/job/flume-1.3.0/ws/flume-ng-dist/pom.xml,> MavenProject: org.apache.flume:flume-ng-tests:1.3.0 @ <https://builds.apache.org/job/flume-1.3.0/ws/flume-ng-tests/pom.xml]>
[JENKINS] Archiving <https://builds.apache.org/job/flume-1.3.0/ws/flume-ng-legacy-sources/pom.xml> to /home/hudson/hudson/jobs/flume-1.3.0/modules/org.apache.flume$flume-ng-legacy-sources/builds/2012-10-18_23-50-04/archive/org.apache.flume/flume-ng-legacy-sources/1.3.0/flume-ng-legacy-sources-1.3.0.pom
[JENKINS] Archiving <https://builds.apache.org/job/flume-1.3.0/ws/flume-ng-channels/flume-file-channel/pom.xml> to /home/hudson/hudson/jobs/flume-1.3.0/modules/org.apache.flume.flume-ng-channels$flume-file-channel/builds/2012-10-18_23-50-04/archive/org.apache.flume.flume-ng-channels/flume-file-channel/1.3.0/flume-file-channel-1.3.0.pom
[JENKINS] Archiving <https://builds.apache.org/job/flume-1.3.0/ws/flume-ng-channels/flume-file-channel/target/flume-file-channel-1.3.0.jar> to /home/hudson/hudson/jobs/flume-1.3.0/modules/org.apache.flume.flume-ng-channels$flume-file-channel/builds/2012-10-18_23-50-04/archive/org.apache.flume.flume-ng-channels/flume-file-channel/1.3.0/flume-file-channel-1.3.0.jar
[JENKINS] Archiving <https://builds.apache.org/job/flume-1.3.0/ws/flume-ng-core/pom.xml> to /home/hudson/hudson/jobs/flume-1.3.0/modules/org.apache.flume$flume-ng-core/builds/2012-10-18_23-50-04/archive/org.apache.flume/flume-ng-core/1.3.0/flume-ng-core-1.3.0.pom
[JENKINS] Archiving <https://builds.apache.org/job/flume-1.3.0/ws/flume-ng-core/target/flume-ng-core-1.3.0.jar> to /home/hudson/hudson/jobs/flume-1.3.0/modules/org.apache.flume$flume-ng-core/builds/2012-10-18_23-50-04/archive/org.apache.flume/flume-ng-core/1.3.0/flume-ng-core-1.3.0.jar
[JENKINS] Archiving <https://builds.apache.org/job/flume-1.3.0/ws/flume-ng-sinks/flume-hdfs-sink/pom.xml> to /home/hudson/hudson/jobs/flume-1.3.0/modules/org.apache.flume.flume-ng-sinks$flume-hdfs-sink/builds/2012-10-18_23-50-04/archive/org.apache.flume.flume-ng-sinks/flume-hdfs-sink/1.3.0/flume-hdfs-sink-1.3.0.pom
[JENKINS] Archiving <https://builds.apache.org/job/flume-1.3.0/ws/flume-ng-sinks/flume-hdfs-sink/target/flume-hdfs-sink-1.3.0.jar> to /home/hudson/hudson/jobs/flume-1.3.0/modules/org.apache.flume.flume-ng-sinks$flume-hdfs-sink/builds/2012-10-18_23-50-04/archive/org.apache.flume.flume-ng-sinks/flume-hdfs-sink/1.3.0/flume-hdfs-sink-1.3.0.jar
[JENKINS] Archiving <https://builds.apache.org/job/flume-1.3.0/ws/flume-ng-sources/pom.xml> to /home/hudson/hudson/jobs/flume-1.3.0/modules/org.apache.flume$flume-ng-sources/builds/2012-10-18_23-50-04/archive/org.apache.flume/flume-ng-sources/1.3.0/flume-ng-sources-1.3.0.pom
[JENKINS] Archiving <https://builds.apache.org/job/flume-1.3.0/ws/flume-ng-legacy-sources/flume-avro-source/pom.xml> to /home/hudson/hudson/jobs/flume-1.3.0/modules/org.apache.flume.flume-ng-legacy-sources$flume-avro-source/builds/2012-10-18_23-50-04/archive/org.apache.flume.flume-ng-legacy-sources/flume-avro-source/1.3.0/flume-avro-source-1.3.0.pom
[JENKINS] Archiving <https://builds.apache.org/job/flume-1.3.0/ws/flume-ng-legacy-sources/flume-avro-source/target/flume-avro-source-1.3.0.jar> to /home/hudson/hudson/jobs/flume-1.3.0/modules/org.apache.flume.flume-ng-legacy-sources$flume-avro-source/builds/2012-10-18_23-50-04/archive/org.apache.flume.flume-ng-legacy-sources/flume-avro-source/1.3.0/flume-avro-source-1.3.0.jar
[JENKINS] Archiving <https://builds.apache.org/job/flume-1.3.0/ws/flume-ng-node/pom.xml> to /home/hudson/hudson/jobs/flume-1.3.0/modules/org.apache.flume$flume-ng-node/builds/2012-10-18_23-50-04/archive/org.apache.flume/flume-ng-node/1.3.0/flume-ng-node-1.3.0.pom
[JENKINS] Archiving <https://builds.apache.org/job/flume-1.3.0/ws/flume-ng-node/target/flume-ng-node-1.3.0.jar> to /home/hudson/hudson/jobs/flume-1.3.0/modules/org.apache.flume$flume-ng-node/builds/2012-10-18_23-50-04/archive/org.apache.flume/flume-ng-node/1.3.0/flume-ng-node-1.3.0.jar
[JENKINS] Archiving <https://builds.apache.org/job/flume-1.3.0/ws/flume-ng-legacy-sources/flume-thrift-source/pom.xml> to /home/hudson/hudson/jobs/flume-1.3.0/modules/org.apache.flume.flume-ng-legacy-sources$flume-thrift-source/builds/2012-10-18_23-50-04/archive/org.apache.flume.flume-ng-legacy-sources/flume-thrift-source/1.3.0/flume-thrift-source-1.3.0.pom
[JENKINS] Archiving <https://builds.apache.org/job/flume-1.3.0/ws/flume-ng-legacy-sources/flume-thrift-source/target/flume-thrift-source-1.3.0.jar> to /home/hudson/hudson/jobs/flume-1.3.0/modules/org.apache.flume.flume-ng-legacy-sources$flume-thrift-source/builds/2012-10-18_23-50-04/archive/org.apache.flume.flume-ng-legacy-sources/flume-thrift-source/1.3.0/flume-thrift-source-1.3.0.jar
[JENKINS] Archiving <https://builds.apache.org/job/flume-1.3.0/ws/flume-ng-sources/flume-scribe-source/pom.xml> to /home/hudson/hudson/jobs/flume-1.3.0/modules/org.apache.flume.flume-ng-sources$flume-scribe-source/builds/2012-10-18_23-50-04/archive/org.apache.flume.flume-ng-sources/flume-scribe-source/1.3.0/flume-scribe-source-1.3.0.pom
[JENKINS] Archiving <https://builds.apache.org/job/flume-1.3.0/ws/flume-ng-sources/flume-scribe-source/target/flume-scribe-source-1.3.0.jar> to /home/hudson/hudson/jobs/flume-1.3.0/modules/org.apache.flume.flume-ng-sources$flume-scribe-source/builds/2012-10-18_23-50-04/archive/org.apache.flume.flume-ng-sources/flume-scribe-source/1.3.0/flume-scribe-source-1.3.0.jar
[JENKINS] Archiving <https://builds.apache.org/job/flume-1.3.0/ws/flume-ng-tests/pom.xml> to /home/hudson/hudson/jobs/flume-1.3.0/modules/org.apache.flume$flume-ng-tests/builds/2012-10-18_23-50-04/archive/org.apache.flume/flume-ng-tests/1.3.0/flume-ng-tests-1.3.0.pom
[JENKINS] Archiving <https://builds.apache.org/job/flume-1.3.0/ws/flume-ng-tests/target/flume-ng-tests-1.3.0.jar> to /home/hudson/hudson/jobs/flume-1.3.0/modules/org.apache.flume$flume-ng-tests/builds/2012-10-18_23-50-04/archive/org.apache.flume/flume-ng-tests/1.3.0/flume-ng-tests-1.3.0.jar
[JENKINS] Archiving <https://builds.apache.org/job/flume-1.3.0/ws/flume-ng-sinks/flume-irc-sink/pom.xml> to /home/hudson/hudson/jobs/flume-1.3.0/modules/org.apache.flume.flume-ng-sinks$flume-irc-sink/builds/2012-10-18_23-50-04/archive/org.apache.flume.flume-ng-sinks/flume-irc-sink/1.3.0/flume-irc-sink-1.3.0.pom
[JENKINS] Archiving <https://builds.apache.org/job/flume-1.3.0/ws/flume-ng-sinks/flume-irc-sink/target/flume-irc-sink-1.3.0.jar> to /home/hudson/hudson/jobs/flume-1.3.0/modules/org.apache.flume.flume-ng-sinks$flume-irc-sink/builds/2012-10-18_23-50-04/archive/org.apache.flume.flume-ng-sinks/flume-irc-sink/1.3.0/flume-irc-sink-1.3.0.jar
[JENKINS] Archiving <https://builds.apache.org/job/flume-1.3.0/ws/flume-ng-configuration/pom.xml> to /home/hudson/hudson/jobs/flume-1.3.0/modules/org.apache.flume$flume-ng-configuration/builds/2012-10-18_23-50-04/archive/org.apache.flume/flume-ng-configuration/1.3.0/flume-ng-configuration-1.3.0.pom
[JENKINS] Archiving <https://builds.apache.org/job/flume-1.3.0/ws/flume-ng-configuration/target/flume-ng-configuration-1.3.0.jar> to /home/hudson/hudson/jobs/flume-1.3.0/modules/org.apache.flume$flume-ng-configuration/builds/2012-10-18_23-50-04/archive/org.apache.flume/flume-ng-configuration/1.3.0/flume-ng-configuration-1.3.0.jar
[JENKINS] Archiving <https://builds.apache.org/job/flume-1.3.0/ws/flume-ng-sdk/pom.xml> to /home/hudson/hudson/jobs/flume-1.3.0/modules/org.apache.flume$flume-ng-sdk/builds/2012-10-18_23-50-04/archive/org.apache.flume/flume-ng-sdk/1.3.0/flume-ng-sdk-1.3.0.pom
[JENKINS] Archiving <https://builds.apache.org/job/flume-1.3.0/ws/flume-ng-sdk/target/flume-ng-sdk-1.3.0.jar> to /home/hudson/hudson/jobs/flume-1.3.0/modules/org.apache.flume$flume-ng-sdk/builds/2012-10-18_23-50-04/archive/org.apache.flume/flume-ng-sdk/1.3.0/flume-ng-sdk-1.3.0.jar
[JENKINS] Archiving <https://builds.apache.org/job/flume-1.3.0/ws/flume-ng-clients/pom.xml> to /home/hudson/hudson/jobs/flume-1.3.0/modules/org.apache.flume$flume-ng-clients/builds/2012-10-18_23-50-04/archive/org.apache.flume/flume-ng-clients/1.3.0/flume-ng-clients-1.3.0.pom
[JENKINS] Archiving <https://builds.apache.org/job/flume-1.3.0/ws/flume-ng-dist/pom.xml> to /home/hudson/hudson/jobs/flume-1.3.0/modules/org.apache.flume$flume-ng-dist/builds/2012-10-18_23-50-04/archive/org.apache.flume/flume-ng-dist/1.3.0/flume-ng-dist-1.3.0.pom
[JENKINS] Archiving <https://builds.apache.org/job/flume-1.3.0/ws/flume-ng-dist/target/apache-flume-1.3.0-dist.tar.gz> to /home/hudson/hudson/jobs/flume-1.3.0/modules/org.apache.flume$flume-ng-dist/builds/2012-10-18_23-50-04/archive/org.apache.flume/flume-ng-dist/1.3.0/flume-ng-dist-1.3.0-dist.tar.gz
[JENKINS] Archiving <https://builds.apache.org/job/flume-1.3.0/ws/flume-ng-dist/target/apache-flume-1.3.0-src.tar.gz> to /home/hudson/hudson/jobs/flume-1.3.0/modules/org.apache.flume$flume-ng-dist/builds/2012-10-18_23-50-04/archive/org.apache.flume/flume-ng-dist/1.3.0/flume-ng-dist-1.3.0-src.tar.gz
[JENKINS] Archiving <https://builds.apache.org/job/flume-1.3.0/ws/pom.xml> to /home/hudson/hudson/jobs/flume-1.3.0/modules/org.apache.flume$flume-parent/builds/2012-10-18_23-50-04/archive/org.apache.flume/flume-parent/1.3.0/flume-parent-1.3.0.pom
[JENKINS] Archiving <https://builds.apache.org/job/flume-1.3.0/ws/target/flume-parent-1.3.0-javadoc.jar> to /home/hudson/hudson/jobs/flume-1.3.0/modules/org.apache.flume$flume-parent/builds/2012-10-18_23-50-04/archive/org.apache.flume/flume-parent/1.3.0/flume-parent-1.3.0-javadoc.jar
[JENKINS] Archiving <https://builds.apache.org/job/flume-1.3.0/ws/target/flume-parent-1.3.0-site.xml> to /home/hudson/hudson/jobs/flume-1.3.0/modules/org.apache.flume$flume-parent/builds/2012-10-18_23-50-04/archive/org.apache.flume/flume-parent/1.3.0/flume-parent-1.3.0-site.xml
[JENKINS] Archiving <https://builds.apache.org/job/flume-1.3.0/ws/flume-ng-channels/flume-recoverable-memory-channel/pom.xml> to /home/hudson/hudson/jobs/flume-1.3.0/modules/org.apache.flume.flume-ng-channels$flume-recoverable-memory-channel/builds/2012-10-18_23-50-04/archive/org.apache.flume.flume-ng-channels/flume-recoverable-memory-channel/1.3.0/flume-recoverable-memory-channel-1.3.0.pom
[JENKINS] Archiving <https://builds.apache.org/job/flume-1.3.0/ws/flume-ng-channels/flume-recoverable-memory-channel/target/flume-recoverable-memory-channel-1.3.0.jar> to /home/hudson/hudson/jobs/flume-1.3.0/modules/org.apache.flume.flume-ng-channels$flume-recoverable-memory-channel/builds/2012-10-18_23-50-04/archive/org.apache.flume.flume-ng-channels/flume-recoverable-memory-channel/1.3.0/flume-recoverable-memory-channel-1.3.0.jar
[JENKINS] Archiving <https://builds.apache.org/job/flume-1.3.0/ws/flume-ng-sinks/flume-ng-hbase-sink/pom.xml> to /home/hudson/hudson/jobs/flume-1.3.0/modules/org.apache.flume.flume-ng-sinks$flume-ng-hbase-sink/builds/2012-10-18_23-50-04/archive/org.apache.flume.flume-ng-sinks/flume-ng-hbase-sink/1.3.0/flume-ng-hbase-sink-1.3.0.pom
[JENKINS] Archiving <https://builds.apache.org/job/flume-1.3.0/ws/flume-ng-sinks/flume-ng-hbase-sink/target/flume-ng-hbase-sink-1.3.0.jar> to /home/hudson/hudson/jobs/flume-1.3.0/modules/org.apache.flume.flume-ng-sinks$flume-ng-hbase-sink/builds/2012-10-18_23-50-04/archive/org.apache.flume.flume-ng-sinks/flume-ng-hbase-sink/1.3.0/flume-ng-hbase-sink-1.3.0.jar
[JENKINS] Archiving <https://builds.apache.org/job/flume-1.3.0/ws/flume-ng-clients/flume-ng-log4jappender/pom.xml> to /home/hudson/hudson/jobs/flume-1.3.0/modules/org.apache.flume.flume-ng-clients$flume-ng-log4jappender/builds/2012-10-18_23-50-04/archive/org.apache.flume.flume-ng-clients/flume-ng-log4jappender/1.3.0/flume-ng-log4jappender-1.3.0.pom
[JENKINS] Archiving <https://builds.apache.org/job/flume-1.3.0/ws/flume-ng-clients/flume-ng-log4jappender/target/flume-ng-log4jappender-1.3.0.jar> to /home/hudson/hudson/jobs/flume-1.3.0/modules/org.apache.flume.flume-ng-clients$flume-ng-log4jappender/builds/2012-10-18_23-50-04/archive/org.apache.flume.flume-ng-clients/flume-ng-log4jappender/1.3.0/flume-ng-log4jappender-1.3.0.jar
[JENKINS] Archiving <https://builds.apache.org/job/flume-1.3.0/ws/flume-ng-channels/pom.xml> to /home/hudson/hudson/jobs/flume-1.3.0/modules/org.apache.flume$flume-ng-channels/builds/2012-10-18_23-50-04/archive/org.apache.flume/flume-ng-channels/1.3.0/flume-ng-channels-1.3.0.pom
[JENKINS] Archiving <https://builds.apache.org/job/flume-1.3.0/ws/flume-ng-sinks/pom.xml> to /home/hudson/hudson/jobs/flume-1.3.0/modules/org.apache.flume$flume-ng-sinks/builds/2012-10-18_23-50-04/archive/org.apache.flume/flume-ng-sinks/1.3.0/flume-ng-sinks-1.3.0.pom
[JENKINS] Archiving <https://builds.apache.org/job/flume-1.3.0/ws/flume-ng-channels/flume-jdbc-channel/pom.xml> to /home/hudson/hudson/jobs/flume-1.3.0/modules/org.apache.flume.flume-ng-channels$flume-jdbc-channel/builds/2012-10-18_23-50-04/archive/org.apache.flume.flume-ng-channels/flume-jdbc-channel/1.3.0/flume-jdbc-channel-1.3.0.pom
[JENKINS] Archiving <https://builds.apache.org/job/flume-1.3.0/ws/flume-ng-channels/flume-jdbc-channel/target/flume-jdbc-channel-1.3.0.jar> to /home/hudson/hudson/jobs/flume-1.3.0/modules/org.apache.flume.flume-ng-channels$flume-jdbc-channel/builds/2012-10-18_23-50-04/archive/org.apache.flume.flume-ng-channels/flume-jdbc-channel/1.3.0/flume-jdbc-channel-1.3.0.jar
Waiting for Jenkins to finish collecting data
channel stopped
[WARNINGS] Parsing warnings in console log with parser AcuCobol Compiler
Maven RedeployPublisher use remote ubuntu1 maven settings from : /home/jenkins/.m2/settings.xml
[INFO] Deployment in https://repository.apache.org/content/repositories/snapshots (id=apache.snapshots.https,uniqueVersion=true)
Deploying the main artifact flume-ng-channels-1.3.0.pom
Uploading: https://repository.apache.org/content/repositories/snapshots/org/apache/flume/flume-ng-channels/1.3.0/flume-ng-channels-1.3.0.pom
ERROR: Failed to deploy artifacts: Could not transfer artifact org.apache.flume:flume-ng-channels:pom:1.3.0 from/to apache.snapshots.https (https://repository.apache.org/content/repositories/snapshots): Failed to transfer file: https://repository.apache.org/content/repositories/snapshots/org/apache/flume/flume-ng-channels/1.3.0/flume-ng-channels-1.3.0.pom. Return code is: 400, ReasonPhrase:Bad Request.
org.apache.maven.artifact.deployer.ArtifactDeploymentException: Failed to deploy artifacts: Could not transfer artifact org.apache.flume:flume-ng-channels:pom:1.3.0 from/to apache.snapshots.https (https://repository.apache.org/content/repositories/snapshots): Failed to transfer file: https://repository.apache.org/content/repositories/snapshots/org/apache/flume/flume-ng-channels/1.3.0/flume-ng-channels-1.3.0.pom. Return code is: 400, ReasonPhrase:Bad Request.
at org.apache.maven.artifact.deployer.DefaultArtifactDeployer.deploy(DefaultArtifactDeployer.java:141)
at hudson.maven.reporters.MavenArtifactRecord.deploy(MavenArtifactRecord.java:190)
at hudson.maven.RedeployPublisher.perform(RedeployPublisher.java:174)
at hudson.tasks.BuildStepMonitor$1.perform(BuildStepMonitor.java:19)
at hudson.model.AbstractBuild$AbstractBuildExecution.perform(AbstractBuild.java:717)
at hudson.model.AbstractBuild$AbstractBuildExecution.performAllBuildSteps(AbstractBuild.java:692)
at hudson.maven.MavenModuleSetBuild$MavenModuleSetBuildExecution.post2(MavenModuleSetBuild.java:994)
at hudson.model.AbstractBuild$AbstractBuildExecution.post(AbstractBuild.java:639)
at hudson.model.Run.execute(Run.java:1527)
at hudson.maven.MavenModuleSetBuild.run(MavenModuleSetBuild.java:477)
at hudson.model.ResourceController.execute(ResourceController.java:88)
at hudson.model.Executor.run(Executor.java:236)
Caused by: org.sonatype.aether.deployment.DeploymentException: Failed to deploy artifacts: Could not transfer artifact org.apache.flume:flume-ng-channels:pom:1.3.0 from/to apache.snapshots.https (https://repository.apache.org/content/repositories/snapshots): Failed to transfer file: https://repository.apache.org/content/repositories/snapshots/org/apache/flume/flume-ng-channels/1.3.0/flume-ng-channels-1.3.0.pom. Return code is: 400, ReasonPhrase:Bad Request.
at org.sonatype.aether.impl.internal.DefaultDeployer.deploy(DefaultDeployer.java:280)
at org.sonatype.aether.impl.internal.DefaultDeployer.deploy(DefaultDeployer.java:211)
at org.sonatype.aether.impl.internal.DefaultRepositorySystem.deploy(DefaultRepositorySystem.java:443)
at org.apache.maven.artifact.deployer.DefaultArtifactDeployer.deploy(DefaultArtifactDeployer.java:137)
... 11 more
Caused by: org.sonatype.aether.transfer.ArtifactTransferException: Could not transfer artifact org.apache.flume:flume-ng-channels:pom:1.3.0 from/to apache.snapshots.https (https://repository.apache.org/content/repositories/snapshots): Failed to transfer file: https://repository.apache.org/content/repositories/snapshots/org/apache/flume/flume-ng-channels/1.3.0/flume-ng-channels-1.3.0.pom. Return code is: 400, ReasonPhrase:Bad Request.
at org.sonatype.aether.connector.wagon.WagonRepositoryConnector$4.wrap(WagonRepositoryConnector.java:951)
at org.sonatype.aether.connector.wagon.WagonRepositoryConnector$4.wrap(WagonRepositoryConnector.java:941)
at org.sonatype.aether.connector.wagon.WagonRepositoryConnector$PutTask.run(WagonRepositoryConnector.java:837)
at org.sonatype.aether.connector.wagon.WagonRepositoryConnector.put(WagonRepositoryConnector.java:467)
at org.sonatype.aether.impl.internal.DefaultDeployer.deploy(DefaultDeployer.java:274)
... 14 more
Caused by: org.apache.maven.wagon.TransferFailedException: Failed to transfer file: https://repository.apache.org/content/repositories/snapshots/org/apache/flume/flume-ng-channels/1.3.0/flume-ng-channels-1.3.0.pom. Return code is: 400, ReasonPhrase:Bad Request.
at org.apache.maven.wagon.shared.http4.AbstractHttpClientWagon.put(AbstractHttpClientWagon.java:562)
at org.apache.maven.wagon.shared.http4.AbstractHttpClientWagon.put(AbstractHttpClientWagon.java:471)
at org.apache.maven.wagon.shared.http4.AbstractHttpClientWagon.put(AbstractHttpClientWagon.java:451)
at org.sonatype.aether.connector.wagon.WagonRepositoryConnector$PutTask.run(WagonRepositoryConnector.java:811)
... 16 more
[INFO] Deployment failed after 0.58 sec
Build step 'Deploy artifacts to Maven repository' changed build result to FAILURE
Updating FLUME-1638
Updating FLUME-1650
Updating FLUME-1651
Updating FLUME-1337
Updating FLUME-1622
Updating FLUME-1620
Jenkins build is unstable: flume-1.3.0 #10
Posted by Apache Jenkins Server <je...@builds.apache.org>.
See <https://builds.apache.org/job/flume-1.3.0/10/>
Build failed in Jenkins: flume-1.3.0 #9
Posted by Apache Jenkins Server <je...@builds.apache.org>.
See <https://builds.apache.org/job/flume-1.3.0/9/changes>
Changes:
[harishreedharan] FLUME-1545. File channel missing explicit dependency on commons-lang.
[harishreedharan] FLUME-1546. File channel encryption: trim() passwords and warn user if he doesn't have JCE policy file
[brock] FLUME-1544: Update dev guide to reflect the protoc requirement
[mpercy] FLUME-1543. TestFileChannel should be factored into many tests.
[harishreedharan] FLUME-1548. Build dies on older protocol buffers compiler.
------------------------------------------
[...truncated 4734 lines...]
[ERROR] <https://builds.apache.org/job/flume-1.3.0/ws/flume-ng-tests/src/test/java/org/apache/flume/test/agent/TestRpcClientCommunicationFailure.java>:[54,23] cannot find symbol
symbol : variable EventBuilder
location: class org.apache.flume.test.agent.TestRpcClientCommunicationFailure
[ERROR] <https://builds.apache.org/job/flume-1.3.0/ws/flume-ng-tests/src/test/java/org/apache/flume/test/agent/TestRpcClientCommunicationFailure.java>:[56,16] cannot find symbol
symbol : class EventDeliveryException
location: class org.apache.flume.test.agent.TestRpcClientCommunicationFailure
[ERROR] <https://builds.apache.org/job/flume-1.3.0/ws/flume-ng-tests/src/test/java/org/apache/flume/test/agent/TestRpcClient.java>:[48,4] cannot find symbol
symbol : class RpcClient
location: class org.apache.flume.test.agent.TestRpcClient
[ERROR] <https://builds.apache.org/job/flume-1.3.0/ws/flume-ng-tests/src/test/java/org/apache/flume/test/agent/TestRpcClient.java>:[48,23] cannot find symbol
symbol : variable RpcClientFactory
location: class org.apache.flume.test.agent.TestRpcClient
[ERROR] <https://builds.apache.org/job/flume-1.3.0/ws/flume-ng-tests/src/test/java/org/apache/flume/test/agent/TestRpcClient.java>:[51,20] cannot find symbol
symbol : variable EventBuilder
location: class org.apache.flume.test.agent.TestRpcClient
[INFO] 15 errors
[INFO] -------------------------------------------------------------
mojoFailed org.apache.maven.plugins:maven-compiler-plugin:2.3.2(default-testCompile)
projectFailed org.apache.flume:flume-ng-tests:1.3.0-SNAPSHOT
sessionEnded
[INFO] ------------------------------------------------------------------------
[INFO] Reactor Summary:
[INFO]
[INFO] Apache Flume ...................................... SUCCESS [1:38.966s]
[INFO] Flume NG SDK ...................................... SUCCESS [58.511s]
[INFO] Flume NG Configuration ............................ SUCCESS [11.412s]
[INFO] Flume NG Core ..................................... SUCCESS [2:26.041s]
[INFO] Flume NG Sinks .................................... SUCCESS [8.380s]
[INFO] Flume NG HDFS Sink ................................ SUCCESS [45.483s]
[INFO] Flume NG IRC Sink ................................. SUCCESS [8.716s]
[INFO] Flume NG HBase Sink ............................... FAILURE [6.432s]
[INFO] Flume Sources ..................................... SUCCESS [6.765s]
[INFO] Flume Scribe Source ............................... SUCCESS [9.087s]
[INFO] Flume NG Channels ................................. SUCCESS [7.969s]
[INFO] Flume NG JDBC channel ............................. SUCCESS [47.380s]
[INFO] Flume NG Node ..................................... SUCCESS [28.375s]
[INFO] Flume NG file-based channel ....................... FAILURE [6.144s]
[INFO] Flume NG file backed Memory channel ............... SUCCESS [35.523s]
[INFO] Flume legacy Sources .............................. SUCCESS [7.894s]
[INFO] Flume legacy Avro source .......................... SUCCESS [11.457s]
[INFO] Flume legacy Thrift Source ........................ SUCCESS [9.651s]
[INFO] Flume NG Clients .................................. SUCCESS [6.745s]
[INFO] Flume NG Log4j Appender ........................... FAILURE [1.679s]
[INFO] Flume NG distribution ............................. SKIPPED
[INFO] Flume NG Integration Tests ........................ FAILURE [2.049s]
[INFO] ------------------------------------------------------------------------
[INFO] BUILD FAILURE
[INFO] ------------------------------------------------------------------------
[INFO] Total time: 9:30.047s
[INFO] Finished at: Sun Sep 09 02:04:40 UTC 2012
[INFO] Final Memory: 168M/359M
[INFO] ------------------------------------------------------------------------
Projects to build: [MavenProject: org.apache.flume:flume-parent:1.3.0-SNAPSHOT @ <https://builds.apache.org/job/flume-1.3.0/ws/pom.xml,> MavenProject: org.apache.flume:flume-ng-sdk:1.3.0-SNAPSHOT @ <https://builds.apache.org/job/flume-1.3.0/ws/flume-ng-sdk/pom.xml,> MavenProject: org.apache.flume:flume-ng-configuration:1.3.0-SNAPSHOT @ <https://builds.apache.org/job/flume-1.3.0/ws/flume-ng-configuration/pom.xml,> MavenProject: org.apache.flume:flume-ng-core:1.3.0-SNAPSHOT @ <https://builds.apache.org/job/flume-1.3.0/ws/flume-ng-core/pom.xml,> MavenProject: org.apache.flume:flume-ng-sinks:1.3.0-SNAPSHOT @ <https://builds.apache.org/job/flume-1.3.0/ws/flume-ng-sinks/pom.xml,> MavenProject: org.apache.flume.flume-ng-sinks:flume-hdfs-sink:1.3.0-SNAPSHOT @ <https://builds.apache.org/job/flume-1.3.0/ws/flume-ng-sinks/flume-hdfs-sink/pom.xml,> MavenProject: org.apache.flume.flume-ng-sinks:flume-irc-sink:1.3.0-SNAPSHOT @ <https://builds.apache.org/job/flume-1.3.0/ws/flume-ng-sinks/flume-irc-sink/pom.xml,> MavenProject: org.apache.flume.flume-ng-sinks:flume-ng-hbase-sink:1.3.0-SNAPSHOT @ <https://builds.apache.org/job/flume-1.3.0/ws/flume-ng-sinks/flume-ng-hbase-sink/pom.xml,> MavenProject: org.apache.flume:flume-ng-sources:1.3.0-SNAPSHOT @ <https://builds.apache.org/job/flume-1.3.0/ws/flume-ng-sources/pom.xml,> MavenProject: org.apache.flume.flume-ng-sources:flume-scribe-source:1.3.0-SNAPSHOT @ <https://builds.apache.org/job/flume-1.3.0/ws/flume-ng-sources/flume-scribe-source/pom.xml,> MavenProject: org.apache.flume:flume-ng-channels:1.3.0-SNAPSHOT @ <https://builds.apache.org/job/flume-1.3.0/ws/flume-ng-channels/pom.xml,> MavenProject: org.apache.flume.flume-ng-channels:flume-jdbc-channel:1.3.0-SNAPSHOT @ <https://builds.apache.org/job/flume-1.3.0/ws/flume-ng-channels/flume-jdbc-channel/pom.xml,> MavenProject: org.apache.flume:flume-ng-node:1.3.0-SNAPSHOT @ <https://builds.apache.org/job/flume-1.3.0/ws/flume-ng-node/pom.xml,> MavenProject: org.apache.flume.flume-ng-channels:flume-file-channel:1.3.0-SNAPSHOT @ <https://builds.apache.org/job/flume-1.3.0/ws/flume-ng-channels/flume-file-channel/pom.xml,> MavenProject: org.apache.flume.flume-ng-channels:flume-recoverable-memory-channel:1.3.0-SNAPSHOT @ <https://builds.apache.org/job/flume-1.3.0/ws/flume-ng-channels/flume-recoverable-memory-channel/pom.xml,> MavenProject: org.apache.flume:flume-ng-legacy-sources:1.3.0-SNAPSHOT @ <https://builds.apache.org/job/flume-1.3.0/ws/flume-ng-legacy-sources/pom.xml,> MavenProject: org.apache.flume.flume-ng-legacy-sources:flume-avro-source:1.3.0-SNAPSHOT @ <https://builds.apache.org/job/flume-1.3.0/ws/flume-ng-legacy-sources/flume-avro-source/pom.xml,> MavenProject: org.apache.flume.flume-ng-legacy-sources:flume-thrift-source:1.3.0-SNAPSHOT @ <https://builds.apache.org/job/flume-1.3.0/ws/flume-ng-legacy-sources/flume-thrift-source/pom.xml,> MavenProject: org.apache.flume:flume-ng-clients:1.3.0-SNAPSHOT @ <https://builds.apache.org/job/flume-1.3.0/ws/flume-ng-clients/pom.xml,> MavenProject: org.apache.flume.flume-ng-clients:flume-ng-log4jappender:1.3.0-SNAPSHOT @ <https://builds.apache.org/job/flume-1.3.0/ws/flume-ng-clients/flume-ng-log4jappender/pom.xml,> MavenProject: org.apache.flume:flume-ng-dist:1.3.0-SNAPSHOT @ <https://builds.apache.org/job/flume-1.3.0/ws/flume-ng-dist/pom.xml,> MavenProject: org.apache.flume:flume-ng-tests:1.3.0-SNAPSHOT @ <https://builds.apache.org/job/flume-1.3.0/ws/flume-ng-tests/pom.xml]>
[JENKINS] Archiving <https://builds.apache.org/job/flume-1.3.0/ws/flume-ng-legacy-sources/pom.xml> to /home/hudson/hudson/jobs/flume-1.3.0/modules/org.apache.flume$flume-ng-legacy-sources/builds/2012-09-09_01-54-57/archive/org.apache.flume/flume-ng-legacy-sources/1.3.0-SNAPSHOT/flume-ng-legacy-sources-1.3.0-SNAPSHOT.pom
[JENKINS] Archiving <https://builds.apache.org/job/flume-1.3.0/ws/flume-ng-channels/flume-file-channel/pom.xml> to /home/hudson/hudson/jobs/flume-1.3.0/modules/org.apache.flume.flume-ng-channels$flume-file-channel/builds/2012-09-09_01-54-57/archive/org.apache.flume.flume-ng-channels/flume-file-channel/1.3.0-SNAPSHOT/flume-file-channel-1.3.0-SNAPSHOT.pom
[JENKINS] Archiving <https://builds.apache.org/job/flume-1.3.0/ws/flume-ng-core/pom.xml> to /home/hudson/hudson/jobs/flume-1.3.0/modules/org.apache.flume$flume-ng-core/builds/2012-09-09_01-54-57/archive/org.apache.flume/flume-ng-core/1.3.0-SNAPSHOT/flume-ng-core-1.3.0-SNAPSHOT.pom
[JENKINS] Archiving <https://builds.apache.org/job/flume-1.3.0/ws/flume-ng-core/target/flume-ng-core-1.3.0-SNAPSHOT.jar> to /home/hudson/hudson/jobs/flume-1.3.0/modules/org.apache.flume$flume-ng-core/builds/2012-09-09_01-54-57/archive/org.apache.flume/flume-ng-core/1.3.0-SNAPSHOT/flume-ng-core-1.3.0-SNAPSHOT.jar
[JENKINS] Archiving <https://builds.apache.org/job/flume-1.3.0/ws/flume-ng-sinks/flume-hdfs-sink/pom.xml> to /home/hudson/hudson/jobs/flume-1.3.0/modules/org.apache.flume.flume-ng-sinks$flume-hdfs-sink/builds/2012-09-09_01-54-57/archive/org.apache.flume.flume-ng-sinks/flume-hdfs-sink/1.3.0-SNAPSHOT/flume-hdfs-sink-1.3.0-SNAPSHOT.pom
[JENKINS] Archiving <https://builds.apache.org/job/flume-1.3.0/ws/flume-ng-sinks/flume-hdfs-sink/target/flume-hdfs-sink-1.3.0-SNAPSHOT.jar> to /home/hudson/hudson/jobs/flume-1.3.0/modules/org.apache.flume.flume-ng-sinks$flume-hdfs-sink/builds/2012-09-09_01-54-57/archive/org.apache.flume.flume-ng-sinks/flume-hdfs-sink/1.3.0-SNAPSHOT/flume-hdfs-sink-1.3.0-SNAPSHOT.jar
[JENKINS] Archiving <https://builds.apache.org/job/flume-1.3.0/ws/flume-ng-sources/pom.xml> to /home/hudson/hudson/jobs/flume-1.3.0/modules/org.apache.flume$flume-ng-sources/builds/2012-09-09_01-54-57/archive/org.apache.flume/flume-ng-sources/1.3.0-SNAPSHOT/flume-ng-sources-1.3.0-SNAPSHOT.pom
[JENKINS] Archiving <https://builds.apache.org/job/flume-1.3.0/ws/flume-ng-legacy-sources/flume-avro-source/pom.xml> to /home/hudson/hudson/jobs/flume-1.3.0/modules/org.apache.flume.flume-ng-legacy-sources$flume-avro-source/builds/2012-09-09_01-54-57/archive/org.apache.flume.flume-ng-legacy-sources/flume-avro-source/1.3.0-SNAPSHOT/flume-avro-source-1.3.0-SNAPSHOT.pom
[JENKINS] Archiving <https://builds.apache.org/job/flume-1.3.0/ws/flume-ng-legacy-sources/flume-avro-source/target/flume-avro-source-1.3.0-SNAPSHOT.jar> to /home/hudson/hudson/jobs/flume-1.3.0/modules/org.apache.flume.flume-ng-legacy-sources$flume-avro-source/builds/2012-09-09_01-54-57/archive/org.apache.flume.flume-ng-legacy-sources/flume-avro-source/1.3.0-SNAPSHOT/flume-avro-source-1.3.0-SNAPSHOT.jar
[JENKINS] Archiving <https://builds.apache.org/job/flume-1.3.0/ws/flume-ng-node/pom.xml> to /home/hudson/hudson/jobs/flume-1.3.0/modules/org.apache.flume$flume-ng-node/builds/2012-09-09_01-54-57/archive/org.apache.flume/flume-ng-node/1.3.0-SNAPSHOT/flume-ng-node-1.3.0-SNAPSHOT.pom
[JENKINS] Archiving <https://builds.apache.org/job/flume-1.3.0/ws/flume-ng-node/target/flume-ng-node-1.3.0-SNAPSHOT.jar> to /home/hudson/hudson/jobs/flume-1.3.0/modules/org.apache.flume$flume-ng-node/builds/2012-09-09_01-54-57/archive/org.apache.flume/flume-ng-node/1.3.0-SNAPSHOT/flume-ng-node-1.3.0-SNAPSHOT.jar
[JENKINS] Archiving <https://builds.apache.org/job/flume-1.3.0/ws/flume-ng-legacy-sources/flume-thrift-source/pom.xml> to /home/hudson/hudson/jobs/flume-1.3.0/modules/org.apache.flume.flume-ng-legacy-sources$flume-thrift-source/builds/2012-09-09_01-54-57/archive/org.apache.flume.flume-ng-legacy-sources/flume-thrift-source/1.3.0-SNAPSHOT/flume-thrift-source-1.3.0-SNAPSHOT.pom
[JENKINS] Archiving <https://builds.apache.org/job/flume-1.3.0/ws/flume-ng-legacy-sources/flume-thrift-source/target/flume-thrift-source-1.3.0-SNAPSHOT.jar> to /home/hudson/hudson/jobs/flume-1.3.0/modules/org.apache.flume.flume-ng-legacy-sources$flume-thrift-source/builds/2012-09-09_01-54-57/archive/org.apache.flume.flume-ng-legacy-sources/flume-thrift-source/1.3.0-SNAPSHOT/flume-thrift-source-1.3.0-SNAPSHOT.jar
[JENKINS] Archiving <https://builds.apache.org/job/flume-1.3.0/ws/flume-ng-sources/flume-scribe-source/pom.xml> to /home/hudson/hudson/jobs/flume-1.3.0/modules/org.apache.flume.flume-ng-sources$flume-scribe-source/builds/2012-09-09_01-54-57/archive/org.apache.flume.flume-ng-sources/flume-scribe-source/1.3.0-SNAPSHOT/flume-scribe-source-1.3.0-SNAPSHOT.pom
[JENKINS] Archiving <https://builds.apache.org/job/flume-1.3.0/ws/flume-ng-sources/flume-scribe-source/target/flume-scribe-source-1.3.0-SNAPSHOT.jar> to /home/hudson/hudson/jobs/flume-1.3.0/modules/org.apache.flume.flume-ng-sources$flume-scribe-source/builds/2012-09-09_01-54-57/archive/org.apache.flume.flume-ng-sources/flume-scribe-source/1.3.0-SNAPSHOT/flume-scribe-source-1.3.0-SNAPSHOT.jar
[JENKINS] Archiving <https://builds.apache.org/job/flume-1.3.0/ws/flume-ng-tests/pom.xml> to /home/hudson/hudson/jobs/flume-1.3.0/modules/org.apache.flume$flume-ng-tests/builds/2012-09-09_01-54-57/archive/org.apache.flume/flume-ng-tests/1.3.0-SNAPSHOT/flume-ng-tests-1.3.0-SNAPSHOT.pom
[JENKINS] Archiving <https://builds.apache.org/job/flume-1.3.0/ws/flume-ng-sinks/flume-irc-sink/pom.xml> to /home/hudson/hudson/jobs/flume-1.3.0/modules/org.apache.flume.flume-ng-sinks$flume-irc-sink/builds/2012-09-09_01-54-57/archive/org.apache.flume.flume-ng-sinks/flume-irc-sink/1.3.0-SNAPSHOT/flume-irc-sink-1.3.0-SNAPSHOT.pom
[JENKINS] Archiving <https://builds.apache.org/job/flume-1.3.0/ws/flume-ng-sinks/flume-irc-sink/target/flume-irc-sink-1.3.0-SNAPSHOT.jar> to /home/hudson/hudson/jobs/flume-1.3.0/modules/org.apache.flume.flume-ng-sinks$flume-irc-sink/builds/2012-09-09_01-54-57/archive/org.apache.flume.flume-ng-sinks/flume-irc-sink/1.3.0-SNAPSHOT/flume-irc-sink-1.3.0-SNAPSHOT.jar
[JENKINS] Archiving <https://builds.apache.org/job/flume-1.3.0/ws/flume-ng-configuration/pom.xml> to /home/hudson/hudson/jobs/flume-1.3.0/modules/org.apache.flume$flume-ng-configuration/builds/2012-09-09_01-54-57/archive/org.apache.flume/flume-ng-configuration/1.3.0-SNAPSHOT/flume-ng-configuration-1.3.0-SNAPSHOT.pom
[JENKINS] Archiving <https://builds.apache.org/job/flume-1.3.0/ws/flume-ng-configuration/target/flume-ng-configuration-1.3.0-SNAPSHOT.jar> to /home/hudson/hudson/jobs/flume-1.3.0/modules/org.apache.flume$flume-ng-configuration/builds/2012-09-09_01-54-57/archive/org.apache.flume/flume-ng-configuration/1.3.0-SNAPSHOT/flume-ng-configuration-1.3.0-SNAPSHOT.jar
[JENKINS] Archiving <https://builds.apache.org/job/flume-1.3.0/ws/flume-ng-sdk/pom.xml> to /home/hudson/hudson/jobs/flume-1.3.0/modules/org.apache.flume$flume-ng-sdk/builds/2012-09-09_01-54-57/archive/org.apache.flume/flume-ng-sdk/1.3.0-SNAPSHOT/flume-ng-sdk-1.3.0-SNAPSHOT.pom
[JENKINS] Archiving <https://builds.apache.org/job/flume-1.3.0/ws/flume-ng-sdk/target/flume-ng-sdk-1.3.0-SNAPSHOT.jar> to /home/hudson/hudson/jobs/flume-1.3.0/modules/org.apache.flume$flume-ng-sdk/builds/2012-09-09_01-54-57/archive/org.apache.flume/flume-ng-sdk/1.3.0-SNAPSHOT/flume-ng-sdk-1.3.0-SNAPSHOT.jar
[JENKINS] Archiving <https://builds.apache.org/job/flume-1.3.0/ws/flume-ng-clients/pom.xml> to /home/hudson/hudson/jobs/flume-1.3.0/modules/org.apache.flume$flume-ng-clients/builds/2012-09-09_01-54-57/archive/org.apache.flume/flume-ng-clients/1.3.0-SNAPSHOT/flume-ng-clients-1.3.0-SNAPSHOT.pom
[JENKINS] Archiving <https://builds.apache.org/job/flume-1.3.0/ws/flume-ng-dist/pom.xml> to /home/hudson/hudson/jobs/flume-1.3.0/modules/org.apache.flume$flume-ng-dist/builds/2012-09-09_01-54-57/archive/org.apache.flume/flume-ng-dist/1.3.0-SNAPSHOT/flume-ng-dist-1.3.0-SNAPSHOT.pom
[JENKINS] Archiving <https://builds.apache.org/job/flume-1.3.0/ws/pom.xml> to /home/hudson/hudson/jobs/flume-1.3.0/modules/org.apache.flume$flume-parent/builds/2012-09-09_01-54-57/archive/org.apache.flume/flume-parent/1.3.0-SNAPSHOT/flume-parent-1.3.0-SNAPSHOT.pom
[JENKINS] Archiving <https://builds.apache.org/job/flume-1.3.0/ws/target/flume-parent-1.3.0-SNAPSHOT-javadoc.jar> to /home/hudson/hudson/jobs/flume-1.3.0/modules/org.apache.flume$flume-parent/builds/2012-09-09_01-54-57/archive/org.apache.flume/flume-parent/1.3.0-SNAPSHOT/flume-parent-1.3.0-SNAPSHOT-javadoc.jar
[JENKINS] Archiving <https://builds.apache.org/job/flume-1.3.0/ws/target/flume-parent-1.3.0-SNAPSHOT-site.xml> to /home/hudson/hudson/jobs/flume-1.3.0/modules/org.apache.flume$flume-parent/builds/2012-09-09_01-54-57/archive/org.apache.flume/flume-parent/1.3.0-SNAPSHOT/flume-parent-1.3.0-SNAPSHOT-site.xml
[JENKINS] Archiving <https://builds.apache.org/job/flume-1.3.0/ws/flume-ng-channels/flume-recoverable-memory-channel/pom.xml> to /home/hudson/hudson/jobs/flume-1.3.0/modules/org.apache.flume.flume-ng-channels$flume-recoverable-memory-channel/builds/2012-09-09_01-54-57/archive/org.apache.flume.flume-ng-channels/flume-recoverable-memory-channel/1.3.0-SNAPSHOT/flume-recoverable-memory-channel-1.3.0-SNAPSHOT.pom
[JENKINS] Archiving <https://builds.apache.org/job/flume-1.3.0/ws/flume-ng-channels/flume-recoverable-memory-channel/target/flume-recoverable-memory-channel-1.3.0-SNAPSHOT.jar> to /home/hudson/hudson/jobs/flume-1.3.0/modules/org.apache.flume.flume-ng-channels$flume-recoverable-memory-channel/builds/2012-09-09_01-54-57/archive/org.apache.flume.flume-ng-channels/flume-recoverable-memory-channel/1.3.0-SNAPSHOT/flume-recoverable-memory-channel-1.3.0-SNAPSHOT.jar
[JENKINS] Archiving <https://builds.apache.org/job/flume-1.3.0/ws/flume-ng-sinks/flume-ng-hbase-sink/pom.xml> to /home/hudson/hudson/jobs/flume-1.3.0/modules/org.apache.flume.flume-ng-sinks$flume-ng-hbase-sink/builds/2012-09-09_01-54-57/archive/org.apache.flume.flume-ng-sinks/flume-ng-hbase-sink/1.3.0-SNAPSHOT/flume-ng-hbase-sink-1.3.0-SNAPSHOT.pom
[JENKINS] Archiving <https://builds.apache.org/job/flume-1.3.0/ws/flume-ng-clients/flume-ng-log4jappender/pom.xml> to /home/hudson/hudson/jobs/flume-1.3.0/modules/org.apache.flume.flume-ng-clients$flume-ng-log4jappender/builds/2012-09-09_01-54-57/archive/org.apache.flume.flume-ng-clients/flume-ng-log4jappender/1.3.0-SNAPSHOT/flume-ng-log4jappender-1.3.0-SNAPSHOT.pom
[JENKINS] Archiving <https://builds.apache.org/job/flume-1.3.0/ws/flume-ng-channels/pom.xml> to /home/hudson/hudson/jobs/flume-1.3.0/modules/org.apache.flume$flume-ng-channels/builds/2012-09-09_01-54-57/archive/org.apache.flume/flume-ng-channels/1.3.0-SNAPSHOT/flume-ng-channels-1.3.0-SNAPSHOT.pom
[JENKINS] Archiving <https://builds.apache.org/job/flume-1.3.0/ws/flume-ng-sinks/pom.xml> to /home/hudson/hudson/jobs/flume-1.3.0/modules/org.apache.flume$flume-ng-sinks/builds/2012-09-09_01-54-57/archive/org.apache.flume/flume-ng-sinks/1.3.0-SNAPSHOT/flume-ng-sinks-1.3.0-SNAPSHOT.pom
[JENKINS] Archiving <https://builds.apache.org/job/flume-1.3.0/ws/flume-ng-channels/flume-jdbc-channel/pom.xml> to /home/hudson/hudson/jobs/flume-1.3.0/modules/org.apache.flume.flume-ng-channels$flume-jdbc-channel/builds/2012-09-09_01-54-57/archive/org.apache.flume.flume-ng-channels/flume-jdbc-channel/1.3.0-SNAPSHOT/flume-jdbc-channel-1.3.0-SNAPSHOT.pom
[JENKINS] Archiving <https://builds.apache.org/job/flume-1.3.0/ws/flume-ng-channels/flume-jdbc-channel/target/flume-jdbc-channel-1.3.0-SNAPSHOT.jar> to /home/hudson/hudson/jobs/flume-1.3.0/modules/org.apache.flume.flume-ng-channels$flume-jdbc-channel/builds/2012-09-09_01-54-57/archive/org.apache.flume.flume-ng-channels/flume-jdbc-channel/1.3.0-SNAPSHOT/flume-jdbc-channel-1.3.0-SNAPSHOT.jar
Waiting for Jenkins to finish collecting data
mavenExecutionResult exceptions not empty
message : Failed to execute goal org.apache.maven.plugins:maven-compiler-plugin:2.3.2:compile (default-compile) on project flume-ng-hbase-sink: Compilation failure
cause : Compilation failure
Stack trace :
org.apache.maven.lifecycle.LifecycleExecutionException: Failed to execute goal org.apache.maven.plugins:maven-compiler-plugin:2.3.2:compile (default-compile) on project flume-ng-hbase-sink: Compilation failure
at org.apache.maven.lifecycle.internal.MojoExecutor.execute(MojoExecutor.java:213)
at org.apache.maven.lifecycle.internal.MojoExecutor.execute(MojoExecutor.java:153)
at org.apache.maven.lifecycle.internal.MojoExecutor.execute(MojoExecutor.java:145)
at org.apache.maven.lifecycle.internal.LifecycleModuleBuilder.buildProject(LifecycleModuleBuilder.java:84)
at org.apache.maven.lifecycle.internal.LifecycleModuleBuilder.buildProject(LifecycleModuleBuilder.java:59)
at org.apache.maven.lifecycle.internal.LifecycleStarter.singleThreadedBuild(LifecycleStarter.java:183)
at org.apache.maven.lifecycle.internal.LifecycleStarter.execute(LifecycleStarter.java:161)
at org.apache.maven.DefaultMaven.doExecute(DefaultMaven.java:319)
at org.apache.maven.DefaultMaven.execute(DefaultMaven.java:156)
at org.jvnet.hudson.maven3.launcher.Maven3Launcher.main(Maven3Launcher.java:79)
at sun.reflect.NativeMethodAccessorImpl.invoke0(Native Method)
at sun.reflect.NativeMethodAccessorImpl.invoke(NativeMethodAccessorImpl.java:39)
at sun.reflect.DelegatingMethodAccessorImpl.invoke(DelegatingMethodAccessorImpl.java:25)
at java.lang.reflect.Method.invoke(Method.java:597)
at org.codehaus.plexus.classworlds.launcher.Launcher.launchStandard(Launcher.java:329)
at org.codehaus.plexus.classworlds.launcher.Launcher.launch(Launcher.java:239)
at org.jvnet.hudson.maven3.agent.Maven3Main.launch(Maven3Main.java:158)
at hudson.maven.Maven3Builder.call(Maven3Builder.java:98)
at hudson.maven.Maven3Builder.call(Maven3Builder.java:64)
at hudson.remoting.UserRequest.perform(UserRequest.java:118)
at hudson.remoting.UserRequest.perform(UserRequest.java:48)
at hudson.remoting.Request$2.run(Request.java:326)
at hudson.remoting.InterceptingExecutorService$1.call(InterceptingExecutorService.java:72)
at java.util.concurrent.FutureTask$Sync.innerRun(FutureTask.java:303)
at java.util.concurrent.FutureTask.run(FutureTask.java:138)
at java.util.concurrent.ThreadPoolExecutor$Worker.runTask(ThreadPoolExecutor.java:886)
at java.util.concurrent.ThreadPoolExecutor$Worker.run(ThreadPoolExecutor.java:908)
at java.lang.Thread.run(Thread.java:662)
Caused by: org.apache.maven.plugin.CompilationFailureException: Compilation failure
at org.apache.maven.plugin.AbstractCompilerMojo.execute(AbstractCompilerMojo.java:656)
at org.apache.maven.plugin.CompilerMojo.execute(CompilerMojo.java:128)
at org.apache.maven.plugin.DefaultBuildPluginManager.executeMojo(DefaultBuildPluginManager.java:101)
at org.apache.maven.lifecycle.internal.MojoExecutor.execute(MojoExecutor.java:209)
... 27 more
message : Failed to execute goal org.apache.maven.plugins:maven-compiler-plugin:2.3.2:compile (default-compile) on project flume-file-channel: Compilation failure
cause : Compilation failure
Stack trace :
org.apache.maven.lifecycle.LifecycleExecutionException: Failed to execute goal org.apache.maven.plugins:maven-compiler-plugin:2.3.2:compile (default-compile) on project flume-file-channel: Compilation failure
at org.apache.maven.lifecycle.internal.MojoExecutor.execute(MojoExecutor.java:213)
at org.apache.maven.lifecycle.internal.MojoExecutor.execute(MojoExecutor.java:153)
at org.apache.maven.lifecycle.internal.MojoExecutor.execute(MojoExecutor.java:145)
at org.apache.maven.lifecycle.internal.LifecycleModuleBuilder.buildProject(LifecycleModuleBuilder.java:84)
at org.apache.maven.lifecycle.internal.LifecycleModuleBuilder.buildProject(LifecycleModuleBuilder.java:59)
at org.apache.maven.lifecycle.internal.LifecycleStarter.singleThreadedBuild(LifecycleStarter.java:183)
at org.apache.maven.lifecycle.internal.LifecycleStarter.execute(LifecycleStarter.java:161)
at org.apache.maven.DefaultMaven.doExecute(DefaultMaven.java:319)
at org.apache.maven.DefaultMaven.execute(DefaultMaven.java:156)
at org.jvnet.hudson.maven3.launcher.Maven3Launcher.main(Maven3Launcher.java:79)
at sun.reflect.NativeMethodAccessorImpl.invoke0(Native Method)
at sun.reflect.NativeMethodAccessorImpl.invoke(NativeMethodAccessorImpl.java:39)
at sun.reflect.DelegatingMethodAccessorImpl.invoke(DelegatingMethodAccessorImpl.java:25)
at java.lang.reflect.Method.invoke(Method.java:597)
at org.codehaus.plexus.classworlds.launcher.Launcher.launchStandard(Launcher.java:329)
at org.codehaus.plexus.classworlds.launcher.Launcher.launch(Launcher.java:239)
at org.jvnet.hudson.maven3.agent.Maven3Main.launch(Maven3Main.java:158)
at hudson.maven.Maven3Builder.call(Maven3Builder.java:98)
at hudson.maven.Maven3Builder.call(Maven3Builder.java:64)
at hudson.remoting.UserRequest.perform(UserRequest.java:118)
at hudson.remoting.UserRequest.perform(UserRequest.java:48)
at hudson.remoting.Request$2.run(Request.java:326)
at hudson.remoting.InterceptingExecutorService$1.call(InterceptingExecutorService.java:72)
at java.util.concurrent.FutureTask$Sync.innerRun(FutureTask.java:303)
at java.util.concurrent.FutureTask.run(FutureTask.java:138)
at java.util.concurrent.ThreadPoolExecutor$Worker.runTask(ThreadPoolExecutor.java:886)
at java.util.concurrent.ThreadPoolExecutor$Worker.run(ThreadPoolExecutor.java:908)
at java.lang.Thread.run(Thread.java:662)
Caused by: org.apache.maven.plugin.CompilationFailureException: Compilation failure
at org.apache.maven.plugin.AbstractCompilerMojo.execute(AbstractCompilerMojo.java:656)
at org.apache.maven.plugin.CompilerMojo.execute(CompilerMojo.java:128)
at org.apache.maven.plugin.DefaultBuildPluginManager.executeMojo(DefaultBuildPluginManager.java:101)
at org.apache.maven.lifecycle.internal.MojoExecutor.execute(MojoExecutor.java:209)
... 27 more
message : Failed to execute goal org.apache.maven.plugins:maven-compiler-plugin:2.3.2:testCompile (default-testCompile) on project flume-ng-log4jappender: Compilation failure
cause : Compilation failure
Stack trace :
org.apache.maven.lifecycle.LifecycleExecutionException: Failed to execute goal org.apache.maven.plugins:maven-compiler-plugin:2.3.2:testCompile (default-testCompile) on project flume-ng-log4jappender: Compilation failure
at org.apache.maven.lifecycle.internal.MojoExecutor.execute(MojoExecutor.java:213)
at org.apache.maven.lifecycle.internal.MojoExecutor.execute(MojoExecutor.java:153)
at org.apache.maven.lifecycle.internal.MojoExecutor.execute(MojoExecutor.java:145)
at org.apache.maven.lifecycle.internal.LifecycleModuleBuilder.buildProject(LifecycleModuleBuilder.java:84)
at org.apache.maven.lifecycle.internal.LifecycleModuleBuilder.buildProject(LifecycleModuleBuilder.java:59)
at org.apache.maven.lifecycle.internal.LifecycleStarter.singleThreadedBuild(LifecycleStarter.java:183)
at org.apache.maven.lifecycle.internal.LifecycleStarter.execute(LifecycleStarter.java:161)
at org.apache.maven.DefaultMaven.doExecute(DefaultMaven.java:319)
at org.apache.maven.DefaultMaven.execute(DefaultMaven.java:156)
at org.jvnet.hudson.maven3.launcher.Maven3Launcher.main(Maven3Launcher.java:79)
at sun.reflect.NativeMethodAccessorImpl.invoke0(Native Method)
at sun.reflect.NativeMethodAccessorImpl.invoke(NativeMethodAccessorImpl.java:39)
at sun.reflect.DelegatingMethodAccessorImpl.invoke(DelegatingMethodAccessorImpl.java:25)
at java.lang.reflect.Method.invoke(Method.java:597)
at org.codehaus.plexus.classworlds.launcher.Launcher.launchStandard(Launcher.java:329)
at org.codehaus.plexus.classworlds.launcher.Launcher.launch(Launcher.java:239)
at org.jvnet.hudson.maven3.agent.Maven3Main.launch(Maven3Main.java:158)
at hudson.maven.Maven3Builder.call(Maven3Builder.java:98)
at hudson.maven.Maven3Builder.call(Maven3Builder.java:64)
at hudson.remoting.UserRequest.perform(UserRequest.java:118)
at hudson.remoting.UserRequest.perform(UserRequest.java:48)
at hudson.remoting.Request$2.run(Request.java:326)
at hudson.remoting.InterceptingExecutorService$1.call(InterceptingExecutorService.java:72)
at java.util.concurrent.FutureTask$Sync.innerRun(FutureTask.java:303)
at java.util.concurrent.FutureTask.run(FutureTask.java:138)
at java.util.concurrent.ThreadPoolExecutor$Worker.runTask(ThreadPoolExecutor.java:886)
at java.util.concurrent.ThreadPoolExecutor$Worker.run(ThreadPoolExecutor.java:908)
at java.lang.Thread.run(Thread.java:662)
Caused by: org.apache.maven.plugin.CompilationFailureException: Compilation failure
at org.apache.maven.plugin.AbstractCompilerMojo.execute(AbstractCompilerMojo.java:656)
at org.apache.maven.plugin.TestCompilerMojo.execute(TestCompilerMojo.java:161)
at org.apache.maven.plugin.DefaultBuildPluginManager.executeMojo(DefaultBuildPluginManager.java:101)
at org.apache.maven.lifecycle.internal.MojoExecutor.execute(MojoExecutor.java:209)
... 27 more
message : Failed to execute goal org.apache.maven.plugins:maven-compiler-plugin:2.3.2:testCompile (default-testCompile) on project flume-ng-tests: Compilation failure
cause : Compilation failure
Stack trace :
org.apache.maven.lifecycle.LifecycleExecutionException: Failed to execute goal org.apache.maven.plugins:maven-compiler-plugin:2.3.2:testCompile (default-testCompile) on project flume-ng-tests: Compilation failure
at org.apache.maven.lifecycle.internal.MojoExecutor.execute(MojoExecutor.java:213)
at org.apache.maven.lifecycle.internal.MojoExecutor.execute(MojoExecutor.java:153)
at org.apache.maven.lifecycle.internal.MojoExecutor.execute(MojoExecutor.java:145)
at org.apache.maven.lifecycle.internal.LifecycleModuleBuilder.buildProject(LifecycleModuleBuilder.java:84)
at org.apache.maven.lifecycle.internal.LifecycleModuleBuilder.buildProject(LifecycleModuleBuilder.java:59)
at org.apache.maven.lifecycle.internal.LifecycleStarter.singleThreadedBuild(LifecycleStarter.java:183)
at org.apache.maven.lifecycle.internal.LifecycleStarter.execute(LifecycleStarter.java:161)
at org.apache.maven.DefaultMaven.doExecute(DefaultMaven.java:319)
at org.apache.maven.DefaultMaven.execute(DefaultMaven.java:156)
at org.jvnet.hudson.maven3.launcher.Maven3Launcher.main(Maven3Launcher.java:79)
at sun.reflect.NativeMethodAccessorImpl.invoke0(Native Method)
at sun.reflect.NativeMethodAccessorImpl.invoke(NativeMethodAccessorImpl.java:39)
at sun.reflect.DelegatingMethodAccessorImpl.invoke(DelegatingMethodAccessorImpl.java:25)
at java.lang.reflect.Method.invoke(Method.java:597)
at org.codehaus.plexus.classworlds.launcher.Launcher.launchStandard(Launcher.java:329)
at org.codehaus.plexus.classworlds.launcher.Launcher.launch(Launcher.java:239)
at org.jvnet.hudson.maven3.agent.Maven3Main.launch(Maven3Main.java:158)
at hudson.maven.Maven3Builder.call(Maven3Builder.java:98)
at hudson.maven.Maven3Builder.call(Maven3Builder.java:64)
at hudson.remoting.UserRequest.perform(UserRequest.java:118)
at hudson.remoting.UserRequest.perform(UserRequest.java:48)
at hudson.remoting.Request$2.run(Request.java:326)
at hudson.remoting.InterceptingExecutorService$1.call(InterceptingExecutorService.java:72)
at java.util.concurrent.FutureTask$Sync.innerRun(FutureTask.java:303)
at java.util.concurrent.FutureTask.run(FutureTask.java:138)
at java.util.concurrent.ThreadPoolExecutor$Worker.runTask(ThreadPoolExecutor.java:886)
at java.util.concurrent.ThreadPoolExecutor$Worker.run(ThreadPoolExecutor.java:908)
at java.lang.Thread.run(Thread.java:662)
Caused by: org.apache.maven.plugin.CompilationFailureException: Compilation failure
at org.apache.maven.plugin.AbstractCompilerMojo.execute(AbstractCompilerMojo.java:656)
at org.apache.maven.plugin.TestCompilerMojo.execute(TestCompilerMojo.java:161)
at org.apache.maven.plugin.DefaultBuildPluginManager.executeMojo(DefaultBuildPluginManager.java:101)
at org.apache.maven.lifecycle.internal.MojoExecutor.execute(MojoExecutor.java:209)
... 27 more
channel stopped
[WARNINGS] Skipping publisher since build result is FAILURE
Updating FLUME-1545
Updating FLUME-1544
Updating FLUME-1543
Updating FLUME-1548
Updating FLUME-1546
Build failed in Jenkins: flume-1.3.0 #8
Posted by Apache Jenkins Server <je...@builds.apache.org>.
See <https://builds.apache.org/job/flume-1.3.0/8/changes>
Changes:
[hshreedharan] FLUME-1487. FileChannel format needs to be extensible.
[mpercy] FLUME-1424. File Channel should support encryption.
------------------------------------------
[...truncated 4752 lines...]
location: class org.apache.flume.test.agent.TestRpcClient
[INFO] 15 errors
[INFO] -------------------------------------------------------------
mojoFailed org.apache.maven.plugins:maven-compiler-plugin:2.3.2(default-testCompile)
projectFailed org.apache.flume:flume-ng-tests:1.3.0-SNAPSHOT
sessionEnded
[INFO] ------------------------------------------------------------------------
[INFO] Reactor Summary:
[INFO]
[INFO] Apache Flume ...................................... SUCCESS [1:51.776s]
[INFO] Flume NG SDK ...................................... SUCCESS [1:01.413s]
[INFO] Flume NG Configuration ............................ SUCCESS [11.295s]
[INFO] Flume NG Core ..................................... SUCCESS [2:27.793s]
[INFO] Flume NG Sinks .................................... SUCCESS [7.802s]
[INFO] Flume NG HDFS Sink ................................ SUCCESS [45.432s]
[INFO] Flume NG IRC Sink ................................. SUCCESS [9.180s]
[INFO] Flume NG HBase Sink ............................... FAILURE [5.325s]
[INFO] Flume Sources ..................................... SUCCESS [7.937s]
[INFO] Flume Scribe Source ............................... SUCCESS [8.490s]
[INFO] Flume NG Channels ................................. SUCCESS [7.006s]
[INFO] Flume NG JDBC channel ............................. SUCCESS [44.580s]
[INFO] Flume NG Node ..................................... SUCCESS [29.373s]
[INFO] Flume NG file-based channel ....................... FAILURE [3.075s]
[INFO] Flume NG file backed Memory channel ............... SUCCESS [34.551s]
[INFO] Flume legacy Sources .............................. SUCCESS [6.652s]
[INFO] Flume legacy Avro source .......................... SUCCESS [10.110s]
[INFO] Flume legacy Thrift Source ........................ SUCCESS [9.834s]
[INFO] Flume NG Clients .................................. SUCCESS [7.373s]
[INFO] Flume NG Log4j Appender ........................... FAILURE [1.637s]
[INFO] Flume NG distribution ............................. SKIPPED
[INFO] Flume NG Integration Tests ........................ FAILURE [2.620s]
[INFO] ------------------------------------------------------------------------
[INFO] BUILD FAILURE
[INFO] ------------------------------------------------------------------------
[INFO] Total time: 9:38.691s
[INFO] Finished at: Sat Sep 08 01:29:34 UTC 2012
[INFO] Final Memory: 164M/319M
[INFO] ------------------------------------------------------------------------
Projects to build: [MavenProject: org.apache.flume:flume-parent:1.3.0-SNAPSHOT @ <https://builds.apache.org/job/flume-1.3.0/ws/pom.xml,> MavenProject: org.apache.flume:flume-ng-sdk:1.3.0-SNAPSHOT @ <https://builds.apache.org/job/flume-1.3.0/ws/flume-ng-sdk/pom.xml,> MavenProject: org.apache.flume:flume-ng-configuration:1.3.0-SNAPSHOT @ <https://builds.apache.org/job/flume-1.3.0/ws/flume-ng-configuration/pom.xml,> MavenProject: org.apache.flume:flume-ng-core:1.3.0-SNAPSHOT @ <https://builds.apache.org/job/flume-1.3.0/ws/flume-ng-core/pom.xml,> MavenProject: org.apache.flume:flume-ng-sinks:1.3.0-SNAPSHOT @ <https://builds.apache.org/job/flume-1.3.0/ws/flume-ng-sinks/pom.xml,> MavenProject: org.apache.flume.flume-ng-sinks:flume-hdfs-sink:1.3.0-SNAPSHOT @ <https://builds.apache.org/job/flume-1.3.0/ws/flume-ng-sinks/flume-hdfs-sink/pom.xml,> MavenProject: org.apache.flume.flume-ng-sinks:flume-irc-sink:1.3.0-SNAPSHOT @ <https://builds.apache.org/job/flume-1.3.0/ws/flume-ng-sinks/flume-irc-sink/pom.xml,> MavenProject: org.apache.flume.flume-ng-sinks:flume-ng-hbase-sink:1.3.0-SNAPSHOT @ <https://builds.apache.org/job/flume-1.3.0/ws/flume-ng-sinks/flume-ng-hbase-sink/pom.xml,> MavenProject: org.apache.flume:flume-ng-sources:1.3.0-SNAPSHOT @ <https://builds.apache.org/job/flume-1.3.0/ws/flume-ng-sources/pom.xml,> MavenProject: org.apache.flume.flume-ng-sources:flume-scribe-source:1.3.0-SNAPSHOT @ <https://builds.apache.org/job/flume-1.3.0/ws/flume-ng-sources/flume-scribe-source/pom.xml,> MavenProject: org.apache.flume:flume-ng-channels:1.3.0-SNAPSHOT @ <https://builds.apache.org/job/flume-1.3.0/ws/flume-ng-channels/pom.xml,> MavenProject: org.apache.flume.flume-ng-channels:flume-jdbc-channel:1.3.0-SNAPSHOT @ <https://builds.apache.org/job/flume-1.3.0/ws/flume-ng-channels/flume-jdbc-channel/pom.xml,> MavenProject: org.apache.flume:flume-ng-node:1.3.0-SNAPSHOT @ <https://builds.apache.org/job/flume-1.3.0/ws/flume-ng-node/pom.xml,> MavenProject: org.apache.flume.flume-ng-channels:flume-file-channel:1.3.0-SNAPSHOT @ <https://builds.apache.org/job/flume-1.3.0/ws/flume-ng-channels/flume-file-channel/pom.xml,> MavenProject: org.apache.flume.flume-ng-channels:flume-recoverable-memory-channel:1.3.0-SNAPSHOT @ <https://builds.apache.org/job/flume-1.3.0/ws/flume-ng-channels/flume-recoverable-memory-channel/pom.xml,> MavenProject: org.apache.flume:flume-ng-legacy-sources:1.3.0-SNAPSHOT @ <https://builds.apache.org/job/flume-1.3.0/ws/flume-ng-legacy-sources/pom.xml,> MavenProject: org.apache.flume.flume-ng-legacy-sources:flume-avro-source:1.3.0-SNAPSHOT @ <https://builds.apache.org/job/flume-1.3.0/ws/flume-ng-legacy-sources/flume-avro-source/pom.xml,> MavenProject: org.apache.flume.flume-ng-legacy-sources:flume-thrift-source:1.3.0-SNAPSHOT @ <https://builds.apache.org/job/flume-1.3.0/ws/flume-ng-legacy-sources/flume-thrift-source/pom.xml,> MavenProject: org.apache.flume:flume-ng-clients:1.3.0-SNAPSHOT @ <https://builds.apache.org/job/flume-1.3.0/ws/flume-ng-clients/pom.xml,> MavenProject: org.apache.flume.flume-ng-clients:flume-ng-log4jappender:1.3.0-SNAPSHOT @ <https://builds.apache.org/job/flume-1.3.0/ws/flume-ng-clients/flume-ng-log4jappender/pom.xml,> MavenProject: org.apache.flume:flume-ng-dist:1.3.0-SNAPSHOT @ <https://builds.apache.org/job/flume-1.3.0/ws/flume-ng-dist/pom.xml,> MavenProject: org.apache.flume:flume-ng-tests:1.3.0-SNAPSHOT @ <https://builds.apache.org/job/flume-1.3.0/ws/flume-ng-tests/pom.xml]>
[JENKINS] Archiving <https://builds.apache.org/job/flume-1.3.0/ws/flume-ng-legacy-sources/pom.xml> to /home/hudson/hudson/jobs/flume-1.3.0/modules/org.apache.flume$flume-ng-legacy-sources/builds/2012-09-08_01-19-43/archive/org.apache.flume/flume-ng-legacy-sources/1.3.0-SNAPSHOT/flume-ng-legacy-sources-1.3.0-SNAPSHOT.pom
[JENKINS] Archiving <https://builds.apache.org/job/flume-1.3.0/ws/flume-ng-channels/flume-file-channel/pom.xml> to /home/hudson/hudson/jobs/flume-1.3.0/modules/org.apache.flume.flume-ng-channels$flume-file-channel/builds/2012-09-08_01-19-43/archive/org.apache.flume.flume-ng-channels/flume-file-channel/1.3.0-SNAPSHOT/flume-file-channel-1.3.0-SNAPSHOT.pom
[JENKINS] Archiving <https://builds.apache.org/job/flume-1.3.0/ws/flume-ng-core/pom.xml> to /home/hudson/hudson/jobs/flume-1.3.0/modules/org.apache.flume$flume-ng-core/builds/2012-09-08_01-19-43/archive/org.apache.flume/flume-ng-core/1.3.0-SNAPSHOT/flume-ng-core-1.3.0-SNAPSHOT.pom
[JENKINS] Archiving <https://builds.apache.org/job/flume-1.3.0/ws/flume-ng-core/target/flume-ng-core-1.3.0-SNAPSHOT.jar> to /home/hudson/hudson/jobs/flume-1.3.0/modules/org.apache.flume$flume-ng-core/builds/2012-09-08_01-19-43/archive/org.apache.flume/flume-ng-core/1.3.0-SNAPSHOT/flume-ng-core-1.3.0-SNAPSHOT.jar
[JENKINS] Archiving <https://builds.apache.org/job/flume-1.3.0/ws/flume-ng-sinks/flume-hdfs-sink/pom.xml> to /home/hudson/hudson/jobs/flume-1.3.0/modules/org.apache.flume.flume-ng-sinks$flume-hdfs-sink/builds/2012-09-08_01-19-43/archive/org.apache.flume.flume-ng-sinks/flume-hdfs-sink/1.3.0-SNAPSHOT/flume-hdfs-sink-1.3.0-SNAPSHOT.pom
[JENKINS] Archiving <https://builds.apache.org/job/flume-1.3.0/ws/flume-ng-sinks/flume-hdfs-sink/target/flume-hdfs-sink-1.3.0-SNAPSHOT.jar> to /home/hudson/hudson/jobs/flume-1.3.0/modules/org.apache.flume.flume-ng-sinks$flume-hdfs-sink/builds/2012-09-08_01-19-43/archive/org.apache.flume.flume-ng-sinks/flume-hdfs-sink/1.3.0-SNAPSHOT/flume-hdfs-sink-1.3.0-SNAPSHOT.jar
[JENKINS] Archiving <https://builds.apache.org/job/flume-1.3.0/ws/flume-ng-sources/pom.xml> to /home/hudson/hudson/jobs/flume-1.3.0/modules/org.apache.flume$flume-ng-sources/builds/2012-09-08_01-19-43/archive/org.apache.flume/flume-ng-sources/1.3.0-SNAPSHOT/flume-ng-sources-1.3.0-SNAPSHOT.pom
[JENKINS] Archiving <https://builds.apache.org/job/flume-1.3.0/ws/flume-ng-legacy-sources/flume-avro-source/pom.xml> to /home/hudson/hudson/jobs/flume-1.3.0/modules/org.apache.flume.flume-ng-legacy-sources$flume-avro-source/builds/2012-09-08_01-19-43/archive/org.apache.flume.flume-ng-legacy-sources/flume-avro-source/1.3.0-SNAPSHOT/flume-avro-source-1.3.0-SNAPSHOT.pom
[JENKINS] Archiving <https://builds.apache.org/job/flume-1.3.0/ws/flume-ng-legacy-sources/flume-avro-source/target/flume-avro-source-1.3.0-SNAPSHOT.jar> to /home/hudson/hudson/jobs/flume-1.3.0/modules/org.apache.flume.flume-ng-legacy-sources$flume-avro-source/builds/2012-09-08_01-19-43/archive/org.apache.flume.flume-ng-legacy-sources/flume-avro-source/1.3.0-SNAPSHOT/flume-avro-source-1.3.0-SNAPSHOT.jar
[JENKINS] Archiving <https://builds.apache.org/job/flume-1.3.0/ws/flume-ng-node/pom.xml> to /home/hudson/hudson/jobs/flume-1.3.0/modules/org.apache.flume$flume-ng-node/builds/2012-09-08_01-19-43/archive/org.apache.flume/flume-ng-node/1.3.0-SNAPSHOT/flume-ng-node-1.3.0-SNAPSHOT.pom
[JENKINS] Archiving <https://builds.apache.org/job/flume-1.3.0/ws/flume-ng-node/target/flume-ng-node-1.3.0-SNAPSHOT.jar> to /home/hudson/hudson/jobs/flume-1.3.0/modules/org.apache.flume$flume-ng-node/builds/2012-09-08_01-19-43/archive/org.apache.flume/flume-ng-node/1.3.0-SNAPSHOT/flume-ng-node-1.3.0-SNAPSHOT.jar
[JENKINS] Archiving <https://builds.apache.org/job/flume-1.3.0/ws/flume-ng-legacy-sources/flume-thrift-source/pom.xml> to /home/hudson/hudson/jobs/flume-1.3.0/modules/org.apache.flume.flume-ng-legacy-sources$flume-thrift-source/builds/2012-09-08_01-19-43/archive/org.apache.flume.flume-ng-legacy-sources/flume-thrift-source/1.3.0-SNAPSHOT/flume-thrift-source-1.3.0-SNAPSHOT.pom
[JENKINS] Archiving <https://builds.apache.org/job/flume-1.3.0/ws/flume-ng-legacy-sources/flume-thrift-source/target/flume-thrift-source-1.3.0-SNAPSHOT.jar> to /home/hudson/hudson/jobs/flume-1.3.0/modules/org.apache.flume.flume-ng-legacy-sources$flume-thrift-source/builds/2012-09-08_01-19-43/archive/org.apache.flume.flume-ng-legacy-sources/flume-thrift-source/1.3.0-SNAPSHOT/flume-thrift-source-1.3.0-SNAPSHOT.jar
[JENKINS] Archiving <https://builds.apache.org/job/flume-1.3.0/ws/flume-ng-sources/flume-scribe-source/pom.xml> to /home/hudson/hudson/jobs/flume-1.3.0/modules/org.apache.flume.flume-ng-sources$flume-scribe-source/builds/2012-09-08_01-19-43/archive/org.apache.flume.flume-ng-sources/flume-scribe-source/1.3.0-SNAPSHOT/flume-scribe-source-1.3.0-SNAPSHOT.pom
[JENKINS] Archiving <https://builds.apache.org/job/flume-1.3.0/ws/flume-ng-sources/flume-scribe-source/target/flume-scribe-source-1.3.0-SNAPSHOT.jar> to /home/hudson/hudson/jobs/flume-1.3.0/modules/org.apache.flume.flume-ng-sources$flume-scribe-source/builds/2012-09-08_01-19-43/archive/org.apache.flume.flume-ng-sources/flume-scribe-source/1.3.0-SNAPSHOT/flume-scribe-source-1.3.0-SNAPSHOT.jar
[JENKINS] Archiving <https://builds.apache.org/job/flume-1.3.0/ws/flume-ng-tests/pom.xml> to /home/hudson/hudson/jobs/flume-1.3.0/modules/org.apache.flume$flume-ng-tests/builds/2012-09-08_01-19-43/archive/org.apache.flume/flume-ng-tests/1.3.0-SNAPSHOT/flume-ng-tests-1.3.0-SNAPSHOT.pom
[JENKINS] Archiving <https://builds.apache.org/job/flume-1.3.0/ws/flume-ng-sinks/flume-irc-sink/pom.xml> to /home/hudson/hudson/jobs/flume-1.3.0/modules/org.apache.flume.flume-ng-sinks$flume-irc-sink/builds/2012-09-08_01-19-43/archive/org.apache.flume.flume-ng-sinks/flume-irc-sink/1.3.0-SNAPSHOT/flume-irc-sink-1.3.0-SNAPSHOT.pom
[JENKINS] Archiving <https://builds.apache.org/job/flume-1.3.0/ws/flume-ng-sinks/flume-irc-sink/target/flume-irc-sink-1.3.0-SNAPSHOT.jar> to /home/hudson/hudson/jobs/flume-1.3.0/modules/org.apache.flume.flume-ng-sinks$flume-irc-sink/builds/2012-09-08_01-19-43/archive/org.apache.flume.flume-ng-sinks/flume-irc-sink/1.3.0-SNAPSHOT/flume-irc-sink-1.3.0-SNAPSHOT.jar
[JENKINS] Archiving <https://builds.apache.org/job/flume-1.3.0/ws/flume-ng-configuration/pom.xml> to /home/hudson/hudson/jobs/flume-1.3.0/modules/org.apache.flume$flume-ng-configuration/builds/2012-09-08_01-19-43/archive/org.apache.flume/flume-ng-configuration/1.3.0-SNAPSHOT/flume-ng-configuration-1.3.0-SNAPSHOT.pom
[JENKINS] Archiving <https://builds.apache.org/job/flume-1.3.0/ws/flume-ng-configuration/target/flume-ng-configuration-1.3.0-SNAPSHOT.jar> to /home/hudson/hudson/jobs/flume-1.3.0/modules/org.apache.flume$flume-ng-configuration/builds/2012-09-08_01-19-43/archive/org.apache.flume/flume-ng-configuration/1.3.0-SNAPSHOT/flume-ng-configuration-1.3.0-SNAPSHOT.jar
[JENKINS] Archiving <https://builds.apache.org/job/flume-1.3.0/ws/flume-ng-sdk/pom.xml> to /home/hudson/hudson/jobs/flume-1.3.0/modules/org.apache.flume$flume-ng-sdk/builds/2012-09-08_01-19-43/archive/org.apache.flume/flume-ng-sdk/1.3.0-SNAPSHOT/flume-ng-sdk-1.3.0-SNAPSHOT.pom
[JENKINS] Archiving <https://builds.apache.org/job/flume-1.3.0/ws/flume-ng-sdk/target/flume-ng-sdk-1.3.0-SNAPSHOT.jar> to /home/hudson/hudson/jobs/flume-1.3.0/modules/org.apache.flume$flume-ng-sdk/builds/2012-09-08_01-19-43/archive/org.apache.flume/flume-ng-sdk/1.3.0-SNAPSHOT/flume-ng-sdk-1.3.0-SNAPSHOT.jar
[JENKINS] Archiving <https://builds.apache.org/job/flume-1.3.0/ws/flume-ng-clients/pom.xml> to /home/hudson/hudson/jobs/flume-1.3.0/modules/org.apache.flume$flume-ng-clients/builds/2012-09-08_01-19-43/archive/org.apache.flume/flume-ng-clients/1.3.0-SNAPSHOT/flume-ng-clients-1.3.0-SNAPSHOT.pom
[JENKINS] Archiving <https://builds.apache.org/job/flume-1.3.0/ws/flume-ng-dist/pom.xml> to /home/hudson/hudson/jobs/flume-1.3.0/modules/org.apache.flume$flume-ng-dist/builds/2012-09-08_01-19-43/archive/org.apache.flume/flume-ng-dist/1.3.0-SNAPSHOT/flume-ng-dist-1.3.0-SNAPSHOT.pom
[JENKINS] Archiving <https://builds.apache.org/job/flume-1.3.0/ws/pom.xml> to /home/hudson/hudson/jobs/flume-1.3.0/modules/org.apache.flume$flume-parent/builds/2012-09-08_01-19-43/archive/org.apache.flume/flume-parent/1.3.0-SNAPSHOT/flume-parent-1.3.0-SNAPSHOT.pom
[JENKINS] Archiving <https://builds.apache.org/job/flume-1.3.0/ws/target/flume-parent-1.3.0-SNAPSHOT-javadoc.jar> to /home/hudson/hudson/jobs/flume-1.3.0/modules/org.apache.flume$flume-parent/builds/2012-09-08_01-19-43/archive/org.apache.flume/flume-parent/1.3.0-SNAPSHOT/flume-parent-1.3.0-SNAPSHOT-javadoc.jar
[JENKINS] Archiving <https://builds.apache.org/job/flume-1.3.0/ws/target/flume-parent-1.3.0-SNAPSHOT-site.xml> to /home/hudson/hudson/jobs/flume-1.3.0/modules/org.apache.flume$flume-parent/builds/2012-09-08_01-19-43/archive/org.apache.flume/flume-parent/1.3.0-SNAPSHOT/flume-parent-1.3.0-SNAPSHOT-site.xml
[JENKINS] Archiving <https://builds.apache.org/job/flume-1.3.0/ws/flume-ng-channels/flume-recoverable-memory-channel/pom.xml> to /home/hudson/hudson/jobs/flume-1.3.0/modules/org.apache.flume.flume-ng-channels$flume-recoverable-memory-channel/builds/2012-09-08_01-19-43/archive/org.apache.flume.flume-ng-channels/flume-recoverable-memory-channel/1.3.0-SNAPSHOT/flume-recoverable-memory-channel-1.3.0-SNAPSHOT.pom
[JENKINS] Archiving <https://builds.apache.org/job/flume-1.3.0/ws/flume-ng-channels/flume-recoverable-memory-channel/target/flume-recoverable-memory-channel-1.3.0-SNAPSHOT.jar> to /home/hudson/hudson/jobs/flume-1.3.0/modules/org.apache.flume.flume-ng-channels$flume-recoverable-memory-channel/builds/2012-09-08_01-19-43/archive/org.apache.flume.flume-ng-channels/flume-recoverable-memory-channel/1.3.0-SNAPSHOT/flume-recoverable-memory-channel-1.3.0-SNAPSHOT.jar
[JENKINS] Archiving <https://builds.apache.org/job/flume-1.3.0/ws/flume-ng-sinks/flume-ng-hbase-sink/pom.xml> to /home/hudson/hudson/jobs/flume-1.3.0/modules/org.apache.flume.flume-ng-sinks$flume-ng-hbase-sink/builds/2012-09-08_01-19-43/archive/org.apache.flume.flume-ng-sinks/flume-ng-hbase-sink/1.3.0-SNAPSHOT/flume-ng-hbase-sink-1.3.0-SNAPSHOT.pom
[JENKINS] Archiving <https://builds.apache.org/job/flume-1.3.0/ws/flume-ng-clients/flume-ng-log4jappender/pom.xml> to /home/hudson/hudson/jobs/flume-1.3.0/modules/org.apache.flume.flume-ng-clients$flume-ng-log4jappender/builds/2012-09-08_01-19-43/archive/org.apache.flume.flume-ng-clients/flume-ng-log4jappender/1.3.0-SNAPSHOT/flume-ng-log4jappender-1.3.0-SNAPSHOT.pom
[JENKINS] Archiving <https://builds.apache.org/job/flume-1.3.0/ws/flume-ng-channels/pom.xml> to /home/hudson/hudson/jobs/flume-1.3.0/modules/org.apache.flume$flume-ng-channels/builds/2012-09-08_01-19-43/archive/org.apache.flume/flume-ng-channels/1.3.0-SNAPSHOT/flume-ng-channels-1.3.0-SNAPSHOT.pom
[JENKINS] Archiving <https://builds.apache.org/job/flume-1.3.0/ws/flume-ng-sinks/pom.xml> to /home/hudson/hudson/jobs/flume-1.3.0/modules/org.apache.flume$flume-ng-sinks/builds/2012-09-08_01-19-43/archive/org.apache.flume/flume-ng-sinks/1.3.0-SNAPSHOT/flume-ng-sinks-1.3.0-SNAPSHOT.pom
[JENKINS] Archiving <https://builds.apache.org/job/flume-1.3.0/ws/flume-ng-channels/flume-jdbc-channel/pom.xml> to /home/hudson/hudson/jobs/flume-1.3.0/modules/org.apache.flume.flume-ng-channels$flume-jdbc-channel/builds/2012-09-08_01-19-43/archive/org.apache.flume.flume-ng-channels/flume-jdbc-channel/1.3.0-SNAPSHOT/flume-jdbc-channel-1.3.0-SNAPSHOT.pom
[JENKINS] Archiving <https://builds.apache.org/job/flume-1.3.0/ws/flume-ng-channels/flume-jdbc-channel/target/flume-jdbc-channel-1.3.0-SNAPSHOT.jar> to /home/hudson/hudson/jobs/flume-1.3.0/modules/org.apache.flume.flume-ng-channels$flume-jdbc-channel/builds/2012-09-08_01-19-43/archive/org.apache.flume.flume-ng-channels/flume-jdbc-channel/1.3.0-SNAPSHOT/flume-jdbc-channel-1.3.0-SNAPSHOT.jar
Waiting for Jenkins to finish collecting data
mavenExecutionResult exceptions not empty
message : Failed to execute goal org.apache.maven.plugins:maven-compiler-plugin:2.3.2:compile (default-compile) on project flume-ng-hbase-sink: Compilation failure
cause : Compilation failure
Stack trace :
org.apache.maven.lifecycle.LifecycleExecutionException: Failed to execute goal org.apache.maven.plugins:maven-compiler-plugin:2.3.2:compile (default-compile) on project flume-ng-hbase-sink: Compilation failure
at org.apache.maven.lifecycle.internal.MojoExecutor.execute(MojoExecutor.java:213)
at org.apache.maven.lifecycle.internal.MojoExecutor.execute(MojoExecutor.java:153)
at org.apache.maven.lifecycle.internal.MojoExecutor.execute(MojoExecutor.java:145)
at org.apache.maven.lifecycle.internal.LifecycleModuleBuilder.buildProject(LifecycleModuleBuilder.java:84)
at org.apache.maven.lifecycle.internal.LifecycleModuleBuilder.buildProject(LifecycleModuleBuilder.java:59)
at org.apache.maven.lifecycle.internal.LifecycleStarter.singleThreadedBuild(LifecycleStarter.java:183)
at org.apache.maven.lifecycle.internal.LifecycleStarter.execute(LifecycleStarter.java:161)
at org.apache.maven.DefaultMaven.doExecute(DefaultMaven.java:319)
at org.apache.maven.DefaultMaven.execute(DefaultMaven.java:156)
at org.jvnet.hudson.maven3.launcher.Maven3Launcher.main(Maven3Launcher.java:79)
at sun.reflect.NativeMethodAccessorImpl.invoke0(Native Method)
at sun.reflect.NativeMethodAccessorImpl.invoke(NativeMethodAccessorImpl.java:39)
at sun.reflect.DelegatingMethodAccessorImpl.invoke(DelegatingMethodAccessorImpl.java:25)
at java.lang.reflect.Method.invoke(Method.java:597)
at org.codehaus.plexus.classworlds.launcher.Launcher.launchStandard(Launcher.java:329)
at org.codehaus.plexus.classworlds.launcher.Launcher.launch(Launcher.java:239)
at org.jvnet.hudson.maven3.agent.Maven3Main.launch(Maven3Main.java:158)
at hudson.maven.Maven3Builder.call(Maven3Builder.java:98)
at hudson.maven.Maven3Builder.call(Maven3Builder.java:64)
at hudson.remoting.UserRequest.perform(UserRequest.java:118)
at hudson.remoting.UserRequest.perform(UserRequest.java:48)
at hudson.remoting.Request$2.run(Request.java:326)
at hudson.remoting.InterceptingExecutorService$1.call(InterceptingExecutorService.java:72)
at java.util.concurrent.FutureTask$Sync.innerRun(FutureTask.java:303)
at java.util.concurrent.FutureTask.run(FutureTask.java:138)
at java.util.concurrent.ThreadPoolExecutor$Worker.runTask(ThreadPoolExecutor.java:886)
at java.util.concurrent.ThreadPoolExecutor$Worker.run(ThreadPoolExecutor.java:908)
at java.lang.Thread.run(Thread.java:662)
Caused by: org.apache.maven.plugin.CompilationFailureException: Compilation failure
at org.apache.maven.plugin.AbstractCompilerMojo.execute(AbstractCompilerMojo.java:656)
at org.apache.maven.plugin.CompilerMojo.execute(CompilerMojo.java:128)
at org.apache.maven.plugin.DefaultBuildPluginManager.executeMojo(DefaultBuildPluginManager.java:101)
at org.apache.maven.lifecycle.internal.MojoExecutor.execute(MojoExecutor.java:209)
... 27 more
message : Failed to execute goal org.apache.maven.plugins:maven-antrun-plugin:1.6:run (compile-proto) on project flume-file-channel: An Ant BuildException has occured: exec returned: 1
cause : An Ant BuildException has occured: exec returned: 1
Stack trace :
org.apache.maven.lifecycle.LifecycleExecutionException: Failed to execute goal org.apache.maven.plugins:maven-antrun-plugin:1.6:run (compile-proto) on project flume-file-channel: An Ant BuildException has occured: exec returned: 1
at org.apache.maven.lifecycle.internal.MojoExecutor.execute(MojoExecutor.java:217)
at org.apache.maven.lifecycle.internal.MojoExecutor.execute(MojoExecutor.java:153)
at org.apache.maven.lifecycle.internal.MojoExecutor.execute(MojoExecutor.java:145)
at org.apache.maven.lifecycle.internal.LifecycleModuleBuilder.buildProject(LifecycleModuleBuilder.java:84)
at org.apache.maven.lifecycle.internal.LifecycleModuleBuilder.buildProject(LifecycleModuleBuilder.java:59)
at org.apache.maven.lifecycle.internal.LifecycleStarter.singleThreadedBuild(LifecycleStarter.java:183)
at org.apache.maven.lifecycle.internal.LifecycleStarter.execute(LifecycleStarter.java:161)
at org.apache.maven.DefaultMaven.doExecute(DefaultMaven.java:319)
at org.apache.maven.DefaultMaven.execute(DefaultMaven.java:156)
at org.jvnet.hudson.maven3.launcher.Maven3Launcher.main(Maven3Launcher.java:79)
at sun.reflect.NativeMethodAccessorImpl.invoke0(Native Method)
at sun.reflect.NativeMethodAccessorImpl.invoke(NativeMethodAccessorImpl.java:39)
at sun.reflect.DelegatingMethodAccessorImpl.invoke(DelegatingMethodAccessorImpl.java:25)
at java.lang.reflect.Method.invoke(Method.java:597)
at org.codehaus.plexus.classworlds.launcher.Launcher.launchStandard(Launcher.java:329)
at org.codehaus.plexus.classworlds.launcher.Launcher.launch(Launcher.java:239)
at org.jvnet.hudson.maven3.agent.Maven3Main.launch(Maven3Main.java:158)
at hudson.maven.Maven3Builder.call(Maven3Builder.java:98)
at hudson.maven.Maven3Builder.call(Maven3Builder.java:64)
at hudson.remoting.UserRequest.perform(UserRequest.java:118)
at hudson.remoting.UserRequest.perform(UserRequest.java:48)
at hudson.remoting.Request$2.run(Request.java:326)
at hudson.remoting.InterceptingExecutorService$1.call(InterceptingExecutorService.java:72)
at java.util.concurrent.FutureTask$Sync.innerRun(FutureTask.java:303)
at java.util.concurrent.FutureTask.run(FutureTask.java:138)
at java.util.concurrent.ThreadPoolExecutor$Worker.runTask(ThreadPoolExecutor.java:886)
at java.util.concurrent.ThreadPoolExecutor$Worker.run(ThreadPoolExecutor.java:908)
at java.lang.Thread.run(Thread.java:662)
Caused by: org.apache.maven.plugin.MojoExecutionException: An Ant BuildException has occured: exec returned: 1
at org.apache.maven.plugin.antrun.AntRunMojo.execute(AntRunMojo.java:283)
at org.apache.maven.plugin.DefaultBuildPluginManager.executeMojo(DefaultBuildPluginManager.java:101)
at org.apache.maven.lifecycle.internal.MojoExecutor.execute(MojoExecutor.java:209)
... 27 more
Caused by: <https://builds.apache.org/job/flume-1.3.0/ws/flume-ng-channels/flume-file-channel/target/antrun/build-main.xml>:23: exec returned: 1
at org.apache.tools.ant.taskdefs.ExecTask.runExecute(ExecTask.java:650)
at org.apache.tools.ant.taskdefs.ExecTask.runExec(ExecTask.java:676)
at org.apache.tools.ant.taskdefs.ExecTask.execute(ExecTask.java:502)
at org.apache.tools.ant.UnknownElement.execute(UnknownElement.java:291)
at sun.reflect.NativeMethodAccessorImpl.invoke0(Native Method)
at sun.reflect.NativeMethodAccessorImpl.invoke(NativeMethodAccessorImpl.java:39)
at sun.reflect.DelegatingMethodAccessorImpl.invoke(DelegatingMethodAccessorImpl.java:25)
at java.lang.reflect.Method.invoke(Method.java:597)
at org.apache.tools.ant.dispatch.DispatchUtils.execute(DispatchUtils.java:106)
at org.apache.tools.ant.Task.perform(Task.java:348)
at org.apache.tools.ant.Target.execute(Target.java:390)
at org.apache.tools.ant.Target.performTasks(Target.java:411)
at org.apache.tools.ant.Project.executeSortedTargets(Project.java:1397)
at org.apache.tools.ant.Project.executeTarget(Project.java:1366)
at org.apache.maven.plugin.antrun.AntRunMojo.execute(AntRunMojo.java:270)
... 29 more
message : Failed to execute goal org.apache.maven.plugins:maven-compiler-plugin:2.3.2:testCompile (default-testCompile) on project flume-ng-log4jappender: Compilation failure
cause : Compilation failure
Stack trace :
org.apache.maven.lifecycle.LifecycleExecutionException: Failed to execute goal org.apache.maven.plugins:maven-compiler-plugin:2.3.2:testCompile (default-testCompile) on project flume-ng-log4jappender: Compilation failure
at org.apache.maven.lifecycle.internal.MojoExecutor.execute(MojoExecutor.java:213)
at org.apache.maven.lifecycle.internal.MojoExecutor.execute(MojoExecutor.java:153)
at org.apache.maven.lifecycle.internal.MojoExecutor.execute(MojoExecutor.java:145)
at org.apache.maven.lifecycle.internal.LifecycleModuleBuilder.buildProject(LifecycleModuleBuilder.java:84)
at org.apache.maven.lifecycle.internal.LifecycleModuleBuilder.buildProject(LifecycleModuleBuilder.java:59)
at org.apache.maven.lifecycle.internal.LifecycleStarter.singleThreadedBuild(LifecycleStarter.java:183)
at org.apache.maven.lifecycle.internal.LifecycleStarter.execute(LifecycleStarter.java:161)
at org.apache.maven.DefaultMaven.doExecute(DefaultMaven.java:319)
at org.apache.maven.DefaultMaven.execute(DefaultMaven.java:156)
at org.jvnet.hudson.maven3.launcher.Maven3Launcher.main(Maven3Launcher.java:79)
at sun.reflect.NativeMethodAccessorImpl.invoke0(Native Method)
at sun.reflect.NativeMethodAccessorImpl.invoke(NativeMethodAccessorImpl.java:39)
at sun.reflect.DelegatingMethodAccessorImpl.invoke(DelegatingMethodAccessorImpl.java:25)
at java.lang.reflect.Method.invoke(Method.java:597)
at org.codehaus.plexus.classworlds.launcher.Launcher.launchStandard(Launcher.java:329)
at org.codehaus.plexus.classworlds.launcher.Launcher.launch(Launcher.java:239)
at org.jvnet.hudson.maven3.agent.Maven3Main.launch(Maven3Main.java:158)
at hudson.maven.Maven3Builder.call(Maven3Builder.java:98)
at hudson.maven.Maven3Builder.call(Maven3Builder.java:64)
at hudson.remoting.UserRequest.perform(UserRequest.java:118)
at hudson.remoting.UserRequest.perform(UserRequest.java:48)
at hudson.remoting.Request$2.run(Request.java:326)
at hudson.remoting.InterceptingExecutorService$1.call(InterceptingExecutorService.java:72)
at java.util.concurrent.FutureTask$Sync.innerRun(FutureTask.java:303)
at java.util.concurrent.FutureTask.run(FutureTask.java:138)
at java.util.concurrent.ThreadPoolExecutor$Worker.runTask(ThreadPoolExecutor.java:886)
at java.util.concurrent.ThreadPoolExecutor$Worker.run(ThreadPoolExecutor.java:908)
at java.lang.Thread.run(Thread.java:662)
Caused by: org.apache.maven.plugin.CompilationFailureException: Compilation failure
at org.apache.maven.plugin.AbstractCompilerMojo.execute(AbstractCompilerMojo.java:656)
at org.apache.maven.plugin.TestCompilerMojo.execute(TestCompilerMojo.java:161)
at org.apache.maven.plugin.DefaultBuildPluginManager.executeMojo(DefaultBuildPluginManager.java:101)
at org.apache.maven.lifecycle.internal.MojoExecutor.execute(MojoExecutor.java:209)
... 27 more
message : Failed to execute goal org.apache.maven.plugins:maven-compiler-plugin:2.3.2:testCompile (default-testCompile) on project flume-ng-tests: Compilation failure
cause : Compilation failure
Stack trace :
org.apache.maven.lifecycle.LifecycleExecutionException: Failed to execute goal org.apache.maven.plugins:maven-compiler-plugin:2.3.2:testCompile (default-testCompile) on project flume-ng-tests: Compilation failure
at org.apache.maven.lifecycle.internal.MojoExecutor.execute(MojoExecutor.java:213)
at org.apache.maven.lifecycle.internal.MojoExecutor.execute(MojoExecutor.java:153)
at org.apache.maven.lifecycle.internal.MojoExecutor.execute(MojoExecutor.java:145)
at org.apache.maven.lifecycle.internal.LifecycleModuleBuilder.buildProject(LifecycleModuleBuilder.java:84)
at org.apache.maven.lifecycle.internal.LifecycleModuleBuilder.buildProject(LifecycleModuleBuilder.java:59)
at org.apache.maven.lifecycle.internal.LifecycleStarter.singleThreadedBuild(LifecycleStarter.java:183)
at org.apache.maven.lifecycle.internal.LifecycleStarter.execute(LifecycleStarter.java:161)
at org.apache.maven.DefaultMaven.doExecute(DefaultMaven.java:319)
at org.apache.maven.DefaultMaven.execute(DefaultMaven.java:156)
at org.jvnet.hudson.maven3.launcher.Maven3Launcher.main(Maven3Launcher.java:79)
at sun.reflect.NativeMethodAccessorImpl.invoke0(Native Method)
at sun.reflect.NativeMethodAccessorImpl.invoke(NativeMethodAccessorImpl.java:39)
at sun.reflect.DelegatingMethodAccessorImpl.invoke(DelegatingMethodAccessorImpl.java:25)
at java.lang.reflect.Method.invoke(Method.java:597)
at org.codehaus.plexus.classworlds.launcher.Launcher.launchStandard(Launcher.java:329)
at org.codehaus.plexus.classworlds.launcher.Launcher.launch(Launcher.java:239)
at org.jvnet.hudson.maven3.agent.Maven3Main.launch(Maven3Main.java:158)
at hudson.maven.Maven3Builder.call(Maven3Builder.java:98)
at hudson.maven.Maven3Builder.call(Maven3Builder.java:64)
at hudson.remoting.UserRequest.perform(UserRequest.java:118)
at hudson.remoting.UserRequest.perform(UserRequest.java:48)
at hudson.remoting.Request$2.run(Request.java:326)
at hudson.remoting.InterceptingExecutorService$1.call(InterceptingExecutorService.java:72)
at java.util.concurrent.FutureTask$Sync.innerRun(FutureTask.java:303)
at java.util.concurrent.FutureTask.run(FutureTask.java:138)
at java.util.concurrent.ThreadPoolExecutor$Worker.runTask(ThreadPoolExecutor.java:886)
at java.util.concurrent.ThreadPoolExecutor$Worker.run(ThreadPoolExecutor.java:908)
at java.lang.Thread.run(Thread.java:662)
Caused by: org.apache.maven.plugin.CompilationFailureException: Compilation failure
at org.apache.maven.plugin.AbstractCompilerMojo.execute(AbstractCompilerMojo.java:656)
at org.apache.maven.plugin.TestCompilerMojo.execute(TestCompilerMojo.java:161)
at org.apache.maven.plugin.DefaultBuildPluginManager.executeMojo(DefaultBuildPluginManager.java:101)
at org.apache.maven.lifecycle.internal.MojoExecutor.execute(MojoExecutor.java:209)
... 27 more
Maven failed with error.
channel stopped
[WARNINGS] Skipping publisher since build result is FAILURE
Updating FLUME-1487
Updating FLUME-1424