You are viewing a plain text version of this content. The canonical link for it is here.
Posted to dev@jclouds.apache.org by BuildHive <bu...@cloudbees.com> on 2013/11/11 20:06:33 UTC
Build failed in Jenkins: jclouds » jclouds-labs-openstack #609
See <https://buildhive.cloudbees.com/job/jclouds/job/jclouds-labs-openstack/609/changes>
Changes:
[andrewp] [maven-release-plugin] prepare release jclouds-labs-openstack-1.6.2-incubating-rc0
[andrewp] [maven-release-plugin] prepare for next development iteration
[everett.toews] Support IAD region for Rackspace providers.
[andrewp] Revert "[maven-release-plugin] prepare for next development iteration"
[andrewp] Revert "[maven-release-plugin] prepare release jclouds-labs-openstack-1.6.2-incubating-rc0"
[andrewp] [maven-release-plugin] prepare release jclouds-labs-openstack-1.6.2-incubating-rc1
[andrewp] Revert "[maven-release-plugin] prepare release jclouds-labs-openstack-1.6.2-incubating-rc1"
[andrewp] [maven-release-plugin] prepare release jclouds-labs-openstack-1.6.2-incubating-rc2
[andrewp] [maven-release-plugin] prepare for next development iteration
[everett.toews] Support HKG region for Rackspace providers.
[zack.shoylev] Adds Otter (Rackspace Autoscale) to labs https://issues.apache.org/jira/browse/JCLOUDS-215
[zack.shoylev] JCLOUDS-215 - Adds Group configuration, Group launch, Scaling policy functionality
[zack.shoylev] JCLOUDS-215 - Adds Webhook and Execution support to autoscale
------------------------------------------
GitHub pull request #49 to jclouds/jclouds-labs-openstack
Building remotely on s-1454fa9e in workspace <https://buildhive.cloudbees.com/job/jclouds/job/jclouds-labs-openstack/ws/>
Checkout:jclouds-labs-openstack / <https://buildhive.cloudbees.com/job/jclouds/job/jclouds-labs-openstack/ws/> - hudson.remoting.Channel@357c4e90:s-1454fa9e
Using strategy: Build commits submitted for validated merge
Last Built Revision: Revision e052acb29699334be0262cc0cf918dcf1b4f67f7 (origin/master)
Fetching changes from 1 remote Git repository
Fetching upstream changes from git://github.com/jclouds/jclouds-labs-openstack.git
Opening connection
Done: 0
Counting objects
Done: 240
Finding sources
Done: 240
Getting sizes
Done: 8
Compressing objects
Done: 7
Writing objects
Done: 240
remote: Resolving deltas
Merging refs/tags/changes/609
Commencing build of Revision b810776074d19acb17d7ee925b52ceb9d961a0dc (1.6.x)
Checking out Revision b810776074d19acb17d7ee925b52ceb9d961a0dc (1.6.x)
Cleaning workspace
Parsing POMs
ERROR: Failed to parse POMs
hudson.util.IOException2: remote file operation failed: <https://buildhive.cloudbees.com/job/jclouds/job/jclouds-labs-openstack/ws/> at hudson.remoting.Channel@357c4e90:s-1454fa9e
at hudson.FilePath.act(FilePath.java:828)
at hudson.FilePath.act(FilePath.java:814)
at hudson.maven.MavenModuleSetBuild$RunnerImpl.parsePoms(MavenModuleSetBuild.java:912)
at hudson.maven.MavenModuleSetBuild$RunnerImpl.doRun(MavenModuleSetBuild.java:656)
at hudson.model.AbstractBuild$AbstractRunner.run(AbstractBuild.java:475)
at hudson.model.Run.run(Run.java:1413)
at hudson.maven.MavenModuleSetBuild.run(MavenModuleSetBuild.java:479)
at hudson.model.ResourceController.execute(ResourceController.java:88)
at hudson.model.Executor.run(Executor.java:238)
Caused by: hudson.remoting.ProxyException: hudson.maven.MavenModuleSetBuild$MavenExecutionException: org.apache.maven.project.ProjectBuildingException: Some problems were encountered while processing the POMs:
[WARNING] 'parent.relativePath' points at org.apache.jclouds.labs:jclouds-labs-openstack instead of org.apache.jclouds:jclouds-project, please verify your project structure @ line 22, column 11
[FATAL] Non-resolvable parent POM: Could not find artifact org.apache.jclouds:jclouds-project:pom:1.7.0-SNAPSHOT and 'parent.relativePath' points at wrong local POM @ line 22, column 11
[WARNING] 'parent.relativePath' points at org.apache.jclouds.labs:jclouds-labs-openstack instead of org.apache.jclouds:jclouds-project, please verify your project structure @ line 22, column 11
[FATAL] Non-resolvable parent POM: Could not find artifact org.apache.jclouds:jclouds-project:pom:1.7.0-SNAPSHOT and 'parent.relativePath' points at wrong local POM @ line 22, column 11
at hudson.maven.MavenModuleSetBuild$PomParser.invoke(MavenModuleSetBuild.java:1272)
at hudson.maven.MavenModuleSetBuild$PomParser.invoke(MavenModuleSetBuild.java:1047)
at hudson.FilePath$FileCallableWrapper.call(FilePath.java:2154)
at hudson.remoting.UserRequest.perform(UserRequest.java:118)
at hudson.remoting.UserRequest.perform(UserRequest.java:48)
at hudson.remoting.Request$2.run(Request.java:287)
at hudson.remoting.InterceptingExecutorService$1.call(InterceptingExecutorService.java:72)
at java.util.concurrent.FutureTask$Sync.innerRun(FutureTask.java:334)
at java.util.concurrent.FutureTask.run(FutureTask.java:166)
at java.util.concurrent.ThreadPoolExecutor.runWorker(ThreadPoolExecutor.java:1145)
at java.util.concurrent.ThreadPoolExecutor$Worker.run(ThreadPoolExecutor.java:615)
at java.lang.Thread.run(Thread.java:724)
Caused by: hudson.remoting.ProxyException: org.apache.maven.project.ProjectBuildingException: Some problems were encountered while processing the POMs:
[WARNING] 'parent.relativePath' points at org.apache.jclouds.labs:jclouds-labs-openstack instead of org.apache.jclouds:jclouds-project, please verify your project structure @ line 22, column 11
[FATAL] Non-resolvable parent POM: Could not find artifact org.apache.jclouds:jclouds-project:pom:1.7.0-SNAPSHOT and 'parent.relativePath' points at wrong local POM @ line 22, column 11
[WARNING] 'parent.relativePath' points at org.apache.jclouds.labs:jclouds-labs-openstack instead of org.apache.jclouds:jclouds-project, please verify your project structure @ line 22, column 11
[FATAL] Non-resolvable parent POM: Could not find artifact org.apache.jclouds:jclouds-project:pom:1.7.0-SNAPSHOT and 'parent.relativePath' points at wrong local POM @ line 22, column 11
at org.apache.maven.project.DefaultProjectBuilder.build(DefaultProjectBuilder.java:363)
at hudson.maven.MavenEmbedder.buildProjects(MavenEmbedder.java:361)
at hudson.maven.MavenEmbedder.readProjects(MavenEmbedder.java:331)
at hudson.maven.MavenModuleSetBuild$PomParser.invoke(MavenModuleSetBuild.java:1222)
... 11 more
Jenkins build is back to normal : jclouds » jclouds-labs-openstack #611
Posted by BuildHive <bu...@cloudbees.com>.
See <https://buildhive.cloudbees.com/job/jclouds/job/jclouds-labs-openstack/611/changes>
Build failed in Jenkins: jclouds » jclouds-labs-openstack #610
Posted by BuildHive <bu...@cloudbees.com>.
See <https://buildhive.cloudbees.com/job/jclouds/job/jclouds-labs-openstack/610/changes>
Changes:
[zack.shoylev] Fixes autoscale version to 1.6.3 for backport
------------------------------------------
GitHub pull request #49 to jclouds/jclouds-labs-openstack
Building remotely on s-1454fa9e in workspace <https://buildhive.cloudbees.com/job/jclouds/job/jclouds-labs-openstack/ws/>
Checkout:jclouds-labs-openstack / <https://buildhive.cloudbees.com/job/jclouds/job/jclouds-labs-openstack/ws/> - hudson.remoting.Channel@357c4e90:s-1454fa9e
Using strategy: Build commits submitted for validated merge
Last Built Revision: Revision b810776074d19acb17d7ee925b52ceb9d961a0dc (1.6.x)
Fetching changes from 1 remote Git repository
Fetching upstream changes from git://github.com/jclouds/jclouds-labs-openstack.git
Opening connection
Done: 0
Counting objects
Done: 4
Finding sources
Done: 4
Getting sizes
Done: 3
Compressing objects
Done: 2
Writing objects
Done: 4
Merging refs/tags/changes/610
Commencing build of Revision 10d4cc58a014f4b6dc5f6c6a290c89f2c23b596b (1.6.x)
Checking out Revision 10d4cc58a014f4b6dc5f6c6a290c89f2c23b596b (1.6.x)
Cleaning workspace
Parsing POMs
ERROR: Failed to parse POMs
hudson.util.IOException2: remote file operation failed: <https://buildhive.cloudbees.com/job/jclouds/job/jclouds-labs-openstack/ws/> at hudson.remoting.Channel@357c4e90:s-1454fa9e
at hudson.FilePath.act(FilePath.java:828)
at hudson.FilePath.act(FilePath.java:814)
at hudson.maven.MavenModuleSetBuild$RunnerImpl.parsePoms(MavenModuleSetBuild.java:912)
at hudson.maven.MavenModuleSetBuild$RunnerImpl.doRun(MavenModuleSetBuild.java:656)
at hudson.model.AbstractBuild$AbstractRunner.run(AbstractBuild.java:475)
at hudson.model.Run.run(Run.java:1413)
at hudson.maven.MavenModuleSetBuild.run(MavenModuleSetBuild.java:479)
at hudson.model.ResourceController.execute(ResourceController.java:88)
at hudson.model.Executor.run(Executor.java:238)
Caused by: hudson.remoting.ProxyException: hudson.maven.MavenModuleSetBuild$MavenExecutionException: org.apache.maven.project.ProjectBuildingException: Some problems were encountered while processing the POMs:
[WARNING] 'parent.relativePath' points at org.apache.jclouds.labs:jclouds-labs-openstack instead of org.apache.jclouds:jclouds-project, please verify your project structure @ line 22, column 11
[FATAL] Non-resolvable parent POM: Could not find artifact org.apache.jclouds:jclouds-project:pom:1.7.0-SNAPSHOT and 'parent.relativePath' points at wrong local POM @ line 22, column 11
at hudson.maven.MavenModuleSetBuild$PomParser.invoke(MavenModuleSetBuild.java:1272)
at hudson.maven.MavenModuleSetBuild$PomParser.invoke(MavenModuleSetBuild.java:1047)
at hudson.FilePath$FileCallableWrapper.call(FilePath.java:2154)
at hudson.remoting.UserRequest.perform(UserRequest.java:118)
at hudson.remoting.UserRequest.perform(UserRequest.java:48)
at hudson.remoting.Request$2.run(Request.java:287)
at hudson.remoting.InterceptingExecutorService$1.call(InterceptingExecutorService.java:72)
at java.util.concurrent.FutureTask$Sync.innerRun(FutureTask.java:334)
at java.util.concurrent.FutureTask.run(FutureTask.java:166)
at java.util.concurrent.ThreadPoolExecutor.runWorker(ThreadPoolExecutor.java:1145)
at java.util.concurrent.ThreadPoolExecutor$Worker.run(ThreadPoolExecutor.java:615)
at java.lang.Thread.run(Thread.java:724)
Caused by: hudson.remoting.ProxyException: org.apache.maven.project.ProjectBuildingException: Some problems were encountered while processing the POMs:
[WARNING] 'parent.relativePath' points at org.apache.jclouds.labs:jclouds-labs-openstack instead of org.apache.jclouds:jclouds-project, please verify your project structure @ line 22, column 11
[FATAL] Non-resolvable parent POM: Could not find artifact org.apache.jclouds:jclouds-project:pom:1.7.0-SNAPSHOT and 'parent.relativePath' points at wrong local POM @ line 22, column 11
at org.apache.maven.project.DefaultProjectBuilder.build(DefaultProjectBuilder.java:363)
at hudson.maven.MavenEmbedder.buildProjects(MavenEmbedder.java:361)
at hudson.maven.MavenEmbedder.readProjects(MavenEmbedder.java:331)
at hudson.maven.MavenModuleSetBuild$PomParser.invoke(MavenModuleSetBuild.java:1222)
... 11 more