You are viewing a plain text version of this content. The canonical link for it is here.
Posted to notifications@qpid.apache.org by Apache Jenkins Server <je...@builds.apache.org> on 2014/12/24 13:27:10 UTC
Build failed in Jenkins: Qpid-Java-Cpp-Test #2333
See <https://builds.apache.org/job/Qpid-Java-Cpp-Test/2333/changes>
Changes:
[kwall] QPID-6284: [Java Broker Tests] Add new chart defintion for the newSSL perf test.
------------------------------------------
[...truncated 6787 lines...]
at sun.net.NetworkClient.doConnect(NetworkClient.java:175)
at sun.net.www.http.HttpClient.openServer(HttpClient.java:378)
at sun.net.www.http.HttpClient.openServer(HttpClient.java:473)
at sun.net.www.http.HttpClient.<init>(HttpClient.java:203)
at sun.net.www.http.HttpClient.New(HttpClient.java:290)
at sun.net.www.http.HttpClient.New(HttpClient.java:306)
at sun.net.www.protocol.http.HttpURLConnection.getNewHttpClient(HttpURLConnection.java:995)
at sun.net.www.protocol.http.HttpURLConnection.plainConnect(HttpURLConnection.java:931)
at sun.net.www.protocol.http.HttpURLConnection.connect(HttpURLConnection.java:849)
at sun.net.www.protocol.http.HttpURLConnection.getOutputStream(HttpURLConnection.java:1090)
at org.apache.qpid.systest.rest.RestTestHelper.writeJsonRequest(RestTestHelper.java:234)
at org.apache.qpid.systest.rest.RestTestHelper.submitRequest(RestTestHelper.java:508)
at org.apache.qpid.systest.rest.RestTestHelper.submitRequest(RestTestHelper.java:522)
at org.apache.qpid.server.store.berkeleydb.replication.BDBHAVirtualHostNodeRestTest.createHANode(BDBHAVirtualHostNodeRestTest.java:317)
at org.apache.qpid.server.store.berkeleydb.replication.BDBHAVirtualHostNodeRestTest.testMutateStateOfOneNode(BDBHAVirtualHostNodeRestTest.java:103)
testIntruderProtection(org.apache.qpid.server.store.berkeleydb.replication.BDBHAVirtualHostNodeRestTest) Time elapsed: 0.039 sec <<< ERROR!
java.net.ConnectException: Connection refused
at java.net.PlainSocketImpl.socketConnect(Native Method)
at java.net.AbstractPlainSocketImpl.doConnect(AbstractPlainSocketImpl.java:339)
at java.net.AbstractPlainSocketImpl.connectToAddress(AbstractPlainSocketImpl.java:200)
at java.net.AbstractPlainSocketImpl.connect(AbstractPlainSocketImpl.java:182)
at java.net.SocksSocketImpl.connect(SocksSocketImpl.java:392)
at java.net.Socket.connect(Socket.java:579)
at sun.net.NetworkClient.doConnect(NetworkClient.java:175)
at sun.net.www.http.HttpClient.openServer(HttpClient.java:378)
at sun.net.www.http.HttpClient.openServer(HttpClient.java:473)
at sun.net.www.http.HttpClient.<init>(HttpClient.java:203)
at sun.net.www.http.HttpClient.New(HttpClient.java:290)
at sun.net.www.http.HttpClient.New(HttpClient.java:306)
at sun.net.www.protocol.http.HttpURLConnection.getNewHttpClient(HttpURLConnection.java:995)
at sun.net.www.protocol.http.HttpURLConnection.plainConnect(HttpURLConnection.java:931)
at sun.net.www.protocol.http.HttpURLConnection.connect(HttpURLConnection.java:849)
at sun.net.www.protocol.http.HttpURLConnection.getOutputStream(HttpURLConnection.java:1090)
at org.apache.qpid.systest.rest.RestTestHelper.writeJsonRequest(RestTestHelper.java:234)
at org.apache.qpid.systest.rest.RestTestHelper.submitRequest(RestTestHelper.java:508)
at org.apache.qpid.systest.rest.RestTestHelper.submitRequest(RestTestHelper.java:522)
at org.apache.qpid.server.store.berkeleydb.replication.BDBHAVirtualHostNodeRestTest.createHANode(BDBHAVirtualHostNodeRestTest.java:317)
at org.apache.qpid.server.store.berkeleydb.replication.BDBHAVirtualHostNodeRestTest.testIntruderProtection(BDBHAVirtualHostNodeRestTest.java:252)
testDeleteMasterNode(org.apache.qpid.server.store.berkeleydb.replication.BDBHAVirtualHostNodeRestTest) Time elapsed: 0.038 sec <<< ERROR!
java.net.ConnectException: Connection refused
at java.net.PlainSocketImpl.socketConnect(Native Method)
at java.net.AbstractPlainSocketImpl.doConnect(AbstractPlainSocketImpl.java:339)
at java.net.AbstractPlainSocketImpl.connectToAddress(AbstractPlainSocketImpl.java:200)
at java.net.AbstractPlainSocketImpl.connect(AbstractPlainSocketImpl.java:182)
at java.net.SocksSocketImpl.connect(SocksSocketImpl.java:392)
at java.net.Socket.connect(Socket.java:579)
at sun.net.NetworkClient.doConnect(NetworkClient.java:175)
at sun.net.www.http.HttpClient.openServer(HttpClient.java:378)
at sun.net.www.http.HttpClient.openServer(HttpClient.java:473)
at sun.net.www.http.HttpClient.<init>(HttpClient.java:203)
at sun.net.www.http.HttpClient.New(HttpClient.java:290)
at sun.net.www.http.HttpClient.New(HttpClient.java:306)
at sun.net.www.protocol.http.HttpURLConnection.getNewHttpClient(HttpURLConnection.java:995)
at sun.net.www.protocol.http.HttpURLConnection.plainConnect(HttpURLConnection.java:931)
at sun.net.www.protocol.http.HttpURLConnection.connect(HttpURLConnection.java:849)
at sun.net.www.protocol.http.HttpURLConnection.getOutputStream(HttpURLConnection.java:1090)
at org.apache.qpid.systest.rest.RestTestHelper.writeJsonRequest(RestTestHelper.java:234)
at org.apache.qpid.systest.rest.RestTestHelper.submitRequest(RestTestHelper.java:508)
at org.apache.qpid.systest.rest.RestTestHelper.submitRequest(RestTestHelper.java:522)
at org.apache.qpid.server.store.berkeleydb.replication.BDBHAVirtualHostNodeRestTest.createHANode(BDBHAVirtualHostNodeRestTest.java:317)
at org.apache.qpid.server.store.berkeleydb.replication.BDBHAVirtualHostNodeRestTest.testDeleteMasterNode(BDBHAVirtualHostNodeRestTest.java:192)
testCreate3NodeGroup(org.apache.qpid.server.store.berkeleydb.replication.BDBHAVirtualHostNodeRestTest) Time elapsed: 0.05 sec <<< ERROR!
java.net.ConnectException: Connection refused
at java.net.PlainSocketImpl.socketConnect(Native Method)
at java.net.AbstractPlainSocketImpl.doConnect(AbstractPlainSocketImpl.java:339)
at java.net.AbstractPlainSocketImpl.connectToAddress(AbstractPlainSocketImpl.java:200)
at java.net.AbstractPlainSocketImpl.connect(AbstractPlainSocketImpl.java:182)
at java.net.SocksSocketImpl.connect(SocksSocketImpl.java:392)
at java.net.Socket.connect(Socket.java:579)
at sun.net.NetworkClient.doConnect(NetworkClient.java:175)
at sun.net.www.http.HttpClient.openServer(HttpClient.java:378)
at sun.net.www.http.HttpClient.openServer(HttpClient.java:473)
at sun.net.www.http.HttpClient.<init>(HttpClient.java:203)
at sun.net.www.http.HttpClient.New(HttpClient.java:290)
at sun.net.www.http.HttpClient.New(HttpClient.java:306)
at sun.net.www.protocol.http.HttpURLConnection.getNewHttpClient(HttpURLConnection.java:995)
at sun.net.www.protocol.http.HttpURLConnection.plainConnect(HttpURLConnection.java:931)
at sun.net.www.protocol.http.HttpURLConnection.connect(HttpURLConnection.java:849)
at sun.net.www.protocol.http.HttpURLConnection.getOutputStream(HttpURLConnection.java:1090)
at org.apache.qpid.systest.rest.RestTestHelper.writeJsonRequest(RestTestHelper.java:234)
at org.apache.qpid.systest.rest.RestTestHelper.submitRequest(RestTestHelper.java:508)
at org.apache.qpid.systest.rest.RestTestHelper.submitRequest(RestTestHelper.java:522)
at org.apache.qpid.server.store.berkeleydb.replication.BDBHAVirtualHostNodeRestTest.createHANode(BDBHAVirtualHostNodeRestTest.java:317)
at org.apache.qpid.server.store.berkeleydb.replication.BDBHAVirtualHostNodeRestTest.testCreate3NodeGroup(BDBHAVirtualHostNodeRestTest.java:92)
testDeleteReplicaNode(org.apache.qpid.server.store.berkeleydb.replication.BDBHAVirtualHostNodeRestTest) Time elapsed: 0.041 sec <<< ERROR!
java.net.ConnectException: Connection refused
at java.net.PlainSocketImpl.socketConnect(Native Method)
at java.net.AbstractPlainSocketImpl.doConnect(AbstractPlainSocketImpl.java:339)
at java.net.AbstractPlainSocketImpl.connectToAddress(AbstractPlainSocketImpl.java:200)
at java.net.AbstractPlainSocketImpl.connect(AbstractPlainSocketImpl.java:182)
at java.net.SocksSocketImpl.connect(SocksSocketImpl.java:392)
at java.net.Socket.connect(Socket.java:579)
at sun.net.NetworkClient.doConnect(NetworkClient.java:175)
at sun.net.www.http.HttpClient.openServer(HttpClient.java:378)
at sun.net.www.http.HttpClient.openServer(HttpClient.java:473)
at sun.net.www.http.HttpClient.<init>(HttpClient.java:203)
at sun.net.www.http.HttpClient.New(HttpClient.java:290)
at sun.net.www.http.HttpClient.New(HttpClient.java:306)
at sun.net.www.protocol.http.HttpURLConnection.getNewHttpClient(HttpURLConnection.java:995)
at sun.net.www.protocol.http.HttpURLConnection.plainConnect(HttpURLConnection.java:931)
at sun.net.www.protocol.http.HttpURLConnection.connect(HttpURLConnection.java:849)
at sun.net.www.protocol.http.HttpURLConnection.getOutputStream(HttpURLConnection.java:1090)
at org.apache.qpid.systest.rest.RestTestHelper.writeJsonRequest(RestTestHelper.java:234)
at org.apache.qpid.systest.rest.RestTestHelper.submitRequest(RestTestHelper.java:508)
at org.apache.qpid.systest.rest.RestTestHelper.submitRequest(RestTestHelper.java:522)
at org.apache.qpid.server.store.berkeleydb.replication.BDBHAVirtualHostNodeRestTest.createHANode(BDBHAVirtualHostNodeRestTest.java:317)
at org.apache.qpid.server.store.berkeleydb.replication.BDBHAVirtualHostNodeRestTest.testDeleteReplicaNode(BDBHAVirtualHostNodeRestTest.java:166)
testIntruderBDBHAVHNNotAllowedToConnect(org.apache.qpid.server.store.berkeleydb.replication.BDBHAVirtualHostNodeRestTest) Time elapsed: 0.039 sec <<< ERROR!
java.net.ConnectException: Connection refused
at java.net.PlainSocketImpl.socketConnect(Native Method)
at java.net.AbstractPlainSocketImpl.doConnect(AbstractPlainSocketImpl.java:339)
at java.net.AbstractPlainSocketImpl.connectToAddress(AbstractPlainSocketImpl.java:200)
at java.net.AbstractPlainSocketImpl.connect(AbstractPlainSocketImpl.java:182)
at java.net.SocksSocketImpl.connect(SocksSocketImpl.java:392)
at java.net.Socket.connect(Socket.java:579)
at sun.net.NetworkClient.doConnect(NetworkClient.java:175)
at sun.net.www.http.HttpClient.openServer(HttpClient.java:378)
at sun.net.www.http.HttpClient.openServer(HttpClient.java:473)
at sun.net.www.http.HttpClient.<init>(HttpClient.java:203)
at sun.net.www.http.HttpClient.New(HttpClient.java:290)
at sun.net.www.http.HttpClient.New(HttpClient.java:306)
at sun.net.www.protocol.http.HttpURLConnection.getNewHttpClient(HttpURLConnection.java:995)
at sun.net.www.protocol.http.HttpURLConnection.plainConnect(HttpURLConnection.java:931)
at sun.net.www.protocol.http.HttpURLConnection.connect(HttpURLConnection.java:849)
at sun.net.www.protocol.http.HttpURLConnection.getOutputStream(HttpURLConnection.java:1090)
at org.apache.qpid.systest.rest.RestTestHelper.writeJsonRequest(RestTestHelper.java:234)
at org.apache.qpid.systest.rest.RestTestHelper.submitRequest(RestTestHelper.java:508)
at org.apache.qpid.systest.rest.RestTestHelper.submitRequest(RestTestHelper.java:522)
at org.apache.qpid.server.store.berkeleydb.replication.BDBHAVirtualHostNodeRestTest.createHANode(BDBHAVirtualHostNodeRestTest.java:317)
at org.apache.qpid.server.store.berkeleydb.replication.BDBHAVirtualHostNodeRestTest.testIntruderBDBHAVHNNotAllowedToConnect(BDBHAVirtualHostNodeRestTest.java:232)
Running org.apache.qpid.server.store.berkeleydb.BDBBackupTest
Tests run: 0, Failures: 0, Errors: 0, Skipped: 0, Time elapsed: 0.001 sec - in org.apache.qpid.server.store.berkeleydb.BDBBackupTest
Results :
Failed tests:
TwoNodeTest>QpidTestCase.run:148->QpidBrokerTestCase.runBare:272->setUp:55 null
TwoNodeTest>QpidTestCase.run:148->QpidBrokerTestCase.runBare:272->setUp:55 null
TwoNodeTest>QpidTestCase.run:148->QpidBrokerTestCase.runBare:272->setUp:55 null
TwoNodeTest>QpidTestCase.run:148->QpidBrokerTestCase.runBare:272->setUp:55 null
TwoNodeTest>QpidTestCase.run:148->QpidBrokerTestCase.runBare:272->setUp:55 null
TwoNodeTest>QpidTestCase.run:148->QpidBrokerTestCase.runBare:272->setUp:55 null
TwoNodeTest>QpidTestCase.run:148->QpidBrokerTestCase.runBare:272->setUp:55 null
MultiNodeTest>QpidTestCase.run:148->QpidBrokerTestCase.runBare:272->setUp:81 null
MultiNodeTest>QpidTestCase.run:148->QpidBrokerTestCase.runBare:272->setUp:81 null
MultiNodeTest>QpidTestCase.run:148->QpidBrokerTestCase.runBare:272->setUp:81 null
MultiNodeTest>QpidTestCase.run:148->QpidBrokerTestCase.runBare:272->setUp:81 null
MultiNodeTest>QpidTestCase.run:148->QpidBrokerTestCase.runBare:272->setUp:81 null
MultiNodeTest>QpidTestCase.run:148->QpidBrokerTestCase.runBare:272->setUp:81 null
MultiNodeTest>QpidTestCase.run:148->QpidBrokerTestCase.runBare:272->setUp:81 null
MultiNodeTest>QpidTestCase.run:148->QpidBrokerTestCase.runBare:272->setUp:81 null
MultiNodeTest>QpidTestCase.run:148->QpidBrokerTestCase.runBare:272->setUp:81 null
MultiNodeTest>QpidTestCase.run:148->QpidBrokerTestCase.runBare:272->setUp:81 null
Tests in error:
JMXManagementTest>QpidTestCase.run:148->QpidBrokerTestCase.runBare:272->testRemoveRemoteNodeFromGroup:164->getStoreBeanForNodeAtBrokerPort:276 » IO
JMXManagementTest>QpidTestCase.run:148->QpidBrokerTestCase.runBare:272->testVirtualHostOperationsDeniedForNonMasterNode:187->getManagedBrokerBeanForNodeAtBrokerPort:283 » IO
JMXManagementTest>QpidTestCase.run:148->QpidBrokerTestCase.runBare:272->testStateOfNonActiveBrokerIsNotMaster:133->getStoreBeanForNodeAtBrokerPort:276 » IO
JMXManagementTest>QpidTestCase.run:148->QpidBrokerTestCase.runBare:272->testStateOfActiveBrokerIsMaster:125->getStoreBeanForNodeAtBrokerPort:276 » IO
JMXManagementTest>QpidTestCase.run:148->QpidBrokerTestCase.runBare:272->testVirtualHostMbeanOnMasterTransfer:225->getManagedBrokerBeanForNodeAtBrokerPort:283 » IO
JMXManagementTest>QpidTestCase.run:148->QpidBrokerTestCase.runBare:272->testGroupMembers:142->getStoreBeanForNodeAtBrokerPort:276 » IO
JMXManagementTest>QpidTestCase.run:148->QpidBrokerTestCase.runBare:272->testReadonlyMBeanAttributes:111->getStoreBeanForNodeAtBrokerPort:276 » IO
BDBHAVirtualHostRestTest>QpidTestCase.run:148->QpidBrokerTestCase.runBare:272->testSetLocalTransactionSynchronizationPolicy:116->QpidRestTestCase.waitForAttributeChanged:114 » Connect
BDBHAVirtualHostRestTest>QpidTestCase.run:148->QpidBrokerTestCase.runBare:272->testMutateState:140->QpidRestTestCase.waitForAttributeChanged:114 » Connect
BDBHAVirtualHostRestTest>QpidTestCase.run:148->QpidBrokerTestCase.runBare:272->testSetRemoteTransactionSynchronizationPolicy:128->QpidRestTestCase.waitForAttributeChanged:114 » Connect
BDBHAVirtualHostNodeRestTest>QpidTestCase.run:148->QpidBrokerTestCase.runBare:272->testNewMasterElectedWhenVirtualHostIsStopped:135->createHANode:317 » Connect
BDBHAVirtualHostNodeRestTest>QpidTestCase.run:148->QpidBrokerTestCase.runBare:272->testMutateStateOfOneNode:103->createHANode:317 » Connect
BDBHAVirtualHostNodeRestTest>QpidTestCase.run:148->QpidBrokerTestCase.runBare:272->testIntruderProtection:252->createHANode:317 » Connect
BDBHAVirtualHostNodeRestTest>QpidTestCase.run:148->QpidBrokerTestCase.runBare:272->testDeleteMasterNode:192->createHANode:317 » Connect
BDBHAVirtualHostNodeRestTest>QpidTestCase.run:148->QpidBrokerTestCase.runBare:272->testCreate3NodeGroup:92->createHANode:317 » Connect
BDBHAVirtualHostNodeRestTest>QpidTestCase.run:148->QpidBrokerTestCase.runBare:272->testDeleteReplicaNode:166->createHANode:317 » Connect
BDBHAVirtualHostNodeRestTest>QpidTestCase.run:148->QpidBrokerTestCase.runBare:272->testIntruderBDBHAVHNNotAllowedToConnect:232->createHANode:317 » Connect
Tests run: 42, Failures: 17, Errors: 17, Skipped: 0
[INFO] ------------------------------------------------------------------------
[INFO] Reactor Summary:
[INFO]
[INFO] Qpid Java Build ................................... SUCCESS [2.291s]
[INFO] Qpid AMQP 1.0 Common .............................. SUCCESS [5.036s]
[INFO] Qpid AMQP 1.0 Client .............................. SUCCESS [0.758s]
[INFO] Qpid AMQP 1.0 Client JMS .......................... SUCCESS [1.603s]
[INFO] Qpid AMQP 1.0 JMS Client Examples ................. SUCCESS [0.211s]
[INFO] Qpid AMQP 1.0 Client WebSocket .................... SUCCESS [0.592s]
[INFO] Qpid Broker Code Generation ....................... SUCCESS [0.322s]
[INFO] Qpid Test Utilities ............................... SUCCESS [0.252s]
[INFO] Qpid Common ....................................... SUCCESS [28.133s]
[INFO] Qpid Management Common ............................ SUCCESS [1.171s]
[INFO] Qpid Java Broker Core ............................. SUCCESS [1:27.411s]
[INFO] Qpid Access Control Broker Plug-in ................ SUCCESS [4.114s]
[INFO] Qpid AMQP 0-8 Protocol Broker Plug-in ............. SUCCESS [20.356s]
[INFO] Qpid AMQP 0-10 Protocol Plug-in ................... SUCCESS [3.952s]
[INFO] Qpid AMQP 1-0 Protocol Broker Plug-in ............. SUCCESS [0.513s]
[INFO] Qpid AMQP 0-8 to 0-10 Message Conversion Broker Plug-in SUCCESS [0.286s]
[INFO] Qpid AMQP 0-8 to 1-0 Message Conversion Broker Plug-in SUCCESS [0.253s]
[INFO] Qpid AMQP 0-10 to 1-0 Message Conversion Broker Plug-in SUCCESS [0.245s]
[INFO] Qpid Derby Message Store .......................... SUCCESS [16.421s]
[INFO] Qpid JDBC Message Store Connection Pooling Plug-in SUCCESS [0.355s]
[INFO] Qpid JDBC Message Store Broker Plug-in ............ SUCCESS [8.986s]
[INFO] Qpid HTTP Management Broker Plug-in ............... SUCCESS [6.811s]
[INFO] Qpid JMX Management Broker Plug-in ................ SUCCESS [3.158s]
[INFO] Qpid Memory Message Store Broker Plug-in .......... SUCCESS [0.383s]
[INFO] Qpid WebSocket Broker Plug-in ..................... SUCCESS [0.266s]
[INFO] Qpid AMQP 0-x JMS Client .......................... SUCCESS [6.227s]
[INFO] Qpid BDB Message Store ............................ SUCCESS [2:11.330s]
[INFO] Qpid BDB Message Store JMX ........................ SUCCESS [1.965s]
[INFO] Qpid Java Broker .................................. SUCCESS [5.157s]
[INFO] Qpid AMQP Management Protocol Broker Plug-in ...... SUCCESS [0.229s]
[INFO] Qpid AMQP 0-x JMS Client Examples ................. SUCCESS [0.136s]
[INFO] Qpid JCA .......................................... SUCCESS [1.579s]
[INFO] Qpid Resource Adaptor ............................. SUCCESS [0.482s]
[INFO] Qpid Tools ........................................ SUCCESS [0.358s]
[INFO] Qpid Management Examples .......................... SUCCESS [0.200s]
[INFO] Qpid Java System Test Parent ...................... SUCCESS [0.769s]
[INFO] Qpid System Tests ................................. SUCCESS [6:02.542s]
[INFO] Qpid Performance Tests ............................ SUCCESS [12.876s]
[INFO] Qpid Performance Test System Tests ................ SUCCESS [16.573s]
[INFO] Qpid Performance Tests Visualisation JFC .......... SUCCESS [4.078s]
[INFO] Qpid BDB Store System Tests ....................... FAILURE [5.279s]
[INFO] ------------------------------------------------------------------------
[INFO] BUILD FAILURE
[INFO] ------------------------------------------------------------------------
[INFO] Total time: 12:24.718s
[INFO] Finished at: Wed Dec 24 12:26:51 UTC 2014
[INFO] Final Memory: 73M/392M
[INFO] ------------------------------------------------------------------------
[ERROR] Failed to execute goal org.apache.maven.plugins:maven-surefire-plugin:2.16:test (integration-test) on project qpid-bdbstore-systests: There are test failures.
[ERROR]
[ERROR] Please refer to <https://builds.apache.org/job/Qpid-Java-Cpp-Test/ws/trunk/qpid/java/bdbstore/systests/target/surefire-reports> for the individual test results.
[ERROR] -> [Help 1]
[ERROR]
[ERROR] To see the full stack trace of the errors, re-run Maven with the -e switch.
[ERROR] Re-run Maven using the -X switch to enable full debug logging.
[ERROR]
[ERROR] For more information about the errors and possible solutions, please read the following articles:
[ERROR] [Help 1] http://cwiki.apache.org/confluence/display/MAVEN/MojoFailureException
[ERROR]
[ERROR] After correcting the problems, you can resume the build with the command
[ERROR] mvn <goals> -rf :qpid-bdbstore-systests
Build step 'Invoke top-level Maven targets' marked build as failure
[locks-and-latches] Releasing all the locks
[locks-and-latches] All the locks released
Recording test results