You are viewing a plain text version of this content. The canonical link for it is here.
Posted to dev@lucene.apache.org by Policeman Jenkins Server <je...@thetaphi.de> on 2017/04/03 09:18:14 UTC
[JENKINS] Lucene-Solr-6.x-MacOSX (64bit/jdk1.8.0) - Build # 803 -
Still Unstable!
Build: https://jenkins.thetaphi.de/job/Lucene-Solr-6.x-MacOSX/803/
Java: 64bit/jdk1.8.0 -XX:+UseCompressedOops -XX:+UseSerialGC
1 tests failed.
FAILED: org.apache.solr.cloud.CustomCollectionTest.testRouteFieldForImplicitRouter
Error Message:
Collection not found: withShardField
Stack Trace:
org.apache.solr.common.SolrException: Collection not found: withShardField
at __randomizedtesting.SeedInfo.seed([379ED6FA5784D401:62CE3E68FB7D1BF1]:0)
at org.apache.solr.client.solrj.impl.CloudSolrClient.getCollectionNames(CloudSolrClient.java:1382)
at org.apache.solr.client.solrj.impl.CloudSolrClient.requestWithRetryOnStaleState(CloudSolrClient.java:1075)
at org.apache.solr.client.solrj.impl.CloudSolrClient.request(CloudSolrClient.java:1054)
at org.apache.solr.client.solrj.SolrRequest.process(SolrRequest.java:160)
at org.apache.solr.client.solrj.request.UpdateRequest.commit(UpdateRequest.java:233)
at org.apache.solr.cloud.CustomCollectionTest.testRouteFieldForImplicitRouter(CustomCollectionTest.java:141)
at sun.reflect.NativeMethodAccessorImpl.invoke0(Native Method)
at sun.reflect.NativeMethodAccessorImpl.invoke(NativeMethodAccessorImpl.java:62)
at sun.reflect.DelegatingMethodAccessorImpl.invoke(DelegatingMethodAccessorImpl.java:43)
at java.lang.reflect.Method.invoke(Method.java:498)
at com.carrotsearch.randomizedtesting.RandomizedRunner.invoke(RandomizedRunner.java:1713)
at com.carrotsearch.randomizedtesting.RandomizedRunner$8.evaluate(RandomizedRunner.java:907)
at com.carrotsearch.randomizedtesting.RandomizedRunner$9.evaluate(RandomizedRunner.java:943)
at com.carrotsearch.randomizedtesting.RandomizedRunner$10.evaluate(RandomizedRunner.java:957)
at com.carrotsearch.randomizedtesting.rules.SystemPropertiesRestoreRule$1.evaluate(SystemPropertiesRestoreRule.java:57)
at org.apache.lucene.util.TestRuleSetupTeardownChained$1.evaluate(TestRuleSetupTeardownChained.java:49)
at org.apache.lucene.util.AbstractBeforeAfterRule$1.evaluate(AbstractBeforeAfterRule.java:45)
at org.apache.lucene.util.TestRuleThreadAndTestName$1.evaluate(TestRuleThreadAndTestName.java:48)
at org.apache.lucene.util.TestRuleIgnoreAfterMaxFailures$1.evaluate(TestRuleIgnoreAfterMaxFailures.java:64)
at org.apache.lucene.util.TestRuleMarkFailure$1.evaluate(TestRuleMarkFailure.java:47)
at com.carrotsearch.randomizedtesting.rules.StatementAdapter.evaluate(StatementAdapter.java:36)
at com.carrotsearch.randomizedtesting.ThreadLeakControl$StatementRunner.run(ThreadLeakControl.java:368)
at com.carrotsearch.randomizedtesting.ThreadLeakControl.forkTimeoutingTask(ThreadLeakControl.java:817)
at com.carrotsearch.randomizedtesting.ThreadLeakControl$3.evaluate(ThreadLeakControl.java:468)
at com.carrotsearch.randomizedtesting.RandomizedRunner.runSingleTest(RandomizedRunner.java:916)
at com.carrotsearch.randomizedtesting.RandomizedRunner$5.evaluate(RandomizedRunner.java:802)
at com.carrotsearch.randomizedtesting.RandomizedRunner$6.evaluate(RandomizedRunner.java:852)
at com.carrotsearch.randomizedtesting.RandomizedRunner$7.evaluate(RandomizedRunner.java:863)
at com.carrotsearch.randomizedtesting.rules.StatementAdapter.evaluate(StatementAdapter.java:36)
at com.carrotsearch.randomizedtesting.rules.SystemPropertiesRestoreRule$1.evaluate(SystemPropertiesRestoreRule.java:57)
at org.apache.lucene.util.AbstractBeforeAfterRule$1.evaluate(AbstractBeforeAfterRule.java:45)
at com.carrotsearch.randomizedtesting.rules.StatementAdapter.evaluate(StatementAdapter.java:36)
at org.apache.lucene.util.TestRuleStoreClassName$1.evaluate(TestRuleStoreClassName.java:41)
at com.carrotsearch.randomizedtesting.rules.NoShadowingOrOverridesOnMethodsRule$1.evaluate(NoShadowingOrOverridesOnMethodsRule.java:40)
at com.carrotsearch.randomizedtesting.rules.NoShadowingOrOverridesOnMethodsRule$1.evaluate(NoShadowingOrOverridesOnMethodsRule.java:40)
at com.carrotsearch.randomizedtesting.rules.StatementAdapter.evaluate(StatementAdapter.java:36)
at com.carrotsearch.randomizedtesting.rules.StatementAdapter.evaluate(StatementAdapter.java:36)
at com.carrotsearch.randomizedtesting.rules.StatementAdapter.evaluate(StatementAdapter.java:36)
at org.apache.lucene.util.TestRuleAssertionsRequired$1.evaluate(TestRuleAssertionsRequired.java:53)
at org.apache.lucene.util.TestRuleMarkFailure$1.evaluate(TestRuleMarkFailure.java:47)
at org.apache.lucene.util.TestRuleIgnoreAfterMaxFailures$1.evaluate(TestRuleIgnoreAfterMaxFailures.java:64)
at org.apache.lucene.util.TestRuleIgnoreTestSuites$1.evaluate(TestRuleIgnoreTestSuites.java:54)
at com.carrotsearch.randomizedtesting.rules.StatementAdapter.evaluate(StatementAdapter.java:36)
at com.carrotsearch.randomizedtesting.ThreadLeakControl$StatementRunner.run(ThreadLeakControl.java:368)
at java.lang.Thread.run(Thread.java:745)
Build Log:
[...truncated 12565 lines...]
[junit4] Suite: org.apache.solr.cloud.CustomCollectionTest
[junit4] 2> Creating dataDir: /Users/jenkins/workspace/Lucene-Solr-6.x-MacOSX/solr/build/solr-core/test/J0/temp/solr.cloud.CustomCollectionTest_379ED6FA5784D401-001/init-core-data-001
[junit4] 2> 2939189 INFO (SUITE-CustomCollectionTest-seed#[379ED6FA5784D401]-worker) [ ] o.a.s.SolrTestCaseJ4 Using TrieFields
[junit4] 2> 2939190 INFO (SUITE-CustomCollectionTest-seed#[379ED6FA5784D401]-worker) [ ] o.a.s.SolrTestCaseJ4 Randomized ssl (false) and clientAuth (false) via: @org.apache.solr.util.RandomizeSSL(reason=, value=NaN, ssl=NaN, clientAuth=NaN) w/ MAC_OS_X supressed clientAuth
[junit4] 2> 2939191 INFO (SUITE-CustomCollectionTest-seed#[379ED6FA5784D401]-worker) [ ] o.a.s.c.MiniSolrCloudCluster Starting cluster of 4 servers in /Users/jenkins/workspace/Lucene-Solr-6.x-MacOSX/solr/build/solr-core/test/J0/temp/solr.cloud.CustomCollectionTest_379ED6FA5784D401-001/tempDir-001
[junit4] 2> 2939191 INFO (SUITE-CustomCollectionTest-seed#[379ED6FA5784D401]-worker) [ ] o.a.s.c.ZkTestServer STARTING ZK TEST SERVER
[junit4] 2> 2939192 INFO (Thread-3561) [ ] o.a.s.c.ZkTestServer client port:0.0.0.0/0.0.0.0:0
[junit4] 2> 2939192 INFO (Thread-3561) [ ] o.a.s.c.ZkTestServer Starting server
[junit4] 2> 2939302 INFO (SUITE-CustomCollectionTest-seed#[379ED6FA5784D401]-worker) [ ] o.a.s.c.ZkTestServer start zk server on port:62116
[junit4] 2> 2939358 INFO (jetty-launcher-2792-thread-1) [ ] o.e.j.s.Server jetty-9.3.14.v20161028
[junit4] 2> 2939358 INFO (jetty-launcher-2792-thread-2) [ ] o.e.j.s.Server jetty-9.3.14.v20161028
[junit4] 2> 2939359 INFO (jetty-launcher-2792-thread-3) [ ] o.e.j.s.Server jetty-9.3.14.v20161028
[junit4] 2> 2939360 INFO (jetty-launcher-2792-thread-4) [ ] o.e.j.s.Server jetty-9.3.14.v20161028
[junit4] 2> 2939367 INFO (jetty-launcher-2792-thread-2) [ ] o.e.j.s.h.ContextHandler Started o.e.j.s.ServletContextHandler@610cf8e2{/solr,null,AVAILABLE}
[junit4] 2> 2939380 INFO (jetty-launcher-2792-thread-3) [ ] o.e.j.s.h.ContextHandler Started o.e.j.s.ServletContextHandler@7f977c21{/solr,null,AVAILABLE}
[junit4] 2> 2939380 INFO (jetty-launcher-2792-thread-4) [ ] o.e.j.s.h.ContextHandler Started o.e.j.s.ServletContextHandler@5a7dd05e{/solr,null,AVAILABLE}
[junit4] 2> 2939381 INFO (jetty-launcher-2792-thread-4) [ ] o.e.j.s.AbstractConnector Started ServerConnector@1928fd60{HTTP/1.1,[http/1.1]}{127.0.0.1:62119}
[junit4] 2> 2939381 INFO (jetty-launcher-2792-thread-3) [ ] o.e.j.s.AbstractConnector Started ServerConnector@71ac5917{HTTP/1.1,[http/1.1]}{127.0.0.1:62118}
[junit4] 2> 2939381 INFO (jetty-launcher-2792-thread-3) [ ] o.e.j.s.Server Started @2946424ms
[junit4] 2> 2939381 INFO (jetty-launcher-2792-thread-4) [ ] o.e.j.s.Server Started @2946424ms
[junit4] 2> 2939381 INFO (jetty-launcher-2792-thread-4) [ ] o.a.s.c.s.e.JettySolrRunner Jetty properties: {hostContext=/solr, hostPort=62119}
[junit4] 2> 2939382 ERROR (jetty-launcher-2792-thread-4) [ ] o.a.s.s.StartupLoggingUtils Missing Java Option solr.log.dir. Logging may be missing or incomplete.
[junit4] 2> 2939381 INFO (jetty-launcher-2792-thread-3) [ ] o.a.s.c.s.e.JettySolrRunner Jetty properties: {hostContext=/solr, hostPort=62118}
[junit4] 2> 2939382 ERROR (jetty-launcher-2792-thread-3) [ ] o.a.s.s.StartupLoggingUtils Missing Java Option solr.log.dir. Logging may be missing or incomplete.
[junit4] 2> 2939382 INFO (jetty-launcher-2792-thread-2) [ ] o.e.j.s.AbstractConnector Started ServerConnector@70cda965{HTTP/1.1,[http/1.1]}{127.0.0.1:62120}
[junit4] 2> 2939383 INFO (jetty-launcher-2792-thread-4) [ ] o.a.s.s.SolrDispatchFilter ___ _ Welcome to Apache Solr™ version 6.6.0
[junit4] 2> 2939383 INFO (jetty-launcher-2792-thread-2) [ ] o.e.j.s.Server Started @2946426ms
[junit4] 2> 2939383 INFO (jetty-launcher-2792-thread-4) [ ] o.a.s.s.SolrDispatchFilter / __| ___| |_ _ Starting in cloud mode on port null
[junit4] 2> 2939383 INFO (jetty-launcher-2792-thread-2) [ ] o.a.s.c.s.e.JettySolrRunner Jetty properties: {hostContext=/solr, hostPort=62120}
[junit4] 2> 2939383 INFO (jetty-launcher-2792-thread-4) [ ] o.a.s.s.SolrDispatchFilter \__ \/ _ \ | '_| Install dir: null
[junit4] 2> 2939383 INFO (jetty-launcher-2792-thread-4) [ ] o.a.s.s.SolrDispatchFilter |___/\___/_|_| Start time: 2017-04-03T08:32:28.361Z
[junit4] 2> 2939383 ERROR (jetty-launcher-2792-thread-2) [ ] o.a.s.s.StartupLoggingUtils Missing Java Option solr.log.dir. Logging may be missing or incomplete.
[junit4] 2> 2939383 INFO (jetty-launcher-2792-thread-3) [ ] o.a.s.s.SolrDispatchFilter ___ _ Welcome to Apache Solr™ version 6.6.0
[junit4] 2> 2939383 INFO (jetty-launcher-2792-thread-3) [ ] o.a.s.s.SolrDispatchFilter / __| ___| |_ _ Starting in cloud mode on port null
[junit4] 2> 2939384 INFO (jetty-launcher-2792-thread-3) [ ] o.a.s.s.SolrDispatchFilter \__ \/ _ \ | '_| Install dir: null
[junit4] 2> 2939384 INFO (jetty-launcher-2792-thread-3) [ ] o.a.s.s.SolrDispatchFilter |___/\___/_|_| Start time: 2017-04-03T08:32:28.362Z
[junit4] 2> 2939384 INFO (jetty-launcher-2792-thread-2) [ ] o.a.s.s.SolrDispatchFilter ___ _ Welcome to Apache Solr™ version 6.6.0
[junit4] 2> 2939384 INFO (jetty-launcher-2792-thread-2) [ ] o.a.s.s.SolrDispatchFilter / __| ___| |_ _ Starting in cloud mode on port null
[junit4] 2> 2939384 INFO (jetty-launcher-2792-thread-2) [ ] o.a.s.s.SolrDispatchFilter \__ \/ _ \ | '_| Install dir: null
[junit4] 2> 2939384 INFO (jetty-launcher-2792-thread-2) [ ] o.a.s.s.SolrDispatchFilter |___/\___/_|_| Start time: 2017-04-03T08:32:28.362Z
[junit4] 2> 2939387 INFO (jetty-launcher-2792-thread-1) [ ] o.e.j.s.h.ContextHandler Started o.e.j.s.ServletContextHandler@52193848{/solr,null,AVAILABLE}
[junit4] 2> 2939387 INFO (jetty-launcher-2792-thread-1) [ ] o.e.j.s.AbstractConnector Started ServerConnector@6e7412c9{HTTP/1.1,[http/1.1]}{127.0.0.1:62124}
[junit4] 2> 2939388 INFO (jetty-launcher-2792-thread-1) [ ] o.e.j.s.Server Started @2946431ms
[junit4] 2> 2939388 INFO (jetty-launcher-2792-thread-1) [ ] o.a.s.c.s.e.JettySolrRunner Jetty properties: {hostContext=/solr, hostPort=62124}
[junit4] 2> 2939388 ERROR (jetty-launcher-2792-thread-1) [ ] o.a.s.s.StartupLoggingUtils Missing Java Option solr.log.dir. Logging may be missing or incomplete.
[junit4] 2> 2939388 INFO (jetty-launcher-2792-thread-1) [ ] o.a.s.s.SolrDispatchFilter ___ _ Welcome to Apache Solr™ version 6.6.0
[junit4] 2> 2939389 INFO (jetty-launcher-2792-thread-1) [ ] o.a.s.s.SolrDispatchFilter / __| ___| |_ _ Starting in cloud mode on port null
[junit4] 2> 2939389 INFO (jetty-launcher-2792-thread-1) [ ] o.a.s.s.SolrDispatchFilter \__ \/ _ \ | '_| Install dir: null
[junit4] 2> 2939389 INFO (jetty-launcher-2792-thread-1) [ ] o.a.s.s.SolrDispatchFilter |___/\___/_|_| Start time: 2017-04-03T08:32:28.367Z
[junit4] 2> 2939390 INFO (jetty-launcher-2792-thread-4) [ ] o.a.s.s.SolrDispatchFilter solr.xml found in ZooKeeper. Loading...
[junit4] 2> 2939390 INFO (jetty-launcher-2792-thread-2) [ ] o.a.s.s.SolrDispatchFilter solr.xml found in ZooKeeper. Loading...
[junit4] 2> 2939390 INFO (jetty-launcher-2792-thread-3) [ ] o.a.s.s.SolrDispatchFilter solr.xml found in ZooKeeper. Loading...
[junit4] 2> 2939394 INFO (jetty-launcher-2792-thread-1) [ ] o.a.s.s.SolrDispatchFilter solr.xml found in ZooKeeper. Loading...
[junit4] 2> 2939406 INFO (jetty-launcher-2792-thread-2) [ ] o.a.s.u.UpdateShardHandler Creating UpdateShardHandler HTTP client with params: socketTimeout=340000&connTimeout=45000&retry=true
[junit4] 2> 2939406 INFO (jetty-launcher-2792-thread-1) [ ] o.a.s.u.UpdateShardHandler Creating UpdateShardHandler HTTP client with params: socketTimeout=340000&connTimeout=45000&retry=true
[junit4] 2> 2939407 INFO (jetty-launcher-2792-thread-4) [ ] o.a.s.u.UpdateShardHandler Creating UpdateShardHandler HTTP client with params: socketTimeout=340000&connTimeout=45000&retry=true
[junit4] 2> 2939407 INFO (jetty-launcher-2792-thread-3) [ ] o.a.s.u.UpdateShardHandler Creating UpdateShardHandler HTTP client with params: socketTimeout=340000&connTimeout=45000&retry=true
[junit4] 2> 2939408 INFO (jetty-launcher-2792-thread-4) [ ] o.a.s.c.ZkContainer Zookeeper client=127.0.0.1:62116/solr
[junit4] 2> 2939408 INFO (jetty-launcher-2792-thread-1) [ ] o.a.s.c.ZkContainer Zookeeper client=127.0.0.1:62116/solr
[junit4] 2> 2939410 INFO (jetty-launcher-2792-thread-2) [ ] o.a.s.c.ZkContainer Zookeeper client=127.0.0.1:62116/solr
[junit4] 2> 2939411 INFO (jetty-launcher-2792-thread-3) [ ] o.a.s.c.ZkContainer Zookeeper client=127.0.0.1:62116/solr
[junit4] 2> 2939468 INFO (jetty-launcher-2792-thread-4) [n:127.0.0.1:62119_solr ] o.a.s.c.Overseer Overseer (id=null) closing
[junit4] 2> 2939469 INFO (jetty-launcher-2792-thread-1) [n:127.0.0.1:62124_solr ] o.a.s.c.Overseer Overseer (id=null) closing
[junit4] 2> 2939470 INFO (jetty-launcher-2792-thread-4) [n:127.0.0.1:62119_solr ] o.a.s.c.OverseerElectionContext I am going to be the leader 127.0.0.1:62119_solr
[junit4] 2> 2939470 INFO (jetty-launcher-2792-thread-3) [n:127.0.0.1:62118_solr ] o.a.s.c.Overseer Overseer (id=null) closing
[junit4] 2> 2939472 INFO (jetty-launcher-2792-thread-1) [n:127.0.0.1:62124_solr ] o.a.s.c.ZkController Register node as live in ZooKeeper:/live_nodes/127.0.0.1:62124_solr
[junit4] 2> 2939472 INFO (jetty-launcher-2792-thread-4) [n:127.0.0.1:62119_solr ] o.a.s.c.Overseer Overseer (id=97727830305865738-127.0.0.1:62119_solr-n_0000000000) starting
[junit4] 2> 2939476 INFO (zkCallback-2811-thread-1-processing-n:127.0.0.1:62124_solr) [n:127.0.0.1:62124_solr ] o.a.s.c.c.ZkStateReader Updated live nodes from ZooKeeper... (0) -> (1)
[junit4] 2> 2939477 INFO (zkCallback-2812-thread-1-processing-n:127.0.0.1:62119_solr) [n:127.0.0.1:62119_solr ] o.a.s.c.c.ZkStateReader Updated live nodes from ZooKeeper... (0) -> (1)
[junit4] 2> 2939479 INFO (zkCallback-2813-thread-1-processing-n:127.0.0.1:62118_solr) [n:127.0.0.1:62118_solr ] o.a.s.c.c.ZkStateReader Updated live nodes from ZooKeeper... (0) -> (1)
[junit4] 2> 2939482 INFO (jetty-launcher-2792-thread-3) [n:127.0.0.1:62118_solr ] o.a.s.c.ZkController Register node as live in ZooKeeper:/live_nodes/127.0.0.1:62118_solr
[junit4] 2> 2939486 INFO (zkCallback-2812-thread-1-processing-n:127.0.0.1:62119_solr) [n:127.0.0.1:62119_solr ] o.a.s.c.c.ZkStateReader Updated live nodes from ZooKeeper... (1) -> (2)
[junit4] 2> 2939487 INFO (zkCallback-2813-thread-1-processing-n:127.0.0.1:62118_solr) [n:127.0.0.1:62118_solr ] o.a.s.c.c.ZkStateReader Updated live nodes from ZooKeeper... (1) -> (2)
[junit4] 2> 2939487 INFO (zkCallback-2811-thread-1-processing-n:127.0.0.1:62124_solr) [n:127.0.0.1:62124_solr ] o.a.s.c.c.ZkStateReader Updated live nodes from ZooKeeper... (1) -> (2)
[junit4] 2> 2939494 INFO (jetty-launcher-2792-thread-4) [n:127.0.0.1:62119_solr ] o.a.s.c.ZkController Register node as live in ZooKeeper:/live_nodes/127.0.0.1:62119_solr
[junit4] 2> 2939497 INFO (zkCallback-2813-thread-1-processing-n:127.0.0.1:62118_solr) [n:127.0.0.1:62118_solr ] o.a.s.c.c.ZkStateReader Updated live nodes from ZooKeeper... (2) -> (3)
[junit4] 2> 2939497 INFO (zkCallback-2811-thread-1-processing-n:127.0.0.1:62124_solr) [n:127.0.0.1:62124_solr ] o.a.s.c.c.ZkStateReader Updated live nodes from ZooKeeper... (2) -> (3)
[junit4] 2> 2939498 INFO (zkCallback-2812-thread-1-processing-n:127.0.0.1:62119_solr) [n:127.0.0.1:62119_solr ] o.a.s.c.c.ZkStateReader Updated live nodes from ZooKeeper... (2) -> (3)
[junit4] 2> 2939513 INFO (jetty-launcher-2792-thread-2) [n:127.0.0.1:62120_solr ] o.a.s.c.c.ZkStateReader Updated live nodes from ZooKeeper... (0) -> (3)
[junit4] 2> 2939518 INFO (jetty-launcher-2792-thread-2) [n:127.0.0.1:62120_solr ] o.a.s.c.Overseer Overseer (id=null) closing
[junit4] 2> 2939521 INFO (jetty-launcher-2792-thread-2) [n:127.0.0.1:62120_solr ] o.a.s.c.ZkController Register node as live in ZooKeeper:/live_nodes/127.0.0.1:62120_solr
[junit4] 2> 2939525 INFO (zkCallback-2813-thread-1-processing-n:127.0.0.1:62118_solr) [n:127.0.0.1:62118_solr ] o.a.s.c.c.ZkStateReader Updated live nodes from ZooKeeper... (3) -> (4)
[junit4] 2> 2939525 INFO (zkCallback-2811-thread-1-processing-n:127.0.0.1:62124_solr) [n:127.0.0.1:62124_solr ] o.a.s.c.c.ZkStateReader Updated live nodes from ZooKeeper... (3) -> (4)
[junit4] 2> 2939527 INFO (zkCallback-2814-thread-1-processing-n:127.0.0.1:62120_solr) [n:127.0.0.1:62120_solr ] o.a.s.c.c.ZkStateReader Updated live nodes from ZooKeeper... (3) -> (4)
[junit4] 2> 2939532 INFO (zkCallback-2812-thread-2-processing-n:127.0.0.1:62119_solr) [n:127.0.0.1:62119_solr ] o.a.s.c.c.ZkStateReader Updated live nodes from ZooKeeper... (3) -> (4)
[junit4] 2> 2939706 INFO (jetty-launcher-2792-thread-4) [n:127.0.0.1:62119_solr ] o.a.s.c.CorePropertiesLocator Found 0 core definitions underneath /Users/jenkins/workspace/Lucene-Solr-6.x-MacOSX/solr/build/solr-core/test/J0/temp/solr.cloud.CustomCollectionTest_379ED6FA5784D401-001/tempDir-001/node4/.
[junit4] 2> 2939706 INFO (jetty-launcher-2792-thread-1) [n:127.0.0.1:62124_solr ] o.a.s.c.CorePropertiesLocator Found 0 core definitions underneath /Users/jenkins/workspace/Lucene-Solr-6.x-MacOSX/solr/build/solr-core/test/J0/temp/solr.cloud.CustomCollectionTest_379ED6FA5784D401-001/tempDir-001/node1/.
[junit4] 2> 2939708 INFO (jetty-launcher-2792-thread-3) [n:127.0.0.1:62118_solr ] o.a.s.c.CorePropertiesLocator Found 0 core definitions underneath /Users/jenkins/workspace/Lucene-Solr-6.x-MacOSX/solr/build/solr-core/test/J0/temp/solr.cloud.CustomCollectionTest_379ED6FA5784D401-001/tempDir-001/node3/.
[junit4] 2> 2939717 INFO (jetty-launcher-2792-thread-2) [n:127.0.0.1:62120_solr ] o.a.s.c.CorePropertiesLocator Found 0 core definitions underneath /Users/jenkins/workspace/Lucene-Solr-6.x-MacOSX/solr/build/solr-core/test/J0/temp/solr.cloud.CustomCollectionTest_379ED6FA5784D401-001/tempDir-001/node2/.
[junit4] 2> 2942051 INFO (SUITE-CustomCollectionTest-seed#[379ED6FA5784D401]-worker) [ ] o.a.s.c.c.ZkStateReader Updated live nodes from ZooKeeper... (0) -> (4)
[junit4] 2> 2942053 INFO (SUITE-CustomCollectionTest-seed#[379ED6FA5784D401]-worker) [ ] o.a.s.c.s.i.ZkClientClusterStateProvider Cluster at 127.0.0.1:62116/solr ready
[junit4] 2> 2942146 INFO (TEST-CustomCollectionTest.testRouteFieldForHashRouter-seed#[379ED6FA5784D401]) [ ] o.a.s.SolrTestCaseJ4 ###Starting testRouteFieldForHashRouter
[junit4] 2> 2942149 INFO (TEST-CustomCollectionTest.testRouteFieldForHashRouter-seed#[379ED6FA5784D401]) [ ] o.a.s.c.c.ZkStateReader Updated live nodes from ZooKeeper... (0) -> (4)
[junit4] 2> 2942157 INFO (qtp1882507689-16116) [n:127.0.0.1:62119_solr ] o.a.s.h.a.CollectionsHandler Invoked Collection Action :create with params replicationFactor=2&collection.configName=conf&maxShardsPerNode=3&router.field=shard_s&name=routeFieldColl&action=CREATE&numShards=4&wt=javabin&version=2 and sendToOCPQueue=true
[junit4] 2> 2942160 INFO (OverseerThreadFactory-7490-thread-1-processing-n:127.0.0.1:62119_solr) [n:127.0.0.1:62119_solr ] o.a.s.c.CreateCollectionCmd Create collection routeFieldColl
[junit4] 2> 2942278 INFO (qtp1882507689-16121) [n:127.0.0.1:62119_solr ] o.a.s.h.a.CoreAdminOperation core create command qt=/admin/cores&collection.configName=conf&newCollection=true&name=routeFieldColl_shard1_replica1&action=CREATE&numShards=4&collection=routeFieldColl&shard=shard1&wt=javabin&version=2
[junit4] 2> 2942279 INFO (qtp1882507689-16120) [n:127.0.0.1:62119_solr ] o.a.s.h.a.CoreAdminOperation core create command qt=/admin/cores&collection.configName=conf&newCollection=true&name=routeFieldColl_shard3_replica1&action=CREATE&numShards=4&collection=routeFieldColl&shard=shard3&wt=javabin&version=2
[junit4] 2> 2942280 INFO (qtp1740123466-16101) [n:127.0.0.1:62118_solr ] o.a.s.h.a.CoreAdminOperation core create command qt=/admin/cores&collection.configName=conf&newCollection=true&name=routeFieldColl_shard2_replica1&action=CREATE&numShards=4&collection=routeFieldColl&shard=shard2&wt=javabin&version=2
[junit4] 2> 2942280 INFO (qtp1089583583-16092) [n:127.0.0.1:62120_solr ] o.a.s.h.a.CoreAdminOperation core create command qt=/admin/cores&collection.configName=conf&newCollection=true&name=routeFieldColl_shard3_replica2&action=CREATE&numShards=4&collection=routeFieldColl&shard=shard3&wt=javabin&version=2
[junit4] 2> 2942280 INFO (qtp1740123466-16102) [n:127.0.0.1:62118_solr ] o.a.s.h.a.CoreAdminOperation core create command qt=/admin/cores&collection.configName=conf&newCollection=true&name=routeFieldColl_shard4_replica1&action=CREATE&numShards=4&collection=routeFieldColl&shard=shard4&wt=javabin&version=2
[junit4] 2> 2942281 INFO (qtp1089583583-16093) [n:127.0.0.1:62120_solr ] o.a.s.h.a.CoreAdminOperation core create command qt=/admin/cores&collection.configName=conf&newCollection=true&name=routeFieldColl_shard1_replica2&action=CREATE&numShards=4&collection=routeFieldColl&shard=shard1&wt=javabin&version=2
[junit4] 2> 2942282 INFO (qtp1726225526-16089) [n:127.0.0.1:62124_solr ] o.a.s.h.a.CoreAdminOperation core create command qt=/admin/cores&collection.configName=conf&newCollection=true&name=routeFieldColl_shard4_replica2&action=CREATE&numShards=4&collection=routeFieldColl&shard=shard4&wt=javabin&version=2
[junit4] 2> 2942282 INFO (qtp1726225526-16109) [n:127.0.0.1:62124_solr ] o.a.s.h.a.CoreAdminOperation core create command qt=/admin/cores&collection.configName=conf&newCollection=true&name=routeFieldColl_shard2_replica2&action=CREATE&numShards=4&collection=routeFieldColl&shard=shard2&wt=javabin&version=2
[junit4] 2> 2942418 INFO (zkCallback-2812-thread-2-processing-n:127.0.0.1:62119_solr) [n:127.0.0.1:62119_solr ] o.a.s.c.c.ZkStateReader A cluster state change: [WatchedEvent state:SyncConnected type:NodeDataChanged path:/collections/routeFieldColl/state.json] for collection [routeFieldColl] has occurred - updating... (live nodes size: [4])
[junit4] 2> 2942418 INFO (zkCallback-2814-thread-1-processing-n:127.0.0.1:62120_solr) [n:127.0.0.1:62120_solr ] o.a.s.c.c.ZkStateReader A cluster state change: [WatchedEvent state:SyncConnected type:NodeDataChanged path:/collections/routeFieldColl/state.json] for collection [routeFieldColl] has occurred - updating... (live nodes size: [4])
[junit4] 2> 2942418 INFO (zkCallback-2811-thread-1-processing-n:127.0.0.1:62124_solr) [n:127.0.0.1:62124_solr ] o.a.s.c.c.ZkStateReader A cluster state change: [WatchedEvent state:SyncConnected type:NodeDataChanged path:/collections/routeFieldColl/state.json] for collection [routeFieldColl] has occurred - updating... (live nodes size: [4])
[junit4] 2> 2942418 INFO (zkCallback-2813-thread-1-processing-n:127.0.0.1:62118_solr) [n:127.0.0.1:62118_solr ] o.a.s.c.c.ZkStateReader A cluster state change: [WatchedEvent state:SyncConnected type:NodeDataChanged path:/collections/routeFieldColl/state.json] for collection [routeFieldColl] has occurred - updating... (live nodes size: [4])
[junit4] 2> 2943324 INFO (qtp1740123466-16101) [n:127.0.0.1:62118_solr c:routeFieldColl s:shard2 x:routeFieldColl_shard2_replica1] o.a.s.c.SolrConfig Using Lucene MatchVersion: 6.6.0
[junit4] 2> 2943324 INFO (qtp1882507689-16120) [n:127.0.0.1:62119_solr c:routeFieldColl s:shard3 x:routeFieldColl_shard3_replica1] o.a.s.c.SolrConfig Using Lucene MatchVersion: 6.6.0
[junit4] 2> 2943324 INFO (qtp1882507689-16121) [n:127.0.0.1:62119_solr c:routeFieldColl s:shard1 x:routeFieldColl_shard1_replica1] o.a.s.c.SolrConfig Using Lucene MatchVersion: 6.6.0
[junit4] 2> 2943340 INFO (qtp1089583583-16092) [n:127.0.0.1:62120_solr c:routeFieldColl s:shard3 x:routeFieldColl_shard3_replica2] o.a.s.c.SolrConfig Using Lucene MatchVersion: 6.6.0
[junit4] 2> 2943342 INFO (qtp1089583583-16093) [n:127.0.0.1:62120_solr c:routeFieldColl s:shard1 x:routeFieldColl_shard1_replica2] o.a.s.c.SolrConfig Using Lucene MatchVersion: 6.6.0
[junit4] 2> 2943347 INFO (qtp1726225526-16089) [n:127.0.0.1:62124_solr c:routeFieldColl s:shard4 x:routeFieldColl_shard4_replica2] o.a.s.c.SolrConfig Using Lucene MatchVersion: 6.6.0
[junit4] 2> 2943358 INFO (qtp1726225526-16109) [n:127.0.0.1:62124_solr c:routeFieldColl s:shard2 x:routeFieldColl_shard2_replica2] o.a.s.c.SolrConfig Using Lucene MatchVersion: 6.6.0
[junit4] 2> 2943358 INFO (qtp1740123466-16102) [n:127.0.0.1:62118_solr c:routeFieldColl s:shard4 x:routeFieldColl_shard4_replica1] o.a.s.c.SolrConfig Using Lucene MatchVersion: 6.6.0
[junit4] 2> 2943367 INFO (qtp1740123466-16101) [n:127.0.0.1:62118_solr c:routeFieldColl s:shard2 x:routeFieldColl_shard2_replica1] o.a.s.s.IndexSchema [routeFieldColl_shard2_replica1] Schema name=cloud-dynamic
[junit4] 2> 2943368 INFO (qtp1882507689-16121) [n:127.0.0.1:62119_solr c:routeFieldColl s:shard1 x:routeFieldColl_shard1_replica1] o.a.s.s.IndexSchema [routeFieldColl_shard1_replica1] Schema name=cloud-dynamic
[junit4] 2> 2943368 INFO (qtp1089583583-16092) [n:127.0.0.1:62120_solr c:routeFieldColl s:shard3 x:routeFieldColl_shard3_replica2] o.a.s.s.IndexSchema [routeFieldColl_shard3_replica2] Schema name=cloud-dynamic
[junit4] 2> 2943371 INFO (qtp1882507689-16120) [n:127.0.0.1:62119_solr c:routeFieldColl s:shard3 x:routeFieldColl_shard3_replica1] o.a.s.s.IndexSchema [routeFieldColl_shard3_replica1] Schema name=cloud-dynamic
[junit4] 2> 2943372 INFO (qtp1740123466-16102) [n:127.0.0.1:62118_solr c:routeFieldColl s:shard4 x:routeFieldColl_shard4_replica1] o.a.s.s.IndexSchema [routeFieldColl_shard4_replica1] Schema name=cloud-dynamic
[junit4] 2> 2943421 WARN (qtp1882507689-16121) [n:127.0.0.1:62119_solr c:routeFieldColl s:shard1 x:routeFieldColl_shard1_replica1] o.a.s.s.IndexSchema [routeFieldColl_shard1_replica1] default search field in schema is text. WARNING: Deprecated, please use 'df' on request instead.
[junit4] 2> 2943422 INFO (qtp1882507689-16121) [n:127.0.0.1:62119_solr c:routeFieldColl s:shard1 x:routeFieldColl_shard1_replica1] o.a.s.s.IndexSchema Loaded schema cloud-dynamic/1.6 with uniqueid field id
[junit4] 2> 2943422 INFO (qtp1882507689-16121) [n:127.0.0.1:62119_solr c:routeFieldColl s:shard1 x:routeFieldColl_shard1_replica1] o.a.s.c.CoreContainer Creating SolrCore 'routeFieldColl_shard1_replica1' using configuration from collection routeFieldColl, trusted=true
[junit4] 2> 2943422 INFO (qtp1882507689-16121) [n:127.0.0.1:62119_solr c:routeFieldColl s:shard1 x:routeFieldColl_shard1_replica1] o.a.s.c.SolrCore solr.RecoveryStrategy.Builder
[junit4] 2> 2943422 INFO (qtp1882507689-16121) [n:127.0.0.1:62119_solr c:routeFieldColl s:shard1 x:routeFieldColl_shard1_replica1] o.a.s.c.SolrCore [[routeFieldColl_shard1_replica1] ] Opening new SolrCore at [/Users/jenkins/workspace/Lucene-Solr-6.x-MacOSX/solr/build/solr-core/test/J0/temp/solr.cloud.CustomCollectionTest_379ED6FA5784D401-001/tempDir-001/node4/routeFieldColl_shard1_replica1], dataDir=[/Users/jenkins/workspace/Lucene-Solr-6.x-MacOSX/solr/build/solr-core/test/J0/temp/solr.cloud.CustomCollectionTest_379ED6FA5784D401-001/tempDir-001/node4/./routeFieldColl_shard1_replica1/data/]
[junit4] 2> 2943422 INFO (qtp1726225526-16089) [n:127.0.0.1:62124_solr c:routeFieldColl s:shard4 x:routeFieldColl_shard4_replica2] o.a.s.s.IndexSchema [routeFieldColl_shard4_replica2] Schema name=cloud-dynamic
[junit4] 2> 2943425 WARN (qtp1740123466-16102) [n:127.0.0.1:62118_solr c:routeFieldColl s:shard4 x:routeFieldColl_shard4_replica1] o.a.s.s.IndexSchema [routeFieldColl_shard4_replica1] default search field in schema is text. WARNING: Deprecated, please use 'df' on request instead.
[junit4] 2> 2943425 INFO (qtp1726225526-16109) [n:127.0.0.1:62124_solr c:routeFieldColl s:shard2 x:routeFieldColl_shard2_replica2] o.a.s.s.IndexSchema [routeFieldColl_shard2_replica2] Schema name=cloud-dynamic
[junit4] 2> 2943427 INFO (qtp1740123466-16102) [n:127.0.0.1:62118_solr c:routeFieldColl s:shard4 x:routeFieldColl_shard4_replica1] o.a.s.s.IndexSchema Loaded schema cloud-dynamic/1.6 with uniqueid field id
[junit4] 2> 2943427 INFO (qtp1740123466-16102) [n:127.0.0.1:62118_solr c:routeFieldColl s:shard4 x:routeFieldColl_shard4_replica1] o.a.s.c.CoreContainer Creating SolrCore 'routeFieldColl_shard4_replica1' using configuration from collection routeFieldColl, trusted=true
[junit4] 2> 2943428 INFO (qtp1740123466-16102) [n:127.0.0.1:62118_solr c:routeFieldColl s:shard4 x:routeFieldColl_shard4_replica1] o.a.s.c.SolrCore solr.RecoveryStrategy.Builder
[junit4] 2> 2943428 INFO (qtp1740123466-16102) [n:127.0.0.1:62118_solr c:routeFieldColl s:shard4 x:routeFieldColl_shard4_replica1] o.a.s.c.SolrCore [[routeFieldColl_shard4_replica1] ] Opening new SolrCore at [/Users/jenkins/workspace/Lucene-Solr-6.x-MacOSX/solr/build/solr-core/test/J0/temp/solr.cloud.CustomCollectionTest_379ED6FA5784D401-001/tempDir-001/node3/routeFieldColl_shard4_replica1], dataDir=[/Users/jenkins/workspace/Lucene-Solr-6.x-MacOSX/solr/build/solr-core/test/J0/temp/solr.cloud.CustomCollectionTest_379ED6FA5784D401-001/tempDir-001/node3/./routeFieldColl_shard4_replica1/data/]
[junit4] 2> 2943431 WARN (qtp1089583583-16092) [n:127.0.0.1:62120_solr c:routeFieldColl s:shard3 x:routeFieldColl_shard3_replica2] o.a.s.s.IndexSchema [routeFieldColl_shard3_replica2] default search field in schema is text. WARNING: Deprecated, please use 'df' on request instead.
[junit4] 2> 2943431 INFO (qtp1089583583-16092) [n:127.0.0.1:62120_solr c:routeFieldColl s:shard3 x:routeFieldColl_shard3_replica2] o.a.s.s.IndexSchema Loaded schema cloud-dynamic/1.6 with uniqueid field id
[junit4] 2> 2943431 INFO (qtp1089583583-16092) [n:127.0.0.1:62120_solr c:routeFieldColl s:shard3 x:routeFieldColl_shard3_replica2] o.a.s.c.CoreContainer Creating SolrCore 'routeFieldColl_shard3_replica2' using configuration from collection routeFieldColl, trusted=true
[junit4] 2> 2943432 INFO (qtp1089583583-16092) [n:127.0.0.1:62120_solr c:routeFieldColl s:shard3 x:routeFieldColl_shard3_replica2] o.a.s.c.SolrCore solr.RecoveryStrategy.Builder
[junit4] 2> 2943432 INFO (qtp1089583583-16092) [n:127.0.0.1:62120_solr c:routeFieldColl s:shard3 x:routeFieldColl_shard3_replica2] o.a.s.c.SolrCore [[routeFieldColl_shard3_replica2] ] Opening new SolrCore at [/Users/jenkins/workspace/Lucene-Solr-6.x-MacOSX/solr/build/solr-core/test/J0/temp/solr.cloud.CustomCollectionTest_379ED6FA5784D401-001/tempDir-001/node2/routeFieldColl_shard3_replica2], dataDir=[/Users/jenkins/workspace/Lucene-Solr-6.x-MacOSX/solr/build/solr-core/test/J0/temp/solr.cloud.CustomCollectionTest_379ED6FA5784D401-001/tempDir-001/node2/./routeFieldColl_shard3_replica2/data/]
[junit4] 2> 2943454 INFO (qtp1089583583-16093) [n:127.0.0.1:62120_solr c:routeFieldColl s:shard1 x:routeFieldColl_shard1_replica2] o.a.s.s.IndexSchema [routeFieldColl_shard1_replica2] Schema name=cloud-dynamic
[junit4] 2> 2943456 WARN (qtp1882507689-16120) [n:127.0.0.1:62119_solr c:routeFieldColl s:shard3 x:routeFieldColl_shard3_replica1] o.a.s.s.IndexSchema [routeFieldColl_shard3_replica1] default search field in schema is text. WARNING: Deprecated, please use 'df' on request instead.
[junit4] 2> 2943457 INFO (qtp1882507689-16120) [n:127.0.0.1:62119_solr c:routeFieldColl s:shard3 x:routeFieldColl_shard3_replica1] o.a.s.s.IndexSchema Loaded schema cloud-dynamic/1.6 with uniqueid field id
[junit4] 2> 2943458 INFO (qtp1882507689-16120) [n:127.0.0.1:62119_solr c:routeFieldColl s:shard3 x:routeFieldColl_shard3_replica1] o.a.s.c.CoreContainer Creating SolrCore 'routeFieldColl_shard3_replica1' using configuration from collection routeFieldColl, trusted=true
[junit4] 2> 2943458 INFO (qtp1882507689-16120) [n:127.0.0.1:62119_solr c:routeFieldColl s:shard3 x:routeFieldColl_shard3_replica1] o.a.s.c.SolrCore solr.RecoveryStrategy.Builder
[junit4] 2> 2943458 INFO (qtp1882507689-16120) [n:127.0.0.1:62119_solr c:routeFieldColl s:shard3 x:routeFieldColl_shard3_replica1] o.a.s.c.SolrCore [[routeFieldColl_shard3_replica1] ] Opening new SolrCore at [/Users/jenkins/workspace/Lucene-Solr-6.x-MacOSX/solr/build/solr-core/test/J0/temp/solr.cloud.CustomCollectionTest_379ED6FA5784D401-001/tempDir-001/node4/routeFieldColl_shard3_replica1], dataDir=[/Users/jenkins/workspace/Lucene-Solr-6.x-MacOSX/solr/build/solr-core/test/J0/temp/solr.cloud.CustomCollectionTest_379ED6FA5784D401-001/tempDir-001/node4/./routeFieldColl_shard3_replica1/data/]
[junit4] 2> 2943479 WARN (qtp1726225526-16109) [n:127.0.0.1:62124_solr c:routeFieldColl s:shard2 x:routeFieldColl_shard2_replica2] o.a.s.s.IndexSchema [routeFieldColl_shard2_replica2] default search field in schema is text. WARNING: Deprecated, please use 'df' on request instead.
[junit4] 2> 2943480 INFO (qtp1726225526-16109) [n:127.0.0.1:62124_solr c:routeFieldColl s:shard2 x:routeFieldColl_shard2_replica2] o.a.s.s.IndexSchema Loaded schema cloud-dynamic/1.6 with uniqueid field id
[junit4] 2> 2943480 INFO (qtp1726225526-16109) [n:127.0.0.1:62124_solr c:routeFieldColl s:shard2 x:routeFieldColl_shard2_replica2] o.a.s.c.CoreContainer Creating SolrCore 'routeFieldColl_shard2_replica2' using configuration from collection routeFieldColl, trusted=true
[junit4] 2> 2943481 INFO (qtp1726225526-16109) [n:127.0.0.1:62124_solr c:routeFieldColl s:shard2 x:routeFieldColl_shard2_replica2] o.a.s.c.SolrCore solr.RecoveryStrategy.Builder
[junit4] 2> 2943481 INFO (qtp1726225526-16109) [n:127.0.0.1:62124_solr c:routeFieldColl s:shard2 x:routeFieldColl_shard2_replica2] o.a.s.c.SolrCore [[routeFieldColl_shard2_replica2] ] Opening new SolrCore at [/Users/jenkins/workspace/Lucene-Solr-6.x-MacOSX/solr/build/solr-core/test/J0/temp/solr.cloud.CustomCollectionTest_379ED6FA5784D401-001/tempDir-001/node1/routeFieldColl_shard2_replica2], dataDir=[/Users/jenkins/workspace/Lucene-Solr-6.x-MacOSX/solr/build/solr-core/test/J0/temp/solr.cloud.CustomCollectionTest_379ED6FA5784D401-001/tempDir-001/node1/./routeFieldColl_shard2_replica2/data/]
[junit4] 2> 2943484 WARN (qtp1089583583-16093) [n:127.0.0.1:62120_solr c:routeFieldColl s:shard1 x:routeFieldColl_shard1_replica2] o.a.s.s.IndexSchema [routeFieldColl_shard1_replica2] default search field in schema is text. WARNING: Deprecated, please use 'df' on request instead.
[junit4] 2> 2943485 INFO (qtp1089583583-16093) [n:127.0.0.1:62120_solr c:routeFieldColl s:shard1 x:routeFieldColl_shard1_replica2] o.a.s.s.IndexSchema Loaded schema cloud-dynamic/1.6 with uniqueid field id
[junit4] 2> 2943485 WARN (qtp1726225526-16089) [n:127.0.0.1:62124_solr c:routeFieldColl s:shard4 x:routeFieldColl_shard4_replica2] o.a.s.s.IndexSchema [routeFieldColl_shard4_replica2] default search field in schema is text. WARNING: Deprecated, please use 'df' on request instead.
[junit4] 2> 2943485 INFO (qtp1089583583-16093) [n:127.0.0.1:62120_solr c:routeFieldColl s:shard1 x:routeFieldColl_shard1_replica2] o.a.s.c.CoreContainer Creating SolrCore 'routeFieldColl_shard1_replica2' using configuration from collection routeFieldColl, trusted=true
[junit4] 2> 2943485 INFO (qtp1089583583-16093) [n:127.0.0.1:62120_solr c:routeFieldColl s:shard1 x:routeFieldColl_shard1_replica2] o.a.s.c.SolrCore solr.RecoveryStrategy.Builder
[junit4] 2> 2943485 INFO (qtp1089583583-16093) [n:127.0.0.1:62120_solr c:routeFieldColl s:shard1 x:routeFieldColl_shard1_replica2] o.a.s.c.SolrCore [[routeFieldColl_shard1_replica2] ] Opening new SolrCore at [/Users/jenkins/workspace/Lucene-Solr-6.x-MacOSX/solr/build/solr-core/test/J0/temp/solr.cloud.CustomCollectionTest_379ED6FA5784D401-001/tempDir-001/node2/routeFieldColl_shard1_replica2], dataDir=[/Users/jenkins/workspace/Lucene-Solr-6.x-MacOSX/solr/build/solr-core/test/J0/temp/solr.cloud.CustomCollectionTest_379ED6FA5784D401-001/tempDir-001/node2/./routeFieldColl_shard1_replica2/data/]
[junit4] 2> 2943485 INFO (qtp1726225526-16089) [n:127.0.0.1:62124_solr c:routeFieldColl s:shard4 x:routeFieldColl_shard4_replica2] o.a.s.s.IndexSchema Loaded schema cloud-dynamic/1.6 with uniqueid field id
[junit4] 2> 2943485 INFO (qtp1726225526-16089) [n:127.0.0.1:62124_solr c:routeFieldColl s:shard4 x:routeFieldColl_shard4_replica2] o.a.s.c.CoreContainer Creating SolrCore 'routeFieldColl_shard4_replica2' using configuration from collection routeFieldColl, trusted=true
[junit4] 2> 2943486 INFO (qtp1726225526-16089) [n:127.0.0.1:62124_solr c:routeFieldColl s:shard4 x:routeFieldColl_shard4_replica2] o.a.s.c.SolrCore solr.RecoveryStrategy.Builder
[junit4] 2> 2943486 INFO (qtp1726225526-16089) [n:127.0.0.1:62124_solr c:routeFieldColl s:shard4 x:routeFieldColl_shard4_replica2] o.a.s.c.SolrCore [[routeFieldColl_shard4_replica2] ] Opening new SolrCore at [/Users/jenkins/workspace/Lucene-Solr-6.x-MacOSX/solr/build/solr-core/test/J0/temp/solr.cloud.CustomCollectionTest_379ED6FA5784D401-001/tempDir-001/node1/routeFieldColl_shard4_replica2], dataDir=[/Users/jenkins/workspace/Lucene-Solr-6.x-MacOSX/solr/build/solr-core/test/J0/temp/solr.cloud.CustomCollectionTest_379ED6FA5784D401-001/tempDir-001/node1/./routeFieldColl_shard4_replica2/data/]
[junit4] 2> 2943486 WARN (qtp1740123466-16101) [n:127.0.0.1:62118_solr c:routeFieldColl s:shard2 x:routeFieldColl_shard2_replica1] o.a.s.s.IndexSchema [routeFieldColl_shard2_replica1] default search field in schema is text. WARNING: Deprecated, please use 'df' on request instead.
[junit4] 2> 2943487 INFO (qtp1740123466-16101) [n:127.0.0.1:62118_solr c:routeFieldColl s:shard2 x:routeFieldColl_shard2_replica1] o.a.s.s.IndexSchema Loaded schema cloud-dynamic/1.6 with uniqueid field id
[junit4] 2> 2943487 INFO (qtp1740123466-16101) [n:127.0.0.1:62118_solr c:routeFieldColl s:shard2 x:routeFieldColl_shard2_replica1] o.a.s.c.CoreContainer Creating SolrCore 'routeFieldColl_shard2_replica1' using configuration from collection routeFieldColl, trusted=true
[junit4] 2> 2943487 INFO (qtp1740123466-16101) [n:127.0.0.1:62118_solr c:routeFieldColl s:shard2 x:routeFieldColl_shard2_replica1] o.a.s.c.SolrCore solr.RecoveryStrategy.Builder
[junit4] 2> 2943487 INFO (qtp1740123466-16101) [n:127.0.0.1:62118_solr c:routeFieldColl s:shard2 x:routeFieldColl_shard2_replica1] o.a.s.c.SolrCore [[routeFieldColl_shard2_replica1] ] Opening new SolrCore at [/Users/jenkins/workspace/Lucene-Solr-6.x-MacOSX/solr/build/solr-core/test/J0/temp/solr.cloud.CustomCollectionTest_379ED6FA5784D401-001/tempDir-001/node3/routeFieldColl_shard2_replica1], dataDir=[/Users/jenkins/workspace/Lucene-Solr-6.x-MacOSX/solr/build/solr-core/test/J0/temp/solr.cloud.CustomCollectionTest_379ED6FA5784D401-001/tempDir-001/node3/./routeFieldColl_shard2_replica1/data/]
[junit4] 2> 2943640 INFO (qtp1089583583-16093) [n:127.0.0.1:62120_solr c:routeFieldColl s:shard1 x:routeFieldColl_shard1_replica2] o.a.s.u.UpdateHandler Using UpdateLog implementation: org.apache.solr.update.UpdateLog
[junit4] 2> 2943641 INFO (qtp1089583583-16093) [n:127.0.0.1:62120_solr c:routeFieldColl s:shard1 x:routeFieldColl_shard1_replica2] o.a.s.u.UpdateLog Initializing UpdateLog: dataDir=null defaultSyncLevel=FLUSH numRecordsToKeep=100 maxNumLogsToKeep=10 numVersionBuckets=65536
[junit4] 2> 2943642 INFO (qtp1089583583-16093) [n:127.0.0.1:62120_solr c:routeFieldColl s:shard1 x:routeFieldColl_shard1_replica2] o.a.s.u.CommitTracker Hard AutoCommit: disabled
[junit4] 2> 2943642 INFO (qtp1089583583-16093) [n:127.0.0.1:62120_solr c:routeFieldColl s:shard1 x:routeFieldColl_shard1_replica2] o.a.s.u.CommitTracker Soft AutoCommit: disabled
[junit4] 2> 2943644 INFO (qtp1089583583-16093) [n:127.0.0.1:62120_solr c:routeFieldColl s:shard1 x:routeFieldColl_shard1_replica2] o.a.s.s.SolrIndexSearcher Opening [Searcher@3ca3a686[routeFieldColl_shard1_replica2] main]
[junit4] 2> 2943644 INFO (qtp1726225526-16109) [n:127.0.0.1:62124_solr c:routeFieldColl s:shard2 x:routeFieldColl_shard2_replica2] o.a.s.u.UpdateHandler Using UpdateLog implementation: org.apache.solr.update.UpdateLog
[junit4] 2> 2943644 INFO (qtp1726225526-16109) [n:127.0.0.1:62124_solr c:routeFieldColl s:shard2 x:routeFieldColl_shard2_replica2] o.a.s.u.UpdateLog Initializing UpdateLog: dataDir=null defaultSyncLevel=FLUSH numRecordsToKeep=100 maxNumLogsToKeep=10 numVersionBuckets=65536
[junit4] 2> 2943646 INFO (qtp1726225526-16109) [n:127.0.0.1:62124_solr c:routeFieldColl s:shard2 x:routeFieldColl_shard2_replica2] o.a.s.u.CommitTracker Hard AutoCommit: disabled
[junit4] 2> 2943647 INFO (qtp1726225526-16109) [n:127.0.0.1:62124_solr c:routeFieldColl s:shard2 x:routeFieldColl_shard2_replica2] o.a.s.u.CommitTracker Soft AutoCommit: disabled
[junit4] 2> 2943650 INFO (qtp1726225526-16089) [n:127.0.0.1:62124_solr c:routeFieldColl s:shard4 x:routeFieldColl_shard4_replica2] o.a.s.u.UpdateHandler Using UpdateLog implementation: org.apache.solr.update.UpdateLog
[junit4] 2> 2943650 INFO (qtp1726225526-16089) [n:127.0.0.1:62124_solr c:routeFieldColl s:shard4 x:routeFieldColl_shard4_replica2] o.a.s.u.UpdateLog Initializing UpdateLog: dataDir=null defaultSyncLevel=FLUSH numRecordsToKeep=100 maxNumLogsToKeep=10 numVersionBuckets=65536
[junit4] 2> 2943652 INFO (qtp1726225526-16089) [n:127.0.0.1:62124_solr c:routeFieldColl s:shard4 x:routeFieldColl_shard4_replica2] o.a.s.u.CommitTracker Hard AutoCommit: disabled
[junit4] 2> 2943652 INFO (qtp1726225526-16089) [n:127.0.0.1:62124_solr c:routeFieldColl s:shard4 x:routeFieldColl_shard4_replica2] o.a.s.u.CommitTracker Soft AutoCommit: disabled
[junit4] 2> 2943658 INFO (qtp1726225526-16109) [n:127.0.0.1:62124_solr c:routeFieldColl s:shard2 x:routeFieldColl_shard2_replica2] o.a.s.s.SolrIndexSearcher Opening [Searcher@c31e1ee[routeFieldColl_shard2_replica2] main]
[junit4] 2> 2943659 INFO (qtp1726225526-16089) [n:127.0.0.1:62124_solr c:routeFieldColl s:shard4 x:routeFieldColl_shard4_replica2] o.a.s.s.SolrIndexSearcher Opening [Searcher@666447d3[routeFieldColl_shard4_replica2] main]
[junit4] 2> 2943659 INFO (qtp1740123466-16101) [n:127.0.0.1:62118_solr c:routeFieldColl s:shard2 x:routeFieldColl_shard2_replica1] o.a.s.u.UpdateHandler Using UpdateLog implementation: org.apache.solr.update.UpdateLog
[junit4] 2> 2943659 INFO (qtp1882507689-16120) [n:127.0.0.1:62119_solr c:routeFieldColl s:shard3 x:routeFieldColl_shard3_replica1] o.a.s.u.UpdateHandler Using UpdateLog implementation: org.apache.solr.update.UpdateLog
[junit4] 2> 2943659 INFO (qtp1740123466-16101) [n:127.0.0.1:62118_solr c:routeFieldColl s:shard2 x:routeFieldColl_shard2_replica1] o.a.s.u.UpdateLog Initializing UpdateLog: dataDir=null defaultSyncLevel=FLUSH numRecordsToKeep=100 maxNumLogsToKeep=10 numVersionBuckets=65536
[junit4] 2> 2943660 INFO (qtp1882507689-16120) [n:127.0.0.1:62119_solr c:routeFieldColl s:shard3 x:routeFieldColl_shard3_replica1] o.a.s.u.UpdateLog Initializing UpdateLog: dataDir=null defaultSyncLevel=FLUSH numRecordsToKeep=100 maxNumLogsToKeep=10 numVersionBuckets=65536
[junit4] 2> 2943662 INFO (qtp1740123466-16101) [n:127.0.0.1:62118_solr c:routeFieldColl s:shard2 x:routeFieldColl_shard2_replica1] o.a.s.u.CommitTracker Hard AutoCommit: disabled
[junit4] 2> 2943662 INFO (qtp1882507689-16120) [n:127.0.0.1:62119_solr c:routeFieldColl s:shard3 x:routeFieldColl_shard3_replica1] o.a.s.u.CommitTracker Hard AutoCommit: disabled
[junit4] 2> 2943662 INFO (qtp1740123466-16101) [n:127.0.0.1:62118_solr c:routeFieldColl s:shard2 x:routeFieldColl_shard2_replica1] o.a.s.u.CommitTracker Soft AutoCommit: disabled
[junit4] 2> 2943662 INFO (qtp1882507689-16120) [n:127.0.0.1:62119_solr c:routeFieldColl s:shard3 x:routeFieldColl_shard3_replica1] o.a.s.u.CommitTracker Soft AutoCommit: disabled
[junit4] 2> 2943665 INFO (qtp1726225526-16089) [n:127.0.0.1:62124_solr c:routeFieldColl s:shard4 x:routeFieldColl_shard4_replica2] o.a.s.r.ManagedResourceStorage Configured ZooKeeperStorageIO with znodeBase: /configs/conf
[junit4] 2> 2943665 INFO (qtp1726225526-16089) [n:127.0.0.1:62124_solr c:routeFieldColl s:shard4 x:routeFieldColl_shard4_replica2] o.a.s.r.ManagedResourceStorage Loaded null at path _rest_managed.json using ZooKeeperStorageIO:path=/configs/conf
[junit4] 2> 2943665 INFO (qtp1726225526-16089) [n:127.0.0.1:62124_solr c:routeFieldColl s:shard4 x:routeFieldColl_shard4_replica2] o.a.s.h.ReplicationHandler Commits will be reserved for 10000
[junit4] 2> 2943666 INFO (qtp1726225526-16089) [n:127.0.0.1:62124_solr c:routeFieldColl s:shard4 x:routeFieldColl_shard4_replica2] o.a.s.u.UpdateLog Could not find max version in index or recent updates, using new clock 1563645289582034944
[junit4] 2> 2943666 INFO (searcherExecutor-7505-thread-1-processing-n:127.0.0.1:62124_solr x:routeFieldColl_shard4_replica2 s:shard4 c:routeFieldColl) [n:127.0.0.1:62124_solr c:routeFieldColl s:shard4 x:routeFieldColl_shard4_replica2] o.a.s.c.SolrCore [routeFieldColl_shard4_replica2] Registered new searcher Searcher@666447d3[routeFieldColl_shard4_replica2] main{ExitableDirectoryReader(UninvertingDirectoryReader())}
[junit4] 2> 2943675 INFO (qtp1740123466-16101) [n:127.0.0.1:62118_solr c:routeFieldColl s:shard2 x:routeFieldColl_shard2_replica1] o.a.s.s.SolrIndexSearcher Opening [Searcher@bc7f4be[routeFieldColl_shard2_replica1] main]
[junit4] 2> 2943675 INFO (qtp1882507689-16120) [n:127.0.0.1:62119_solr c:routeFieldColl s:shard3 x:routeFieldColl_shard3_replica1] o.a.s.s.SolrIndexSearcher Opening [Searcher@4927cc08[routeFieldColl_shard3_replica1] main]
[junit4] 2> 2943676 INFO (qtp1726225526-16089) [n:127.0.0.1:62124_solr c:routeFieldColl s:shard4 x:routeFieldColl_shard4_replica2] o.a.s.c.ShardLeaderElectionContext Waiting until we see more replicas up for shard shard4: total=2 found=1 timeoutin=9999ms
[junit4] 2> 2943686 INFO (qtp1089583583-16092) [n:127.0.0.1:62120_solr c:routeFieldColl s:shard3 x:routeFieldColl_shard3_replica2] o.a.s.u.UpdateHandler Using UpdateLog implementation: org.apache.solr.update.UpdateLog
[junit4] 2> 2943686 INFO (qtp1089583583-16092) [n:127.0.0.1:62120_solr c:routeFieldColl s:shard3 x:routeFieldColl_shard3_replica2] o.a.s.u.UpdateLog Initializing UpdateLog: dataDir=null defaultSyncLevel=FLUSH numRecordsToKeep=100 maxNumLogsToKeep=10 numVersionBuckets=65536
[junit4] 2> 2943686 INFO (qtp1882507689-16121) [n:127.0.0.1:62119_solr c:routeFieldColl s:shard1 x:routeFieldColl_shard1_replica1] o.a.s.u.UpdateHandler Using UpdateLog implementation: org.apache.solr.update.UpdateLog
[junit4] 2> 2943687 INFO (qtp1882507689-16121) [n:127.0.0.1:62119_solr c:routeFieldColl s:shard1 x:routeFieldColl_shard1_replica1] o.a.s.u.UpdateLog Initializing UpdateLog: dataDir=null defaultSyncLevel=FLUSH numRecordsToKeep=100 maxNumLogsToKeep=10 numVersionBuckets=65536
[junit4] 2> 2943688 INFO (qtp1089583583-16092) [n:127.0.0.1:62120_solr c:routeFieldColl s:shard3 x:routeFieldColl_shard3_replica2] o.a.s.u.CommitTracker Hard AutoCommit: disabled
[junit4] 2> 2943688 INFO (qtp1089583583-16092) [n:127.0.0.1:62120_solr c:routeFieldColl s:shard3 x:routeFieldColl_shard3_replica2] o.a.s.u.CommitTracker Soft AutoCommit: disabled
[junit4] 2> 2943690 INFO (qtp1740123466-16101) [n:127.0.0.1:62118_solr c:routeFieldColl s:shard2 x:routeFieldColl_shard2_replica1] o.a.s.r.ManagedResourceStorage Configured ZooKeeperStorageIO with znodeBase: /configs/conf
[junit4] 2> 2943691 INFO (qtp1882507689-16120) [n:127.0.0.1:62119_solr c:routeFieldColl s:shard3 x:routeFieldColl_shard3_replica1] o.a.s.r.ManagedResourceStorage Configured ZooKeeperStorageIO with znodeBase: /configs/conf
[junit4] 2> 2943691 INFO (qtp1882507689-16121) [n:127.0.0.1:62119_solr c:routeFieldColl s:shard1 x:routeFieldColl_shard1_replica1] o.a.s.u.CommitTracker Hard AutoCommit: disabled
[junit4] 2> 2943691 INFO (qtp1882507689-16121) [n:127.0.0.1:62119_solr c:routeFieldColl s:shard1 x:routeFieldColl_shard1_replica1] o.a.s.u.CommitTracker Soft AutoCommit: disabled
[junit4] 2> 2943692 INFO (qtp1882507689-16120) [n:127.0.0.1:62119_solr c:routeFieldColl s:shard3 x:routeFieldColl_shard3_replica1] o.a.s.r.ManagedResourceStorage Loaded null at path _rest_managed.json using ZooKeeperStorageIO:path=/configs/conf
[junit4] 2> 2943692 INFO (qtp1882507689-16120) [n:127.0.0.1:62119_solr c:routeFieldColl s:shard3 x:routeFieldColl_shard3_replica1] o.a.s.h.ReplicationHandler Commits will be reserved for 10000
[junit4] 2> 2943692 INFO (qtp1740123466-16101) [n:127.0.0.1:62118_solr c:routeFieldColl s:shard2 x:routeFieldColl_shard2_replica1] o.a.s.r.ManagedResourceStorage Loaded null at path _rest_managed.json using ZooKeeperStorageIO:path=/configs/conf
[junit4] 2> 2943692 INFO (qtp1740123466-16101) [n:127.0.0.1:62118_solr c:routeFieldColl s:shard2 x:routeFieldColl_shard2_replica1] o.a.s.h.ReplicationHandler Commits will be reserved for 10000
[junit4] 2> 2943692 INFO (searcherExecutor-7502-thread-1-processing-n:127.0.0.1:62119_solr x:routeFieldColl_shard3_replica1 s:shard3 c:routeFieldColl) [n:127.0.0.1:62119_solr c:routeFieldColl s:shard3 x:routeFieldColl_shard3_replica1] o.a.s.c.SolrCore [routeFieldColl_shard3_replica1] Registered new searcher Searcher@4927cc08[routeFieldColl_shard3_replica1] main{ExitableDirectoryReader(UninvertingDirectoryReader())}
[junit4] 2> 2943692 INFO (searcherExecutor-7506-thread-1-processing-n:127.0.0.1:62118_solr x:routeFieldColl_shard2_replica1 s:shard2 c:routeFieldColl) [n:127.0.0.1:62118_solr c:routeFieldColl s:shard2 x:routeFieldColl_shard2_replica1] o.a.s.c.SolrCore [routeFieldColl_shard2_replica1] Registered new searcher Searcher@bc7f4be[routeFieldColl_shard2_replica1] main{ExitableDirectoryReader(UninvertingDirectoryReader())}
[junit4] 2> 2943692 INFO (qtp1740123466-16101) [n:127.0.0.1:62118_solr c:routeFieldColl s:shard2 x:routeFieldColl_shard2_replica1] o.a.s.u.UpdateLog Could not find max version in index or recent updates, using new clock 1563645289609297920
[junit4] 2> 2943692 INFO (qtp1882507689-16120) [n:127.0.0.1:62119_solr c:routeFieldColl s:shard3 x:routeFieldColl_shard3_replica1] o.a.s.u.UpdateLog Could not find max version in index or recent updates, using new clock 1563645289609297920
[junit4] 2> 2943698 INFO (qtp1740123466-16102) [n:127.0.0.1:62118_solr c:routeFieldColl s:shard4 x:routeFieldColl_shard4_replica1] o.a.s.u.UpdateHandler Using UpdateLog implementation: org.apache.solr.update.UpdateLog
[junit4] 2> 2943700 INFO (qtp1740123466-16102) [n:127.0.0.1:62118_solr c:routeFieldColl s:shard4 x:routeFieldColl_shard4_replica1] o.a.s.u.UpdateLog Initializing UpdateLog: dataDir=null defaultSyncLevel=FLUSH numRecordsToKeep=100 maxNumLogsToKeep=10 numVersionBuckets=65536
[junit4] 2> 2943702 INFO (qtp1740123466-16101) [n:127.0.0.1:62118_solr c:routeFieldColl s:shard2 x:routeFieldColl_shard2_replica1] o.a.s.c.ShardLeaderElectionContext Waiting until we see more replicas up for shard shard2: total=2 found=1 timeoutin=9999ms
[junit4] 2> 2943703 INFO (qtp1882507689-16121) [n:127.0.0.1:62119_solr c:routeFieldColl s:shard1 x:routeFieldColl_shard1_replica1] o.a.s.s.SolrIndexSearcher Opening [Searcher@167f7399[routeFieldColl_shard1_replica1] main]
[junit4] 2> 2943705 INFO (qtp1882507689-16121) [n:127.0.0.1:62119_solr c:routeFieldColl s:shard1 x:routeFieldColl_shard1_replica1] o.a.s.r.ManagedResourceStorage Configured ZooKeeperStorageIO with znodeBase: /configs/conf
[junit4] 2> 2943706 INFO (qtp1882507689-16120) [n:127.0.0.1:62119_solr c:routeFieldColl s:shard3 x:routeFieldColl_shard3_replica1] o.a.s.c.ShardLeaderElectionContext Waiting until we see more replicas up for shard shard3: total=2 found=1 timeoutin=9999ms
[junit4] 2> 2943706 INFO (qtp1882507689-16121) [n:127.0.0.1:62119_solr c:routeFieldColl s:shard1 x:routeFieldColl_shard1_replica1] o.a.s.r.ManagedResourceStorage Loaded null at path _rest_managed.json using ZooKeeperStorageIO:path=/configs/conf
[junit4] 2> 2943706 INFO (qtp1882507689-16121) [n:127.0.0.1:62119_solr c:routeFieldColl s:shard1 x:routeFieldColl_shard1_replica1] o.a.s.h.ReplicationHandler Commits will be reserved for 10000
[junit4] 2> 2943707 INFO (searcherExecutor-7499-thread-1-processing-n:127.0.0.1:62119_solr x:routeFieldColl_shard1_replica1 s:shard1 c:routeFieldColl) [n:127.0.0.1:62119_solr c:routeFieldColl s:shard1 x:routeFieldColl_shard1_replica1] o.a.s.c.SolrCore [routeFieldColl_shard1_replica1] Registered new searcher Searcher@167f7399[routeFieldColl_shard1_replica1] main{ExitableDirectoryReader(UninvertingDirectoryReader())}
[junit4] 2> 2943707 INFO (qtp1882507689-16121) [n:127.0.0.1:62119_solr c:routeFieldColl s:shard1 x:routeFieldColl_shard1_replica1] o.a.s.u.UpdateLog Could not find max version in index or recent updates, using new clock 1563645289625026560
[junit4] 2> 2943709 INFO (qtp1740123466-16102) [n:127.0.0.1:62118_solr c:routeFieldColl s:shard4 x:routeFieldColl_shard4_replica1] o.a.s.u.CommitTracker Hard AutoCommit: disabled
[junit4] 2> 2943709 INFO (qtp1740123466-16102) [n:127.0.0.1:62118_solr c:routeFieldColl s:shard4 x:routeFieldColl_shard4_replica1] o.a.s.u.CommitTracker Soft AutoCommit: disabled
[junit4] 2> 2943709 INFO (qtp1726225526-16109) [n:127.0.0.1:62124_solr c:routeFieldColl s:shard2 x:routeFieldColl_shard2_replica2] o.a.s.r.ManagedResourceStorage Configured ZooKeeperStorageIO with znodeBase: /configs/conf
[junit4] 2> 2943710 INFO (qtp1089583583-16093) [n:127.0.0.1:62120_solr c:routeFieldColl s:shard1 x:routeFieldColl_shard1_replica2] o.a.s.r.ManagedResourceStorage Configured ZooKeeperStorageIO with znodeBase: /configs/conf
[junit4] 2> 2943711 INFO (qtp1726225526-16109) [n:127.0.0.1:62124_solr c:routeFieldColl s:shard2 x:routeFieldColl_shard2_replica2] o.a.s.r.ManagedResourceStorage Loaded null at path _rest_managed.json using ZooKeeperStorageIO:path=/configs/conf
[junit4] 2> 2943712 INFO (qtp1726225526-16109) [n:127.0.0.1:62124_solr c:routeFieldColl s:shard2 x:routeFieldColl_shard2_replica2] o.a.s.h.ReplicationHandler Commits will be reserved for 10000
[junit4] 2> 2943712 INFO (qtp1089583583-16093) [n:127.0.0.1:62120_solr c:routeFieldColl s:shard1 x:routeFieldColl_shard1_replica2] o.a.s.r.ManagedResourceStorage Loaded null at path _rest_managed.json using ZooKeeperStorageIO:path=/configs/conf
[junit4] 2> 2943712 INFO (searcherExecutor-7503-thread-1-processing-n:127.0.0.1:62124_solr x:routeFieldColl_shard2_replica2 s:shard2 c:routeFieldColl) [n:127.0.0.1:62124_solr c:routeFieldColl s:shard2 x:routeFieldColl_shard2_replica2] o.a.s.c.SolrCore [routeFieldColl_shard2_replica2] Registered new searcher Searcher@c31e1ee[routeFieldColl_shard2_replica2] main{ExitableDirectoryReader(UninvertingDirectoryReader())}
[junit4] 2> 2943712 INFO (qtp1089583583-16093) [n:127.0.0.1:62120_solr c:routeFieldColl s:shard1 x:routeFieldColl_shard1_replica2] o.a.s.h.ReplicationHandler Commits will be reserved for 10000
[junit4] 2> 2943712 INFO (qtp1726225526-16109) [n:127.0.0.1:62124_solr c:routeFieldColl s:shard2 x:routeFieldColl_shard2_replica2] o.a.s.u.UpdateLog Could not find max version in index or recent updates, using new clock 1563645289630269440
[junit4] 2> 2943712 INFO (searcherExecutor-7504-thread-1-processing-n:127.0.0.1:62120_solr x:routeFieldColl_shard1_replica2 s:shard1 c:routeFieldColl) [n:127.0.0.1:62120_solr c:routeFieldColl s:shard1 x:routeFieldColl_shard1_replica2] o.a.s.c.SolrCore [routeFieldColl_shard1_replica2] Registered new searcher Searcher@3ca3a686[routeFieldColl_shard1_replica2] main{ExitableDirectoryReader(UninvertingDirectoryReader())}
[junit4] 2> 2943713 INFO (qtp1089583583-16093) [n:127.0.0.1:62120_solr c:routeFieldColl s:shard1 x:routeFieldColl_shard1_replica2] o.a.s.u.UpdateLog Could not find max version in index or recent updates, using new clock 1563645289631318016
[junit4] 2> 2943716 INFO (qtp1740123466-16102) [n:127.0.0.1:62118_solr c:routeFieldColl s:shard4 x:routeFieldColl_shard4_replica1] o.a.s.s.SolrIndexSearcher Opening [Searcher@36db3456[routeFieldColl_shard4_replica1] main]
[junit4] 2> 2943718 INFO (qtp1882507689-16121) [n:127.0.0.1:62119_solr c:routeFieldColl s:shard1 x:routeFieldColl_shard1_replica1] o.a.s.c.ShardLeaderElectionContext Waiting until we see more replicas up for shard shard1: total=2 found=1 timeoutin=9999ms
[junit4] 2> 2943719 INFO (qtp1740123466-16102) [n:127.0.0.1:62118_solr c:routeFieldColl s:shard4 x:routeFieldColl_shard4_replica1] o.a.s.r.ManagedResourceStorage Configured ZooKeeperStorageIO with znodeBase: /configs/conf
[junit4] 2> 2943720 INFO (qtp1740123466-16102) [n:127.0.0.1:62118_solr c:routeFieldColl s:shard4 x:routeFieldColl_shard4_replica1] o.a.s.r.ManagedResourceStorage Loaded null at path _rest_managed.json using ZooKeeperStorageIO:path=/configs/conf
[junit4] 2> 2943721 INFO (qtp1740123466-16102) [n:127.0.0.1:62118_solr c:routeFieldColl s:shard4 x:routeFieldColl_shard4_replica1] o.a.s.h.ReplicationHandler Commits will be reserved for 10000
[junit4] 2> 2943721 INFO (qtp1740123466-16102) [n:127.0.0.1:62118_solr c:routeFieldColl s:shard4 x:routeFieldColl_shard4_replica1] o.a.s.u.UpdateLog Could not find max version in index or recent updates, using new clock 1563645289639706624
[junit4] 2> 2943721 INFO (searcherExecutor-7500-thread-1-processing-n:127.0.0.1:62118_solr x:routeFieldColl_shard4_replica1 s:shard4 c:routeFieldColl) [n:127.0.0.1:62118_solr c:routeFieldColl s:shard4 x:routeFieldColl_shard4_replica1] o.a.s.c.SolrCore [routeFieldColl_shard4_replica1] Registered new searcher Searcher@36db3456[routeFieldColl_shard4_replica1] main{ExitableDirectoryReader(UninvertingDirectoryReader())}
[junit4] 2> 2943722 INFO (qtp1089583583-16092) [n:127.0.0.1:62120_solr c:routeFieldColl s:shard3 x:routeFieldColl_shard3_replica2] o.a.s.s.SolrIndexSearcher Opening [Searcher@5ecc8a78[routeFieldColl_shard3_replica2] main]
[junit4] 2> 2943725 INFO (qtp1089583583-16092) [n:127.0.0.1:62120_solr c:routeFieldColl s:shard3 x:routeFieldColl_shard3_replica2] o.a.s.r.ManagedResourceStorage Configured ZooKeeperStorageIO with znodeBase: /configs/conf
[junit4] 2> 2943726 INFO (qtp1089583583-16092) [n:127.0.0.1:62120_solr c:routeFieldColl s:shard3 x:routeFieldColl_shard3_replica2] o.a.s.r.ManagedResourceStorage Loaded null at path _rest_managed.json using ZooKeeperStorageIO:path=/configs/conf
[junit4] 2> 2943726 INFO (qtp1089583583-16092) [n:127.0.0.1:62120_solr c:routeFieldColl s:shard3 x:routeFieldColl_shard3_replica2] o.a.s.h.ReplicationHandler Commits will be reserved for 10000
[junit4] 2> 2943726 INFO (qtp1089583583-16092) [n:127.0.0.1:62120_solr c:routeFieldColl s:shard3 x:routeFieldColl_shard3_replica2] o.a.s.u.UpdateLog Could not find max version in index or recent updates, using new clock 1563645289644949504
[junit4] 2> 2943726 INFO (searcherExecutor-7501-thread-1-processing-n:127.0.0.1:62120_solr x:routeFieldColl_shard3_replica2 s:shard3 c:routeFieldColl) [n:127.0.0.1:62120_solr c:routeFieldColl s:shard3 x:routeFieldColl_shard3_replica2] o.a.s.c.SolrCore [routeFieldColl_shard3_replica2] Registered new searcher Searcher@5ecc8a78[routeFieldColl_shard3_replica2] main{ExitableDirectoryReader(UninvertingDirectoryReader())}
[junit4] 2> 2943823 INFO (zkCallback-2813-thread-1-processing-n:127.0.0.1:62118_solr) [n:127.0.0.1:62118_solr ] o.a.s.c.c.ZkStateReader A cluster state change: [WatchedEvent state:SyncConnected type:NodeDataChanged path:/collections/routeFieldColl/state.json] for collection [routeFieldColl] has occurred - updating... (live nodes size: [4])
[junit4] 2> 2943823 INFO (zkCallback-2814-thread-1-processing-n:127.0.0.1:62120_solr) [n:127.0.0.1:62120_solr ] o.a.s.c.c.ZkStateReader A cluster state change: [WatchedEvent state:SyncConnected type:NodeDataChanged path:/collections/routeFieldColl/state.json] for collection [routeFieldColl] has occurred - updating... (live nodes size: [4])
[junit4] 2> 2943823 INFO (zkCallback-2811-thread-1-processing-n:127.0.0.1:62124_solr) [n:127.0.0.1:62124_solr ] o.a.s.c.c.ZkStateReader A cluster state change: [WatchedEvent state:SyncConnected type:NodeDataChanged path:/collections/routeFieldColl/state.json] for collection [routeFieldColl] has occurred - updating... (live nodes size: [4])
[junit4] 2> 2943823 INFO (zkCallback-2812-thread-3-processing-n:127.0.0.1:62119_solr) [n:127.0.0.1:62119_solr ] o.a.s.c.c.ZkStateReader A cluster state change: [WatchedEvent state:SyncConnected type:NodeDataChanged path:/collections/routeFieldColl/state.json] for collection [routeFieldColl] has occurred - updating... (live nodes size: [4])
[junit4] 2> 2944185 INFO (qtp1726225526-16089) [n:127.0.0.1:62124_solr c:routeFieldColl s:shard4 x:routeFieldColl_shard4_replica2] o.a.s.c.ShardLeaderElectionContext Enough replicas found to continue.
[junit4] 2> 2944185 INFO (qtp1726225526-16089) [n:127.0.0.1:62124_solr c:routeFieldColl s:shard4 x:routeFieldColl_shard4_replica2] o.a.s.c.ShardLeaderElectionContext I may be the new leader - try and sync
[junit4] 2> 2944185 INFO (qtp1726225526-16089) [n:127.0.0.1:62124_solr c:routeFieldColl s:shard4 x:routeFieldColl_shard4_replica2] o.a.s.c.SyncStrategy Sync replicas to http://127.0.0.1:62124/solr/routeFieldColl_shard4_replica2/
[junit4] 2> 2944186 INFO (qtp1726225526-16089) [n:127.0.0.1:62124_solr c:routeFieldColl s:shard4 x:routeFieldColl_shard4_replica2] o.a.s.u.PeerSync PeerSync: core=routeFieldColl_shard4_replica2 url=http://127.0.0.1:62124/solr START replicas=[http://127.0.0.1:62118/solr/routeFieldColl_shard4_replica1/] nUpdates=100
[junit4] 2> 2944186 INFO (qtp1726225526-16089) [n:127.0.0.1:62124_solr c:routeFieldColl s:shard4 x:routeFieldColl_shard4_replica2] o.a.s.u.PeerSync PeerSync: core=routeFieldColl_shard4_replica2 url=http://127.0.0.1:62124/solr DONE. We have no versions. sync failed.
[junit4] 2> 2944189 INFO (qtp1740123466-16103) [n:127.0.0.1:62118_solr c:routeFieldColl s:shard4 r:core_node5 x:routeFieldColl_shard4_replica1] o.a.s.c.S.Request [routeFieldColl_shard4_replica1] webapp=/solr path=/get params={distrib=false&qt=/get&fingerprint=false&getVersions=100&wt=javabin&version=2} status=0 QTime=0
[junit4] 2> 2944190 INFO (qtp1726225526-16089) [n:127.0.0.1:62124_solr c:routeFieldColl s:shard4 x:routeFieldColl_shard4_replica2] o.a.s.c.SyncStrategy Leader's attempt to sync with shard failed, moving to the next candidate
[junit4] 2> 2944190 INFO (qtp1726225526-16089) [n:127.0.0.1:62124_solr c:routeFieldColl s:shard4 x:routeFieldColl_shard4_replica2] o.a.s.c.ShardLeaderElectionContext We failed sync, but we have no versions - we can't sync in that case - we were active before, so become leader anyway
[junit4] 2> 2944190 INFO (qtp1726225526-16089) [n:127.0.0.1:62124_solr c:routeFieldColl s:shard4 x:routeFieldColl_shard4_replica2] o.a.s.c.ShardLeaderElectionContext Found all replicas participating in election, clear LIR
[junit4] 2> 2944198 INFO (qtp1726225526-16089) [n:127.0.0.1:62124_solr c:routeFieldColl s:shard4 x:routeFieldColl_shard4_replica2] o.a.s.c.ShardLeaderElectionContext I am the new leader: http://127.0.0.1:62124/solr/routeFieldColl_shard4_replica2/ shard4
[junit4] 2> 2944212 INFO (qtp1882507689-16120) [n:127.0.0.1:62119_solr c:routeFieldColl s:shard3 x:routeFieldColl_shard3_replica1] o.a.s.c.ShardLeaderElectionContext Enough replicas found to continue.
[junit4] 2> 2944212 INFO (qtp1882507689-16120) [n:127.0.0.1:62119_solr c:routeFieldColl s:shard3 x:routeFieldColl_shard3_replica1] o.a.s.c.ShardLeaderElectionContext I may be the new leader - try and sync
[junit4] 2> 2944212 INFO (qtp1882507689-16120) [n:127.0.0.1:62119_solr c:routeFieldColl s:shard3 x:routeFieldColl_shard3_replica1] o.a.s.c.SyncStrategy Sync replicas to http://127.0.0.1:62119/solr/routeFieldColl_shard3_replica1/
[junit4] 2> 2944212 INFO (qtp1740123466-16101) [n:127.0.0.1:62118_solr c:routeFieldColl s:shard2 x:routeFieldColl_shard2_replica1] o.a.s.c.ShardLeaderElectionContext Enough replicas found to continue.
[junit4] 2> 2944212 INFO (qtp1740123466-16101) [n:127.0.0.1:62118_solr c:routeFieldColl s:shard2 x:routeFieldColl_shard2_replica1] o.a.s.c.ShardLeaderElectionContext I may be the new leader - try and sync
[junit4] 2> 2944212 INFO (qtp1882507689-16120) [n:127.0.0.1:62119_solr c:routeFieldColl s:shard3 x:routeFieldColl_shard3_replica1] o.a.s.u.PeerSync PeerSync: core=routeFieldColl_shard3_replica1 url=http://127.0.0.1:62119/solr START replicas=[http://127.0.0.1:62120/solr/routeFieldColl_shard3_replica2/] nUpdates=100
[junit4] 2> 2944212 INFO (qtp1740123466-16101) [n:127.0.0.1:62118_solr c:routeFieldColl s:shard2 x:routeFieldColl_shard2_replica1] o.a.s.c.SyncStrategy Sync replicas to http://127.0.0.1:62118/solr/routeFieldColl_shard2_replica1/
[junit4] 2> 2944213 INFO (qtp1740123466-16101) [n:127.0.0.1:62118_solr c:routeFieldColl s:shard2 x:routeFieldColl_shard2_replica1] o.a.s.u.PeerSync PeerSync: core=routeFieldColl_shard2_replica1 url=http://127.0.0.1:62118/solr START replicas=[http://127.0.0.1:62124/solr/routeFieldColl_shard2_replica2/] nUpdates=100
[junit4] 2> 2944213 INFO (qtp1882507689-16120) [n:127.0.0.1:62119_solr c:routeFieldColl s:shard3 x:routeFieldColl_shard3_replica1] o.a.s.u.PeerSync PeerSync: core=routeFieldColl_shard3_replica1 url=http://127.0.0.1:62119/solr DONE. We have no versions. sync failed.
[junit4] 2> 2944213 INFO (qtp1740123466-16101) [n:127.0.0.1:62118_solr c:routeFieldColl s:shard2 x:routeFieldColl_shard2_replica1] o.a.s.u.PeerSync PeerSync: core=routeFieldColl_shard2_replica1 url=http://127.0.0.1:62118/solr DONE. We have no versions. sync failed.
[junit4] 2> 2944216 INFO (qtp1089583583-16095) [n:127.0.0.1:62120_solr c:routeFieldColl s:shard3 r:core_node2 x:routeFieldColl_shard3_replica2] o.a.s.c.S.Request [routeFieldColl_shard3_replica2] webapp=/solr path=/get params={distrib=false&qt=/get&fingerprint=false&getVersions=100&wt=javabin&version=2} status=0 QTime=0
[junit4] 2> 2944217 INFO (qtp1726225526-16111) [n:127.0.0.1:62124_solr c:routeFieldColl s:shard2 r:core_node8 x:routeFieldColl_shard2_replica2] o.a.s.c.S.Request [routeFieldColl_shard2_replica2] webapp=/solr path=/get params={distrib=false&qt=/get&fingerprint=false&getVersions=100&wt=javabin&version=2} status=0 QTime=1
[junit4] 2> 2944218 INFO (qtp1882507689-16120) [n:127.0.0.1:62119_solr c:routeFieldColl s:shard3 x:routeFieldColl_shard3_replica1] o.a.s.c.SyncStrategy Leader's attempt to sync with shard failed, moving to the next candidate
[junit4] 2> 2944218 INFO (qtp1882507689-16120) [n:127.0.0.1:62119_solr c:routeFieldColl s:shard3 x:routeFieldColl_shard3_replica1] o.a.s.c.ShardLeaderElectionContext We failed sync, but we have no versions - we can't sync in that case - we were active before, so become leader anyway
[junit4] 2> 2944218 INFO (qtp1740123466-16101) [n:127.0.0.1:62118_solr c:routeFieldColl s:shard2 x:routeFieldColl_shard2_replica1] o.a.s.c.SyncStrategy Leader's attempt to sync with shard failed, moving to the next candidate
[junit4] 2> 2944218 INFO (qtp1740123466-16101) [n:127.0.0.1:62118_solr c:routeFieldColl s:shard2 x:routeFieldColl_shard2_replica1] o.a.s.c.ShardLeaderElectionContext We failed sync, but we have no versions - we can't sync in that case - we were active before, so become leader anyway
[junit4] 2> 2944218 INFO (qtp1740123466-16101) [n:127.0.0.1:62118_solr c:routeFieldColl s:shard2 x:routeFieldColl_shard2_replica1] o.a.s.c.ShardLeaderElectionContext Found all replicas participating in election, clear LIR
[junit4] 2> 2944218 INFO (qtp1882507689-16120) [n:127.0.0.1:62119_solr c:routeFieldColl s:shard3 x:routeFieldColl_shard3_replica1] o.a.s.c.ShardLeaderElectionContext Found all replicas participating in election, clear LIR
[junit4] 2> 2944219 INFO (qtp1882507689-16121) [n:127.0.0.1:62119_solr c:routeFieldColl s:shard1 x:routeFieldColl_shard1_replica1] o.a.s.c.ShardLeaderElectionContext Enough replicas found to continue.
[junit4] 2> 2944219 INFO (qtp1882507689-16121) [n:127.0.0.1:62119_solr c:routeFieldColl s:shard1 x:routeFieldColl_shard1_replica1] o.a.s.c.ShardLeaderElectionContext I may be the new leader - try and sync
[junit4] 2> 2944219 INFO (qtp1882507689-16121) [n:127.0.0.1:62119_solr c:routeFieldColl s:shard1 x:routeFieldColl_shard1_replica1] o.a.s.c.SyncStrategy Sync replicas to http://127.0.0.1:62119/solr/routeFieldColl_shard1_replica1/
[junit4] 2> 2944219 INFO (qtp1882507689-16121) [n:127.0.0.1:62119_solr c:routeFieldColl s:shard1 x:routeFieldColl_shard1_replica1] o.a.s.u.PeerSync PeerSync: core=routeFieldColl_shard1_replica1 url=http://127.0.0.1:62119/solr START replicas=[http://127.0.0.1:62120/solr/routeFieldColl_shard1_replica2/] nUpdates=100
[junit4] 2> 2944219 INFO (qtp1882507689-16121) [n:127.0.0.1:62119_solr c:routeFieldColl s:shard1 x:routeFieldColl_shard1_replica1] o.a.s.u.PeerSync PeerSync: core=routeFieldColl_shard1_replica1 url=http://127.0.0.1:62119/solr DONE. We have no versions. sync failed.
[junit4] 2> 2944223 INFO (qtp1089583583-16096) [n:127.0.0.1:62120_solr c:routeFieldColl s:shard1 r:core_node6 x:routeFieldColl_shard1_replica2] o.a.s.c.S.Request [routeFieldColl_shard1_replica2] webapp=/solr path=/get params={distrib=false&qt=/get&fingerprint=false&getVersions=100&wt=javabin&version=2} status=0 QTime=0
[junit4] 2> 2944223 INFO (qtp1882507689-16121) [n:127.0.0.1:62119_solr c:routeFieldColl s:shard1 x:routeFieldColl_shard1_replica1] o.a.s.c.SyncStrategy Leader's attempt to sync with shard failed, moving to the next candidate
[junit4] 2> 2944223 INFO (qtp1882507689-16121) [n:127.0.0.1:62119_solr c:routeFieldColl s:shard1 x:routeFieldColl_shard1_replica1] o.a.s.c.ShardLeaderElectionContext We failed sync, but we have no versions - we can't sync in that case - we were active before, so become leader anyway
[junit4] 2> 2944223 INFO (qtp1882507689-16121) [n:127.0.0.1:62119_solr c:routeFieldColl s:shard1 x:routeFieldColl_shard1_replica1] o.a.s.c.ShardLeaderElectionContext Found all replicas participating in election, clear LIR
[junit4] 2> 2944227 INFO (qtp1882507689-16120) [n:127.0.0.1:62119_solr c:routeFieldColl s:shard3 x:routeFieldColl_shard3_replica1] o.a.s.c.ShardLeaderElectionContext I am the new leader: http://127.0.0.1:62119/solr/routeFieldColl_shard3_replica1/ shard3
[junit4] 2> 2944227 INFO (qtp1740123466-16101) [n:127.0.0.1:62118_solr c:routeFieldColl s:shard2 x:routeFieldColl_shard2_replica1] o.a.s.c.ShardLeaderElectionContext I am the new leader: http://127.0.0.1:62118/solr/routeFieldColl_shard2_replica1/ shard2
[junit4] 2> 2944232 INFO (qtp1882507689-16121) [n:127.0.0.1:62119_solr c:routeFieldColl s:shard1 x:routeFieldColl_shard1_replica1] o.a.s.c.ShardLeaderElectionContext I am the new leader: http://127.0.0.1:62119/solr/routeFieldColl_shard1_replica1/ shard1
[junit4] 2> 2944349 INFO (zkCallback-2812-thread-3-processing-n:127.0.0.1:62119_solr) [n:127.0.0.1:62119_solr ] o.a.s.c.c.ZkStateReader A cluster state change: [WatchedEvent state:SyncConnected type:NodeDataChanged path:/collections/routeFieldColl/state.json] for collection [routeFieldColl] has occurred - updating... (live nodes size: [4])
[junit4] 2> 2944349 INFO (zkCallback-2811-thread-1-processing-n:127.0.0.1:62124_solr) [n:127.0.0.1:62124_solr ] o.a.s.c.c.ZkStateReader A cluster state change: [WatchedEvent state:SyncConnected type:NodeDataChanged path:/collections/routeFieldColl/state.json] for collection [routeFieldColl] has occurred - updating... (live nodes size: [4])
[junit4] 2> 2944349 INFO (zkCallback-2813-thread-1-processing-n:127.0.0.1:62118_solr) [n:127.0.0.1:62118_solr ] o.a.s.c.c.ZkStateReader A cluster state change: [WatchedEvent state:SyncConnected type:NodeDataChanged path:/collections/routeFieldColl/state.json] for collection [routeFieldColl] has occurred - updating... (live nodes size: [4])
[junit4] 2> 2944349 INFO (zkCallback-2814-thread-1-processing-n:127.0.0.1:62120_solr) [n:127.0.0.1:62120_solr ] o.a.s.c.c.ZkStateReader A cluster state change: [WatchedEvent state:SyncConnected type:NodeDataChanged path:/collections/routeFieldColl/state.json] for collection [routeFieldColl] has occurred - updating... (live nodes size: [4])
[junit4] 2> 2944374 INFO (qtp1726225526-16089) [n:127.0.0.1:62124_solr c:routeFieldColl s:shard4 x:routeFieldColl_shard4_replica2] o.a.s.c.ZkController I am the leader, no recovery necessary
[junit4] 2> 2944378 INFO (qtp1726225526-16089) [n:127.0.0.1:62124_solr c:routeFieldColl s:shard4 x:routeFieldColl_shard4_replica2] o.a.s.s.HttpSolrCall [admin] webapp=null path=/admin/cores params={qt=/admin/cores&collection.configName=conf&newCollection=true&name=routeFieldColl_shard4_replica2&action=CREATE&numShards=4&collection=routeFieldColl&shard=shard4&wt=javabin&version=2} status=0 QTime=2095
[junit4] 2> 2944385 INFO (qtp1740123466-16101) [n:127.0.0.1:62118_solr c:routeFieldColl s:shard2 x:routeFieldColl_shard2_replica1] o.a.s.c.ZkController I am the leader, no recovery necessary
[junit4] 2> 2944387 INFO (qtp1740123466-16101) [n:127.0.0.1:62118_solr c:routeFieldColl s:shard2 x:routeFieldColl_shard2_replica1] o.a.s.s.HttpSolrCall [admin] webapp=null path=/admin/cores params={qt=/admin/cores&collection.configName=conf&newCollection=true&name=routeFieldColl_shard2_replica1&action=CREATE&numShards=4&collection=routeFieldColl&shard=shard2&wt=javabin&version=2} status=0 QTime=2107
[junit4] 2> 2944388 INFO (qtp1882507689-16120) [n:127.0.0.1:62119_solr c:routeFieldColl s:shard3 x:routeFieldColl_shard3_replica1] o.a.s.c.ZkController I am the leader, no recovery necessary
[junit4] 2> 2944389 INFO (qtp1882507689-16121) [n:127.0.0.1:62119_solr c:routeFieldColl s:shard1 x:routeFieldColl_shard1_replica1] o.a.s.c.ZkController I am the leader, no recovery necessary
[junit4] 2> 2944391 INFO (qtp1882507689-16120) [n:127.0.0.1:62119_solr c:routeFieldColl s:shard3 x:routeFieldColl_shard3_replica1] o.a.s.s.HttpSolrCall [admin] webapp=null path=/admin/cores params={qt=/admin/cores&collection.configName=conf&newCollection=true&name=routeFieldColl_shard3_replica1&action=CREATE&numShards=4&collection=routeFieldColl&shard=shard3&wt=javabin&version=2} status=0 QTime=2112
[junit4] 2> 2944392 INFO (qtp1882507689-16121) [n:127.0.0.1:62119_solr c:routeFieldColl s:shard1 x:routeFieldColl_shard1_replica1] o.a.s.s.HttpSolrCall [admin] webapp=null path=/admin/cores params={qt=/admin/cores&collection.configName=conf&newCollection=true&name=routeFieldColl_shard1_replica1&action=CREATE&numShards=4&collection=routeFieldColl&shard=shard1&wt=javabin&version=2} status=0 QTime=2114
[junit4] 2> 2944508 INFO (zkCallback-2812-thread-1-processing-n:127.0.0.1:62119_solr) [n:127.0.0.1:62119_solr ] o.a.s.c.c.ZkStateReader A cluster state change: [WatchedEvent state:SyncConnected type:NodeDataChanged path:/collections/routeFieldColl/state.json] for collection [routeFieldColl] has occurred - updating... (live nodes size: [4])
[junit4] 2> 2944508 INFO (zkCallback-2811-thread-1-processing-n:127.0.0.1:62124_solr) [n:127.0.0.1:62124_solr ] o.a.s.c.c.ZkStateReader A cluster state change: [WatchedEvent state:SyncConnected type:NodeDataChanged path:/collections/routeFieldColl/state.json] for collection [routeFieldColl] has occurred - updating... (live nodes size: [4])
[junit4] 2> 2944508 INFO (zkCallback-2813-thread-1-processing-n:127.0.0.1:62118_solr) [n:127.0.0.1:62118_solr ] o.a.s.c.c.ZkStateReader A cluster state change: [WatchedEvent state:SyncConnected type:NodeDataChanged path:/collections/routeFieldColl/state.json] for collection [routeFieldColl] has occurred - updating... (live nodes size: [4])
[junit4] 2> 2944508 INFO (zkCallback-2814-thread-1-processing-n:127.0.0.1:62120_solr) [n:127.0.0.1:62120_solr ] o.a.s.c.c.ZkStateReader A cluster state change: [WatchedEvent state:SyncConnected type:NodeDataChanged path:/collections/routeFieldColl/state.json] for collection [routeFieldColl] has occurred - updating... (live nodes size: [4])
[junit4] 2> 2944732 INFO (qtp1089583583-16093) [n:127.0.0.1:62120_solr c:routeFieldColl s:shard1 x:routeFieldColl_shard1_replica2] o.a.s.s.HttpSolrCall [admin] webapp=null path=/admin/cores params={qt=/admin/cores&collection.configName=conf&newCollection=true&name=routeFieldColl_shard1_replica2&action=CREATE&numShards=4&collection=routeFieldColl&shard=shard1&wt=javabin&version=2} status=0 QTime=2450
[junit4] 2> 2944732 INFO (qtp1726225526-16109) [n:127.0.0.1:62124_solr c:routeFieldColl s:shard2 x:routeFieldColl_shard2_replica2] o.a.s.s.HttpSolrCall [admin] webapp=null path=/admin/cores params={qt=/admin/cores&collection.configName=conf&newCollection=true&name=routeFieldColl_shard2_replica2&action=CREATE&numShards=4&collection=routeFieldColl&shard=shard2&wt=javabin&version=2} status=0 QTime=2449
[junit4] 2> 2944732 INFO (qtp1740123466-16102) [n:127.0.0.1:62118_solr c:routeFieldColl s:shard4 x:routeFieldColl_shard4_replica1] o.a.s.s.HttpSolrCall [admin] webapp=null path=/admin/cores params={qt=/admin/cores&collection.configName=conf&newCollection=true&name=routeFieldColl_shard4_replica1&action=CREATE&numShards=4&collection=routeFieldColl&shard=shard4&wt=javabin&version=2} status=0 QTime=2451
[junit4] 2> 2944736 INFO (qtp1089583583-16092) [n:127.0.0.1:62120_solr c:routeFieldColl s:shard3 x:routeFieldColl_shard3_replica2] o.a.s.s.HttpSolrCall [admin] webapp=null path=/admin/cores params={qt=/admin/cores&collection.configName=conf&newCollection=true&name=routeFieldColl_shard3_replica2&action=CREATE&numShards=4&collection=routeFieldColl&shard=shard3&wt=javabin&version=2} status=0 QTime=2455
[junit4] 2> 2944741 INFO (qtp1882507689-16116) [n:127.0.0.1:62119_solr ] o.a.s.h.a.CollectionsHandler Wait for new collection to be active for at most 30 seconds. Check all shard replicas
[junit4] 2> 2944849 INFO (zkCallback-2812-thread-3-processing-n:127.0.0.1:62119_solr) [n:127.0.0.1:62119_solr ] o.a.s.c.c.ZkStateReader A cluster state change: [WatchedEvent state:SyncConnected type:NodeDataChanged path:/collections/routeFieldColl/state.json] for collection [routeFieldColl] has occurred - updating... (live nodes size: [4])
[junit4] 2> 2944849 INFO (zkCallback-2811-thread-1-processing-n:127.0.0.1:62124_solr) [n:127.0.0.1:62124_solr ] o.a.s.c.c.ZkStateReader A cluster state change: [WatchedEvent state:SyncConnected type:NodeDataChanged path:/collections/routeFieldColl/state.json] for collection [routeFieldColl] has occurred - updating... (live nodes size: [4])
[junit4] 2> 2944849 INFO (zkCallback-2814-thread-1-processing-n:127.0.0.1:62120_solr) [n:127.0.0.1:62120_solr ] o.a.s.c.c.ZkStateReader A cluster state change: [WatchedEvent state:SyncConnected type:NodeDataChanged path:/collections/routeFieldColl/state.json] for collection [routeFieldColl] has occurred - updating... (live nodes size: [4])
[junit4] 2> 2944849 INFO (zkCallback-2813-thread-1-processing-n:127.0.0.1:62118_solr) [n:127.0.0.1:62118_solr ] o.a.s.c.c.ZkStateReader A cluster state change: [WatchedEvent state:SyncConnected type:NodeDataChanged path:/collections/routeFieldColl/state.json] for collection [routeFieldColl] has occurred - updating... (live nodes size: [4])
[junit4] 2> 2945747 INFO (qtp1882507689-16116) [n:127.0.0.1:62119_solr ] o.a.s.s.HttpSolrCall [admin] webapp=null path=/admin/collections params={replicationFactor=2&collection.configName=conf&maxShardsPerNode=3&router.field=shard_s&name=routeFieldColl&action=CREATE&numShards=4&wt=javabin&version=2} status=0 QTime=3591
[junit4] 2> 2945765 INFO (qtp1089583583-16097) [n:127.0.0.1:62120_solr c:routeFieldColl s:shard3 r:core_node2 x:routeFieldColl_shard3_replica2] o.a.s.u.p.LogUpdateProcessorFactory [routeFieldColl_shard3_replica2] webapp=/solr path=/update params={update.distrib=FROMLEADER&distrib.from=http://127.0.0.1:62119/solr/routeFieldColl_shard3_replica1/&wt=javabin&version=2}{add=[6 (1563645291770413056), 7 (1563645291776704512)]} 0 3
[junit4] 2> 2945766 INFO (qtp1882507689-16119) [n:127.0.0.1:62119_solr c:routeFieldColl s:shard3 r:core_node4 x:routeFieldColl_shard3_replica1] o.a.s.u.p.LogUpdateProcessorFactory [routeFieldColl_shard3_replica1] webapp=/solr path=/update params={_stateVer_=routeFieldColl:5&wt=javabin&version=2}{add=[6 (1563645291770413056), 7 (1563645291776704512)]} 0 13
[junit4] 2> 2945768 INFO (qtp1089583583-16090) [n:127.0.0.1:62120_solr c:routeFieldColl s:shard1 r:core_node6 x:routeFieldColl_shard1_replica2] o.a.s.u.p.LogUpdateProcessorFactory [routeFieldColl_shard1_replica2] webapp=/solr path=/update params={update.distrib=FROMLEADER&distrib.from=http://127.0.0.1:62119/solr/routeFieldColl_shard1_replica1/&wt=javabin&version=2}{add=[8 (1563645291771461632)]} 0 1
[junit4] 2> 2945768 INFO (qtp1882507689-16114) [n:127.0.0.1:62119_solr c:routeFieldColl s:shard1 r:core_node3 x:routeFieldColl_shard1_replica1] o.a.s.u.p.LogUpdateProcessorFactory [routeFieldColl_shard1_replica1] webapp=/solr path=/update params={_stateVer_=routeFieldColl:5&wt=javabin&version=2}{add=[8 (1563645291771461632)]} 0 14
[junit4] 2> 2945774 INFO (qtp1882507689-16118) [n:127.0.0.1:62119_solr c:routeFieldColl s:shard1 r:core_node3 x:routeFieldColl_shard1_replica1] o.a.s.u.DirectUpdateHandler2 start commit{,optimize=false,openSearcher=true,waitSearcher=true,expungeDeletes=false,softCommit=false,prepareCommit=false}
[junit4] 2> 2945774 INFO (qtp1882507689-16118) [n:127.0.0.1:62119_solr c:routeFieldColl s:shard1 r:core_node3 x:routeFieldColl_shard1_replica1] o.a.s.u.SolrIndexWriter Calling setCommitData with IW:org.apache.solr.update.SolrIndexWriter@4d8334e4
[junit4] 2> 2945774 INFO (qtp1740123466-16104) [n:127.0.0.1:62118_solr c:routeFieldColl s:shard2 r:core_node1 x:routeFieldColl_shard2_replica1] o.a.s.u.DirectUpdateHandler2 start commit{,optimize=false,openSearcher=true,waitSearcher=true,expungeDeletes=false,softCommit=false,prepareCommit=false}
[junit4] 2> 2945775 INFO (qtp1089583583-16094) [n:127.0.0.1:62120_solr c:routeFieldColl s:shard1 r:core_node6 x:routeFieldColl_shard1_replica2] o.a.s.u.DirectUpdateHandler2 start commit{,optimize=false,openSearcher=true,waitSearcher=true,expungeDeletes=false,softCommit=false,prepareCommit=false}
[junit4] 2> 2945775 INFO (qtp1089583583-16094) [n:127.0.0.1:62120_solr c:routeFieldColl s:shard1 r:core_node6 x:routeFieldColl_shard1_replica2] o.a.s.u.SolrIndexWriter Calling setCommitData with IW:org.apache.solr.update.SolrIndexWriter@5178a7f5
[junit4] 2> 2945776 INFO (qtp1726225526-16112) [n:127.0.0.1:62124_solr c:routeFieldColl s:shard2 r:core_node8 x:routeFieldColl_shard2_replica2] o.a.s.u.DirectUpdateHandler2 start commit{,optimize=false,openSearcher=true,waitSearcher=true,expungeDeletes=false,softCommit=false,prepareCommit=false}
[junit4] 2> 2945776 INFO (qtp1726225526-16112) [n:127.0.0.1:62124_solr c:routeFieldColl s:shard2 r:core_node8 x:routeFieldColl_shard2_replica2] o.a.s.u.DirectUpdateHandler2 No uncommitted changes. Skipping IW.commit.
[junit4] 2> 2945777 INFO (qtp1740123466-16104) [n:127.0.0.1:62118_solr c:routeFieldColl s:shard2 r:core_node1 x:routeFieldColl_shard2_replica1] o.a.s.u.DirectUpdateHandler2 No uncommitted changes. Skipping IW.commit.
[junit4] 2> 2945777 INFO (qtp1089583583-16095) [n:127.0.0.1:62120_solr c:routeFieldColl s:shard3 r:core_node2 x:routeFieldColl_shard3_replica2] o.a.s.u.DirectUpdateHandler2 start commit{,optimize=false,openSearcher=true,waitSearcher=true,expungeDeletes=false,softCommit=false,prepareCommit=false}
[junit4] 2> 2945777 INFO (qtp1089583583-16095) [n:127.0.0.1:62120_solr c:routeFieldColl s:shard3 r:core_node2 x:routeFieldColl_shard3_replica2] o.a.s.u.SolrIndexWriter Calling setCommitData with IW:org.apache.solr.update.SolrIndexWriter@62377942
[junit4] 2> 2945778 INFO (qtp1882507689-16120) [n:127.0.0.1:62119_solr c:routeFieldColl s:shard3 r:core_node4 x:routeFieldColl_shard3_replica1] o.a.s.u.DirectUpdateHandler2 start commit{,optimize=false,openSearcher=true,waitSearcher=true,expungeDeletes=false,softCommit=false,prepareCommit=false}
[junit4] 2> 2945778 INFO (qtp1882507689-16120) [n:127.0.0.1:62119_solr c:routeFieldColl s:shard3 r:core_node4 x:routeFieldColl_shard3_replica1] o.a.s.u.SolrIndexWriter Calling setCommitData with IW:org.apache.solr.update.SolrIndexWriter@13579cb6
[junit4] 2> 2945780 INFO (qtp1740123466-16104) [n:127.0.0.1:62118_solr c:routeFieldColl s:shard2 r:core_node1 x:routeFieldColl_shard2_replica1] o.a.s.u.DirectUpdateHandler2 end_commit_flush
[junit4] 2> 2945781 INFO (qtp1740123466-16099) [n:127.0.0.1:62118_solr c:routeFieldColl s:shard4 r:core_node5 x:routeFieldColl_shard4_replica1] o.a.s.u.DirectUpdateHandler2 start commit{,optimize=false,openSearcher=true,waitSearcher=true,expungeDeletes=false,softCommit=false,prepareCommit=false}
[junit4] 2> 2945781 INFO (qtp1740123466-16099) [n:127.0.0.1:62118_solr c:routeFieldColl s:shard4 r:core_node5 x:routeFieldColl_shard4_replica1] o.a.s.u.DirectUpdateHandler2 No uncommitted changes. Skipping IW.commit.
[junit4] 2> 2945782 INFO (qtp1740123466-16104) [n:127.0.0.1:62118_solr c:routeFieldColl s:shard2 r:core_node1 x:routeFieldColl_shard2_replica1] o.a.s.u.p.LogUpdateProcessorFactory [routeFieldColl_shard2_replica1] webapp=/solr path=/update params={update.distrib=FROMLEADER&waitSearcher=true&openSearcher=true&commit=true&softCommit=false&distrib.from=http://127.0.0.1:62119/solr/routeFieldColl_shard1_replica1/&commit_end_point=true&wt=javabin&version=2&expungeDeletes=false}{commit=} 0 7
[junit4] 2> 2945782 INFO (qtp1726225526-16087) [n:127.0.0.1:62124_solr c:routeFieldColl s:shard4 r:core_node7 x:routeFieldColl_shard4_replica2] o.a.s.u.DirectUpdateHandler2 start commit{,optimize=false,openSearcher=true,waitSearcher=true,expungeDeletes=false,softCommit=false,prepareCommit=false}
[junit4] 2> 2945782 INFO (qtp1726225526-16087) [n:127.0.0.1:62124_solr c:routeFieldColl s:shard4 r:core_node7 x:routeFieldColl_shard4_replica2] o.a.s.u.DirectUpdateHandler2 No uncommitted changes. Skipping IW.commit.
[junit4] 2> 2945784 INFO (qtp1726225526-16087) [n:127.0.0.1:62124_solr c:routeFieldColl s:shard4 r:core_node7 x:routeFieldColl_shard4_replica2] o.a.s.u.DirectUpdateHandler2 end_commit_flush
[junit4] 2> 2945784 INFO (qtp1740123466-16099) [n:127.0.0.1:62118_solr c:routeFieldColl s:shard4 r:core_node5 x:routeFieldColl_shard4_replica1] o.a.s.u.DirectUpdateHandler2 end_commit_flush
[junit4] 2> 2945784 INFO (qtp1726225526-16087) [n:127.0.0.1:62124_solr c:routeFieldColl s:shard4 r:core_node7 x:routeFieldColl_shard4_replica2] o.a.s.u.p.LogUpdateProcessorFactory [routeFieldColl_shard4_replica2] webapp=/solr path=/update params={update.distrib=FROMLEADER&waitSearcher=true&openSearcher=true&commit=true&softCommit=false&distrib.from=http://127.0.0.1:62119/solr/routeFieldColl_shard1_replica1/&commit_end_point=true&wt=javabin&version=2&expungeDeletes=false}{commit=} 0 2
[junit4] 2> 2945784 INFO (qtp1740123466-16099) [n:127.0.0.1:62118_solr c:routeFieldColl s:shard4 r:core_node5 x:routeFieldColl_shard4_replica1] o.a.s.u.p.LogUpdateProcessorFactory [routeFieldColl_shard4_replica1] webapp=/solr path=/update params={update.distrib=FROMLEADER&waitSearcher=true&openSearcher=true&commit=true&softCommit=false&distrib.from=http://127.0.0.1:62119/solr/routeFieldColl_shard1_replica1/&commit_end_point=true&wt=javabin&version=2&expungeDeletes=false}{commit=} 0 3
[junit4] 2> 2945785 INFO (qtp1726225526-16112) [n:127.0.0.1:62124_solr c:routeFieldColl s:shard2 r:core_node8 x:routeFieldColl_shard2_replica2] o.a.s.u.DirectUpdateHandler2 end_commit_flush
[junit4] 2> 2945785 INFO (qtp1726225526-16112) [n:127.0.0.1:62124_solr c:routeFieldColl s:shard2 r:core_no
[...truncated too long message...]
SolrMetricManager Closing metric reporters for: solr.core.testCreateShardRepFactor.a.replica1
[junit4] 2> 2993528 INFO (jetty-closer-2793-thread-1) [ ] o.a.s.c.Overseer Overseer (id=97727830305865738-127.0.0.1:62119_solr-n_0000000000) closing
[junit4] 2> 2993529 INFO (OverseerStateUpdate-97727830305865738-127.0.0.1:62119_solr-n_0000000000) [n:127.0.0.1:62119_solr ] o.a.s.c.Overseer Overseer Loop exiting : 127.0.0.1:62119_solr
[junit4] 2> 2993530 WARN (zkCallback-2813-thread-1-processing-n:127.0.0.1:62118_solr) [n:127.0.0.1:62118_solr ] o.a.s.c.c.ZkStateReader ZooKeeper watch triggered, but Solr cannot talk to ZK: [KeeperErrorCode = Session expired for /live_nodes]
[junit4] 2> 2993532 INFO (zkCallback-2812-thread-3-processing-n:127.0.0.1:62119_solr) [n:127.0.0.1:62119_solr ] o.a.s.c.c.ZkStateReader Updated live nodes from ZooKeeper... (2) -> (1)
[junit4] 2> 2993535 INFO (jetty-closer-2793-thread-3) [ ] o.a.s.m.SolrMetricManager Closing metric reporters for: solr.node
[junit4] 2> 2993537 INFO (jetty-closer-2793-thread-3) [ ] o.e.j.s.h.ContextHandler Stopped o.e.j.s.ServletContextHandler@7f977c21{/solr,null,UNAVAILABLE}
[junit4] 2> 2995042 WARN (zkCallback-2812-thread-3-processing-n:127.0.0.1:62119_solr) [n:127.0.0.1:62119_solr ] o.a.s.c.c.ZkStateReader ZooKeeper watch triggered, but Solr cannot talk to ZK: [KeeperErrorCode = Session expired for /live_nodes]
[junit4] 2> 2995043 INFO (jetty-closer-2793-thread-1) [ ] o.a.s.m.SolrMetricManager Closing metric reporters for: solr.node
[junit4] 2> 2995043 INFO (jetty-closer-2793-thread-1) [ ] o.e.j.s.h.ContextHandler Stopped o.e.j.s.ServletContextHandler@5a7dd05e{/solr,null,UNAVAILABLE}
[junit4] 2> 2995050 INFO (SUITE-CustomCollectionTest-seed#[379ED6FA5784D401]-worker) [ ] o.a.s.c.ZkTestServer connecting to 127.0.0.1:62116 62116
[junit4] 2> 2995210 INFO (Thread-3561) [ ] o.a.s.c.ZkTestServer connecting to 127.0.0.1:62116 62116
[junit4] 2> 3007010 WARN (Thread-3561) [ ] o.a.s.c.ZkTestServer Watch limit violations:
[junit4] 2> Maximum concurrent create/delete watches above limit:
[junit4] 2>
[junit4] 2> 11 /solr/configs/conf
[junit4] 2> 9 /solr/clusterprops.json
[junit4] 2> 9 /solr/aliases.json
[junit4] 2> 4 /solr/security.json
[junit4] 2>
[junit4] 2> Maximum concurrent data watches above limit:
[junit4] 2>
[junit4] 2> 9 /solr/clusterstate.json
[junit4] 2> 5 /solr/collections/implicitcoll/state.json
[junit4] 2> 4 /solr/collections/testCreateShardRepFactor/state.json
[junit4] 2> 4 /solr/collections/routeFieldColl/state.json
[junit4] 2> 4 /solr/collections/withShardField/state.json
[junit4] 2> 2 /solr/overseer_elect/election/97727830305865738-127.0.0.1:62119_solr-n_0000000000
[junit4] 2>
[junit4] 2> Maximum concurrent children watches above limit:
[junit4] 2>
[junit4] 2> 64 /solr/overseer/queue
[junit4] 2> 37 /solr/overseer/collection-queue-work
[junit4] 2> 27 /solr/collections
[junit4] 2> 9 /solr/live_nodes
[junit4] 2> 7 /solr/overseer/queue-work
[junit4] 2>
[junit4] 2> 3007032 INFO (SUITE-CustomCollectionTest-seed#[379ED6FA5784D401]-worker) [ ] o.a.s.SolrTestCaseJ4 ###deleteCore
[junit4] 2> NOTE: leaving temporary files on disk at: /Users/jenkins/workspace/Lucene-Solr-6.x-MacOSX/solr/build/solr-core/test/J0/temp/solr.cloud.CustomCollectionTest_379ED6FA5784D401-001
[junit4] 2> NOTE: test params are: codec=Asserting(Lucene62): {shard_s=FSTOrd50, _version_=PostingsFormat(name=MockRandom), id=BlockTreeOrds(blocksize=128), _route_=TestBloomFilteredLucenePostings(BloomFilteringPostingsFormat(Lucene50(blocksize=128)))}, docValues:{}, maxPointsInLeafNode=1640, maxMBSortInHeap=5.074329304267628, sim=RandomSimilarity(queryNorm=false,coord=crazy): {}, locale=ja, timezone=Asia/Baku
[junit4] 2> NOTE: Mac OS X 10.11.6 x86_64/Oracle Corporation 1.8.0_121 (64-bit)/cpus=3,threads=1,free=65900688,total=373035008
[junit4] 2> NOTE: All tests run in this JVM: [TestSolrIndexConfig, ClusterStateUpdateTest, TestRequestForwarding, TestPointFields, HLLUtilTest, BlockJoinFacetDistribTest, TestCloudPseudoReturnFields, SolrRequestParserTest, TestRestoreCore, TestCloudInspectUtil, TestFieldCacheSanityChecker, MetricUtilsTest, TestElisionMultitermQuery, TestDeleteCollectionOnDownNodes, DisMaxRequestHandlerTest, TestAuthenticationFramework, DistributedSpellCheckComponentTest, BlockJoinFacetSimpleTest, TestFieldCache, TestSolrCloudWithDelegationTokens, TestCSVLoader, TestPerFieldSimilarityClassic, DocumentBuilderTest, TestNamedUpdateProcessors, OpenExchangeRatesOrgProviderTest, TestBM25SimilarityFactory, LeaderElectionTest, TestCollationField, TestExportWriter, DocValuesMultiTest, TestScoreJoinQPNoScore, SolrCoreTest, DistributedFacetPivotSmallTest, BaseCdcrDistributedZkTest, CollectionsAPIAsyncDistributedZkTest, UUIDUpdateProcessorFallbackTest, SaslZkACLProviderTest, ParsingFieldUpdateProcessorsTest, HttpPartitionTest, TermsComponentTest, XmlUpdateRequestHandlerTest, JSONWriterTest, TlogReplayBufferedWhileIndexingTest, TestReplicationHandlerBackup, CoreAdminRequestStatusTest, TestJettySolrRunner, TestRTimerTree, SmileWriterTest, TestPseudoReturnFields, PrimUtilsTest, PreAnalyzedFieldManagedSchemaCloudTest, TestSolrCloudSnapshots, ZkNodePropsTest, TestConfigSetProperties, InfixSuggestersTest, HdfsWriteToMultipleCollectionsTest, DistributedSuggestComponentTest, TestUpdate, TestPKIAuthenticationPlugin, TestPushWriter, ZkCLITest, PeerSyncTest, ActionThrottleTest, BasicDistributedZkTest, JSONWriterTest, SchemaVersionSpecificBehaviorTest, EnumFieldTest, TestJsonRequest, TestFieldTypeResource, SoftAutoCommitTest, CoreSorterTest, DocumentAnalysisRequestHandlerTest, RollingRestartTest, TestShardHandlerFactory, TestSolrDynamicMBean, TestWordDelimiterFilterFactory, TestBlendedInfixSuggestions, TestRandomDVFaceting, TestComponentsName, HdfsBasicDistributedZkTest, TestSha256AuthenticationProvider, TestShortCircuitedRequests, SpatialFilterTest, IndexSchemaRuntimeFieldTest, TestBinaryField, HighlighterTest, TestHashPartitioner, HdfsChaosMonkeySafeLeaderTest, TestCursorMarkWithoutUniqueKey, XsltUpdateRequestHandlerTest, SystemInfoHandlerTest, SuggesterFSTTest, HdfsLockFactoryTest, TestFunctionQuery, SimplePostToolTest, DocValuesNotIndexedTest, JavabinLoaderTest, TestStressUserVersions, SOLR749Test, TestExtendedDismaxParser, TestSolrFieldCacheMBean, BufferStoreTest, AddSchemaFieldsUpdateProcessorFactoryTest, TestSweetSpotSimilarityFactory, TestCollationFieldDocValues, TestMultiWordSynonyms, TestTolerantSearch, TestJmxIntegration, SegmentsInfoRequestHandlerTest, DistributedQueueTest, TestStressInPlaceUpdates, AlternateDirectoryTest, PolyFieldTest, DataDrivenBlockJoinTest, TestLRUCache, FastVectorHighlighterTest, DeleteReplicaTest, TestDocumentBuilder, HdfsTlogReplayBufferedWhileIndexingTest, TestExceedMaxTermLength, TestClusterStateMutator, TestRemoteStreaming, LeaderFailoverAfterPartitionTest, DistributedFacetExistsSmallTest, TestMiniSolrCloudClusterSSL, TestPerFieldSimilarity, TestStressVersions, TestConfigSetsAPI, TestDFISimilarityFactory, TestPartialUpdateDeduplication, HdfsNNFailoverTest, SharedFSAutoReplicaFailoverTest, LargeFieldTest, LeaderInitiatedRecoveryOnCommitTest, CdcrReplicationDistributedZkTest, DistributedFacetPivotLongTailTest, PrimitiveFieldTypeTest, TestPivotHelperCode, TestFieldCacheWithThreads, TestOverriddenPrefixQueryForCustomFieldType, TestMiniSolrCloudCluster, SolrTestCaseJ4Test, TimeZoneUtilsTest, TestSolrConfigHandlerConcurrent, StatelessScriptUpdateProcessorFactoryTest, TestSort, TestUseDocValuesAsStored2, HardAutoCommitTest, OverseerStatusTest, TestManagedResource, TestCSVResponseWriter, TestSchemaResource, UpdateLogTest, DeleteStatusTest, TestConfigOverlay, MultiTermTest, TestFastLRUCache, TestLazyCores, ResponseLogComponentTest, DirectUpdateHandlerTest, TestDynamicFieldResource, AnalysisErrorHandlingTest, UniqFieldsUpdateProcessorFactoryTest, TestDownShardTolerantSearch, MigrateRouteKeyTest, TestDistribIDF, TestPhraseSuggestions, TestSchemaVersionResource, TestIBSimilarityFactory, LeaderElectionIntegrationTest, ShardRoutingTest, RecoveryZkTest, TestReplicationHandler, TestDistributedSearch, QueryElevationComponentTest, BadIndexSchemaTest, TestFiltering, TestIndexSearcher, CurrencyFieldXmlFileTest, AnalysisAfterCoreReloadTest, TestFoldingMultitermQuery, DocValuesTest, DebugComponentTest, IndexBasedSpellCheckerTest, LukeRequestHandlerTest, TestValueSourceCache, TermVectorComponentTest, MoreLikeThisHandlerTest, RequiredFieldsTest, TestSolrQueryParser, SolrPluginUtilsTest, ReturnFieldsTest, BinaryUpdateRequestHandlerTest, CSVRequestHandlerTest, TestBinaryResponseWriter, TestLFUCache, BadComponentTest, TestMergePolicyConfig, TestSolrDeletionPolicy2, SampleTest, TestSearchPerf, NumericFieldsTest, MinimalSchemaTest, OutputWriterTest, ExternalFileFieldSortTest, TestSolrCoreProperties, TestPostingsSolrHighlighter, DirectSolrConnectionTest, SpellPossibilityIteratorTest, TestCharFilters, SynonymTokenizerTest, TestXIncludeConfig, EchoParamsTest, ResourceLoaderTest, TestFastOutputStream, ScriptEngineTest, URLClassifyProcessorTest, PluginInfoTest, ChaosMonkeyNothingIsSafeTest, TestSystemIdResolver, DateFieldTest, DOMUtilTest, TestSolrJ, TestUtils, FileUtilsTest, CircularListTest, DistributedMLTComponentTest, TestRTGBase, CursorPagingTest, TestCrossCoreJoin, TestHighlightDedupGrouping, TestSimpleTrackingShardHandler, TestEmbeddedSolrServerConstructors, TestEmbeddedSolrServerSchemaAPI, ConnectionReuseTest, AssignTest, CdcrBootstrapTest, CdcrRequestHandlerTest, CdcrVersionReplicationTest, CleanupOldIndexTest, CollectionReloadTest, ConcurrentDeleteAndCreateCollectionTest, ConnectionManagerTest, CustomCollectionTest]
[junit4] Completed [489/701 (1!)] on J0 in 67.88s, 4 tests, 1 error <<< FAILURES!
[...truncated 44047 lines...]