You are viewing a plain text version of this content. The canonical link for it is here.
Posted to builds@beam.apache.org by Apache Jenkins Server <je...@builds.apache.org> on 2022/09/19 06:11:57 UTC

Build failed in Jenkins: beam_PostCommit_XVR_Samza #1686

See <https://ci-beam.apache.org/job/beam_PostCommit_XVR_Samza/1686/display/redirect>

Changes:


------------------------------------------
[...truncated 1.49 MB...]
INFO     apache_beam.utils.subprocess_server:subprocess_server.py:126 Sep 19, 2022 6:10:16 AM org.apache.beam.sdk.expansion.service.ExpansionService$ExternalTransformRegistrarLoader payloadToConfig
INFO     apache_beam.utils.subprocess_server:subprocess_server.py:126 WARNING: Configuration class 'org.apache.beam.sdk.extensions.sql.expansion.ExternalSqlTransformRegistrar$Configuration' has no schema registered. Attempting to construct with setter approach.
INFO     apache_beam.utils.subprocess_server:subprocess_server.py:126 Sep 19, 2022 6:10:16 AM org.apache.beam.sdk.expansion.service.ExpansionService$ExternalTransformRegistrarLoader payloadToConfig
INFO     apache_beam.utils.subprocess_server:subprocess_server.py:126 WARNING: Configuration class 'org.apache.beam.sdk.extensions.sql.expansion.ExternalSqlTransformRegistrar$Configuration' has no schema registered. Attempting to construct with setter approach.
INFO     apache_beam.utils.subprocess_server:subprocess_server.py:126 Sep 19, 2022 6:10:18 AM org.apache.beam.sdk.extensions.sql.impl.CalciteQueryPlanner convertToBeamRel
INFO     apache_beam.utils.subprocess_server:subprocess_server.py:126 INFO: SQL:
INFO     apache_beam.utils.subprocess_server:subprocess_server.py:126 SELECT `PCOLLECTION`.`a` * `PCOLLECTION`.`a` AS `s`, `LENGTH`(`PCOLLECTION`.`b`) AS `c`
INFO     apache_beam.utils.subprocess_server:subprocess_server.py:126 FROM `beam`.`PCOLLECTION` AS `PCOLLECTION`
INFO     apache_beam.utils.subprocess_server:subprocess_server.py:126 Sep 19, 2022 6:10:18 AM org.apache.beam.sdk.extensions.sql.impl.CalciteQueryPlanner convertToBeamRel
INFO     apache_beam.utils.subprocess_server:subprocess_server.py:126 INFO: SQLPlan>
INFO     apache_beam.utils.subprocess_server:subprocess_server.py:126 LogicalProject(s=[*($0, $0)], c=[LENGTH($1)])
INFO     apache_beam.utils.subprocess_server:subprocess_server.py:126   BeamIOSourceRel(table=[[beam, PCOLLECTION]])
INFO     apache_beam.utils.subprocess_server:subprocess_server.py:126 
INFO     apache_beam.utils.subprocess_server:subprocess_server.py:126 Sep 19, 2022 6:10:18 AM org.apache.beam.sdk.extensions.sql.impl.CalciteQueryPlanner convertToBeamRel
INFO     apache_beam.utils.subprocess_server:subprocess_server.py:126 INFO: BEAMPlan>
INFO     apache_beam.utils.subprocess_server:subprocess_server.py:126 BeamCalcRel(expr#0..1=[{inputs}], expr#2=[*($t0, $t0)], expr#3=[LENGTH($t1)], s=[$t2], c=[$t3])
INFO     apache_beam.utils.subprocess_server:subprocess_server.py:126   BeamIOSourceRel(table=[[beam, PCOLLECTION]])
INFO     apache_beam.utils.subprocess_server:subprocess_server.py:126 
INFO     root:environments.py:376 Default Python SDK image for environment is apache/beam_python3.7_sdk:2.43.0.dev
INFO     root:environments.py:299 No image given, using default Python SDK image
INFO     root:environments.py:376 Default Python SDK image for environment is apache/beam_python3.7_sdk:2.43.0.dev
INFO     root:environments.py:304 Python SDK container image set to "apache/beam_python3.7_sdk:2.43.0.dev" for Docker environment
INFO     apache_beam.runners.portability.fn_api_runner.translations:translations.py:714 ==================== <function pack_combiners at 0x7fa100c0ddd0> ====================
INFO     apache_beam.runners.portability.fn_api_runner.translations:translations.py:714 ==================== <function lift_combiners at 0x7fa100c0de60> ====================
INFO     apache_beam.runners.portability.fn_api_runner.translations:translations.py:714 ==================== <function sort_stages at 0x7fa100c0e5f0> ====================
INFO     apache_beam.runners.portability.portable_runner:portable_runner.py:583 Job state changed to STOPPED
INFO     apache_beam.runners.portability.portable_runner:portable_runner.py:583 Job state changed to STARTING
INFO     apache_beam.runners.portability.portable_runner:portable_runner.py:583 Job state changed to RUNNING
INFO     apache_beam.runners.portability.portable_runner:portable_runner.py:583 Job state changed to DONE
PASSED                                                                   [ 66%]
apache_beam/transforms/sql_test.py::SqlTransformTest::test_tagged_join 
-------------------------------- live log call ---------------------------------
INFO     apache_beam.utils.subprocess_server:subprocess_server.py:239 Using pre-built snapshot at <https://ci-beam.apache.org/job/beam_PostCommit_XVR_Samza/ws/src/sdks/java/extensions/sql/expansion-service/build/libs/beam-sdks-java-extensions-sql-expansion-service-2.43.0-SNAPSHOT.jar>
INFO     root:external.py:773 Starting a JAR-based expansion service from JAR <https://ci-beam.apache.org/job/beam_PostCommit_XVR_Samza/ws/src/sdks/java/extensions/sql/expansion-service/build/libs/beam-sdks-java-extensions-sql-expansion-service-2.43.0-SNAPSHOT.jar> 
INFO     apache_beam.utils.subprocess_server:subprocess_server.py:116 Starting service with ['java' '-jar' '<https://ci-beam.apache.org/job/beam_PostCommit_XVR_Samza/ws/src/sdks/java/extensions/sql/expansion-service/build/libs/beam-sdks-java-extensions-sql-expansion-service-2.43.0-SNAPSHOT.jar'> '57851' '--filesToStage=<https://ci-beam.apache.org/job/beam_PostCommit_XVR_Samza/ws/src/sdks/java/extensions/sql/expansion-service/build/libs/beam-sdks-java-extensions-sql-expansion-service-2.43.0-SNAPSHOT.jar']>
INFO     apache_beam.utils.subprocess_server:subprocess_server.py:126 Starting expansion service at localhost:57851
INFO     apache_beam.utils.subprocess_server:subprocess_server.py:126 Sep 19, 2022 6:10:37 AM org.apache.beam.sdk.expansion.service.ExpansionService loadRegisteredTransforms
INFO     apache_beam.utils.subprocess_server:subprocess_server.py:126 INFO: Registering external transforms: [beam:external:java:sql:v1, beam:transform:org.apache.beam:pubsub_read:v1, beam:transform:org.apache.beam:pubsub_write:v1, beam:transform:org.apache.beam:pubsublite_write:v1, beam:transform:org.apache.beam:pubsublite_read:v1, beam:transform:org.apache.beam:spanner_insert:v1, beam:transform:org.apache.beam:spanner_update:v1, beam:transform:org.apache.beam:spanner_replace:v1, beam:transform:org.apache.beam:spanner_insert_or_update:v1, beam:transform:org.apache.beam:spanner_delete:v1, beam:transform:org.apache.beam:spanner_read:v1, beam:transform:org.apache.beam:kafka_read_with_metadata:v1, beam:transform:org.apache.beam:kafka_read_without_metadata:v1, beam:transform:org.apache.beam:kafka_write:v1, beam:external:java:generate_sequence:v1]
INFO     apache_beam.utils.subprocess_server:subprocess_server.py:126 	beam:external:java:sql:v1: org.apache.beam.sdk.expansion.service.ExpansionService$ExternalTransformRegistrarLoader$1@47eaca72
INFO     apache_beam.utils.subprocess_server:subprocess_server.py:126 	beam:transform:org.apache.beam:pubsub_read:v1: org.apache.beam.sdk.expansion.service.ExpansionService$ExternalTransformRegistrarLoader$1@55141def
INFO     apache_beam.utils.subprocess_server:subprocess_server.py:126 	beam:transform:org.apache.beam:pubsub_write:v1: org.apache.beam.sdk.expansion.service.ExpansionService$ExternalTransformRegistrarLoader$1@55182842
INFO     apache_beam.utils.subprocess_server:subprocess_server.py:126 	beam:transform:org.apache.beam:pubsublite_write:v1: org.apache.beam.sdk.expansion.service.ExpansionService$ExternalTransformRegistrarLoader$1@3270d194
INFO     apache_beam.utils.subprocess_server:subprocess_server.py:126 	beam:transform:org.apache.beam:pubsublite_read:v1: org.apache.beam.sdk.expansion.service.ExpansionService$ExternalTransformRegistrarLoader$1@235834f2
INFO     apache_beam.utils.subprocess_server:subprocess_server.py:126 	beam:transform:org.apache.beam:spanner_insert:v1: org.apache.beam.sdk.expansion.service.ExpansionService$ExternalTransformRegistrarLoader$1@5656be13
INFO     apache_beam.utils.subprocess_server:subprocess_server.py:126 	beam:transform:org.apache.beam:spanner_update:v1: org.apache.beam.sdk.expansion.service.ExpansionService$ExternalTransformRegistrarLoader$1@4218d6a3
INFO     apache_beam.utils.subprocess_server:subprocess_server.py:126 	beam:transform:org.apache.beam:spanner_replace:v1: org.apache.beam.sdk.expansion.service.ExpansionService$ExternalTransformRegistrarLoader$1@76505305
INFO     apache_beam.utils.subprocess_server:subprocess_server.py:126 	beam:transform:org.apache.beam:spanner_insert_or_update:v1: org.apache.beam.sdk.expansion.service.ExpansionService$ExternalTransformRegistrarLoader$1@14cd1699
INFO     apache_beam.utils.subprocess_server:subprocess_server.py:126 	beam:transform:org.apache.beam:spanner_delete:v1: org.apache.beam.sdk.expansion.service.ExpansionService$ExternalTransformRegistrarLoader$1@77888435
INFO     apache_beam.utils.subprocess_server:subprocess_server.py:126 	beam:transform:org.apache.beam:spanner_read:v1: org.apache.beam.sdk.expansion.service.ExpansionService$ExternalTransformRegistrarLoader$1@73a1e9a9
INFO     apache_beam.utils.subprocess_server:subprocess_server.py:126 	beam:transform:org.apache.beam:kafka_read_with_metadata:v1: org.apache.beam.sdk.expansion.service.ExpansionService$ExternalTransformRegistrarLoader$1@71d44a3
INFO     apache_beam.utils.subprocess_server:subprocess_server.py:126 	beam:transform:org.apache.beam:kafka_read_without_metadata:v1: org.apache.beam.sdk.expansion.service.ExpansionService$ExternalTransformRegistrarLoader$1@7b98f307
INFO     apache_beam.utils.subprocess_server:subprocess_server.py:126 	beam:transform:org.apache.beam:kafka_write:v1: org.apache.beam.sdk.expansion.service.ExpansionService$ExternalTransformRegistrarLoader$1@4802796d
INFO     apache_beam.utils.subprocess_server:subprocess_server.py:126 	beam:external:java:generate_sequence:v1: org.apache.beam.sdk.expansion.service.ExpansionService$ExternalTransformRegistrarLoader$1@34123d65
INFO     apache_beam.utils.subprocess_server:subprocess_server.py:126 Sep 19, 2022 6:10:39 AM org.apache.beam.sdk.expansion.service.ExpansionService expand
INFO     apache_beam.utils.subprocess_server:subprocess_server.py:126 INFO: Expanding 'SqlTransform(beam:external:java:sql:v1)' with URN 'beam:external:java:sql:v1'
INFO     apache_beam.utils.subprocess_server:subprocess_server.py:126 Sep 19, 2022 6:10:39 AM org.apache.beam.sdk.expansion.service.ExpansionService$ExternalTransformRegistrarLoader payloadToConfig
INFO     apache_beam.utils.subprocess_server:subprocess_server.py:126 WARNING: Configuration class 'org.apache.beam.sdk.extensions.sql.expansion.ExternalSqlTransformRegistrar$Configuration' has no schema registered. Attempting to construct with setter approach.
INFO     apache_beam.utils.subprocess_server:subprocess_server.py:126 Sep 19, 2022 6:10:39 AM org.apache.beam.sdk.expansion.service.ExpansionService$ExternalTransformRegistrarLoader payloadToConfig
INFO     apache_beam.utils.subprocess_server:subprocess_server.py:126 WARNING: Configuration class 'org.apache.beam.sdk.extensions.sql.expansion.ExternalSqlTransformRegistrar$Configuration' has no schema registered. Attempting to construct with setter approach.
INFO     apache_beam.utils.subprocess_server:subprocess_server.py:126 Sep 19, 2022 6:10:41 AM org.apache.beam.sdk.extensions.sql.impl.CalciteQueryPlanner convertToBeamRel
INFO     apache_beam.utils.subprocess_server:subprocess_server.py:126 INFO: SQL:
INFO     apache_beam.utils.subprocess_server:subprocess_server.py:126 SELECT `simple`.`id` AS `id`, `enrich`.`metadata` AS `metadata`
INFO     apache_beam.utils.subprocess_server:subprocess_server.py:126 FROM `beam`.`simple` AS `simple`
INFO     apache_beam.utils.subprocess_server:subprocess_server.py:126 INNER JOIN `beam`.`enrich` AS `enrich` ON `simple`.`id` = `enrich`.`id`
INFO     apache_beam.utils.subprocess_server:subprocess_server.py:126 Sep 19, 2022 6:10:41 AM org.apache.beam.sdk.extensions.sql.impl.CalciteQueryPlanner convertToBeamRel
INFO     apache_beam.utils.subprocess_server:subprocess_server.py:126 INFO: SQLPlan>
INFO     apache_beam.utils.subprocess_server:subprocess_server.py:126 LogicalProject(id=[$0], metadata=[$4])
INFO     apache_beam.utils.subprocess_server:subprocess_server.py:126   LogicalJoin(condition=[=($0, $3)], joinType=[inner])
INFO     apache_beam.utils.subprocess_server:subprocess_server.py:126     BeamIOSourceRel(table=[[beam, simple]])
INFO     apache_beam.utils.subprocess_server:subprocess_server.py:126     BeamIOSourceRel(table=[[beam, enrich]])
INFO     apache_beam.utils.subprocess_server:subprocess_server.py:126 
INFO     apache_beam.utils.subprocess_server:subprocess_server.py:126 Sep 19, 2022 6:10:42 AM org.apache.beam.sdk.extensions.sql.impl.CalciteQueryPlanner convertToBeamRel
INFO     apache_beam.utils.subprocess_server:subprocess_server.py:126 INFO: BEAMPlan>
INFO     apache_beam.utils.subprocess_server:subprocess_server.py:126 BeamCalcRel(expr#0..4=[{inputs}], id=[$t0], metadata=[$t4])
INFO     apache_beam.utils.subprocess_server:subprocess_server.py:126   BeamCoGBKJoinRel(condition=[=($0, $3)], joinType=[inner])
INFO     apache_beam.utils.subprocess_server:subprocess_server.py:126     BeamIOSourceRel(table=[[beam, simple]])
INFO     apache_beam.utils.subprocess_server:subprocess_server.py:126     BeamIOSourceRel(table=[[beam, enrich]])
INFO     apache_beam.utils.subprocess_server:subprocess_server.py:126 
INFO     root:environments.py:376 Default Python SDK image for environment is apache/beam_python3.7_sdk:2.43.0.dev
INFO     root:environments.py:299 No image given, using default Python SDK image
INFO     root:environments.py:376 Default Python SDK image for environment is apache/beam_python3.7_sdk:2.43.0.dev
INFO     root:environments.py:304 Python SDK container image set to "apache/beam_python3.7_sdk:2.43.0.dev" for Docker environment
INFO     apache_beam.runners.portability.fn_api_runner.translations:translations.py:714 ==================== <function pack_combiners at 0x7fa100c0ddd0> ====================
INFO     apache_beam.runners.portability.fn_api_runner.translations:translations.py:714 ==================== <function lift_combiners at 0x7fa100c0de60> ====================
INFO     apache_beam.runners.portability.fn_api_runner.translations:translations.py:714 ==================== <function sort_stages at 0x7fa100c0e5f0> ====================
INFO     apache_beam.runners.portability.portable_runner:portable_runner.py:583 Job state changed to STOPPED
INFO     apache_beam.runners.portability.portable_runner:portable_runner.py:583 Job state changed to STARTING
INFO     apache_beam.runners.portability.portable_runner:portable_runner.py:583 Job state changed to RUNNING
INFO     apache_beam.runners.portability.portable_runner:portable_runner.py:583 Job state changed to DONE
PASSED                                                                   [ 77%]
apache_beam/transforms/sql_test.py::SqlTransformTest::test_windowing_before_sql 
-------------------------------- live log call ---------------------------------
INFO     apache_beam.utils.subprocess_server:subprocess_server.py:239 Using pre-built snapshot at <https://ci-beam.apache.org/job/beam_PostCommit_XVR_Samza/ws/src/sdks/java/extensions/sql/expansion-service/build/libs/beam-sdks-java-extensions-sql-expansion-service-2.43.0-SNAPSHOT.jar>
INFO     root:external.py:773 Starting a JAR-based expansion service from JAR <https://ci-beam.apache.org/job/beam_PostCommit_XVR_Samza/ws/src/sdks/java/extensions/sql/expansion-service/build/libs/beam-sdks-java-extensions-sql-expansion-service-2.43.0-SNAPSHOT.jar> 
INFO     apache_beam.utils.subprocess_server:subprocess_server.py:116 Starting service with ['java' '-jar' '<https://ci-beam.apache.org/job/beam_PostCommit_XVR_Samza/ws/src/sdks/java/extensions/sql/expansion-service/build/libs/beam-sdks-java-extensions-sql-expansion-service-2.43.0-SNAPSHOT.jar'> '51825' '--filesToStage=<https://ci-beam.apache.org/job/beam_PostCommit_XVR_Samza/ws/src/sdks/java/extensions/sql/expansion-service/build/libs/beam-sdks-java-extensions-sql-expansion-service-2.43.0-SNAPSHOT.jar']>
INFO     apache_beam.utils.subprocess_server:subprocess_server.py:126 Starting expansion service at localhost:51825
INFO     apache_beam.utils.subprocess_server:subprocess_server.py:126 Sep 19, 2022 6:11:01 AM org.apache.beam.sdk.expansion.service.ExpansionService loadRegisteredTransforms
INFO     apache_beam.utils.subprocess_server:subprocess_server.py:126 INFO: Registering external transforms: [beam:external:java:sql:v1, beam:transform:org.apache.beam:pubsub_read:v1, beam:transform:org.apache.beam:pubsub_write:v1, beam:transform:org.apache.beam:pubsublite_write:v1, beam:transform:org.apache.beam:pubsublite_read:v1, beam:transform:org.apache.beam:spanner_insert:v1, beam:transform:org.apache.beam:spanner_update:v1, beam:transform:org.apache.beam:spanner_replace:v1, beam:transform:org.apache.beam:spanner_insert_or_update:v1, beam:transform:org.apache.beam:spanner_delete:v1, beam:transform:org.apache.beam:spanner_read:v1, beam:transform:org.apache.beam:kafka_read_with_metadata:v1, beam:transform:org.apache.beam:kafka_read_without_metadata:v1, beam:transform:org.apache.beam:kafka_write:v1, beam:external:java:generate_sequence:v1]
INFO     apache_beam.utils.subprocess_server:subprocess_server.py:126 	beam:external:java:sql:v1: org.apache.beam.sdk.expansion.service.ExpansionService$ExternalTransformRegistrarLoader$1@47eaca72
INFO     apache_beam.utils.subprocess_server:subprocess_server.py:126 	beam:transform:org.apache.beam:pubsub_read:v1: org.apache.beam.sdk.expansion.service.ExpansionService$ExternalTransformRegistrarLoader$1@55141def
INFO     apache_beam.utils.subprocess_server:subprocess_server.py:126 	beam:transform:org.apache.beam:pubsub_write:v1: org.apache.beam.sdk.expansion.service.ExpansionService$ExternalTransformRegistrarLoader$1@55182842
INFO     apache_beam.utils.subprocess_server:subprocess_server.py:126 	beam:transform:org.apache.beam:pubsublite_write:v1: org.apache.beam.sdk.expansion.service.ExpansionService$ExternalTransformRegistrarLoader$1@3270d194
INFO     apache_beam.utils.subprocess_server:subprocess_server.py:126 	beam:transform:org.apache.beam:pubsublite_read:v1: org.apache.beam.sdk.expansion.service.ExpansionService$ExternalTransformRegistrarLoader$1@235834f2
INFO     apache_beam.utils.subprocess_server:subprocess_server.py:126 	beam:transform:org.apache.beam:spanner_insert:v1: org.apache.beam.sdk.expansion.service.ExpansionService$ExternalTransformRegistrarLoader$1@5656be13
INFO     apache_beam.utils.subprocess_server:subprocess_server.py:126 	beam:transform:org.apache.beam:spanner_update:v1: org.apache.beam.sdk.expansion.service.ExpansionService$ExternalTransformRegistrarLoader$1@4218d6a3
INFO     apache_beam.utils.subprocess_server:subprocess_server.py:126 	beam:transform:org.apache.beam:spanner_replace:v1: org.apache.beam.sdk.expansion.service.ExpansionService$ExternalTransformRegistrarLoader$1@76505305
INFO     apache_beam.utils.subprocess_server:subprocess_server.py:126 	beam:transform:org.apache.beam:spanner_insert_or_update:v1: org.apache.beam.sdk.expansion.service.ExpansionService$ExternalTransformRegistrarLoader$1@14cd1699
INFO     apache_beam.utils.subprocess_server:subprocess_server.py:126 	beam:transform:org.apache.beam:spanner_delete:v1: org.apache.beam.sdk.expansion.service.ExpansionService$ExternalTransformRegistrarLoader$1@77888435
INFO     apache_beam.utils.subprocess_server:subprocess_server.py:126 	beam:transform:org.apache.beam:spanner_read:v1: org.apache.beam.sdk.expansion.service.ExpansionService$ExternalTransformRegistrarLoader$1@73a1e9a9
INFO     apache_beam.utils.subprocess_server:subprocess_server.py:126 	beam:transform:org.apache.beam:kafka_read_with_metadata:v1: org.apache.beam.sdk.expansion.service.ExpansionService$ExternalTransformRegistrarLoader$1@71d44a3
INFO     apache_beam.utils.subprocess_server:subprocess_server.py:126 	beam:transform:org.apache.beam:kafka_read_without_metadata:v1: org.apache.beam.sdk.expansion.service.ExpansionService$ExternalTransformRegistrarLoader$1@7b98f307
INFO     apache_beam.utils.subprocess_server:subprocess_server.py:126 	beam:transform:org.apache.beam:kafka_write:v1: org.apache.beam.sdk.expansion.service.ExpansionService$ExternalTransformRegistrarLoader$1@4802796d
INFO     apache_beam.utils.subprocess_server:subprocess_server.py:126 	beam:external:java:generate_sequence:v1: org.apache.beam.sdk.expansion.service.ExpansionService$ExternalTransformRegistrarLoader$1@34123d65
INFO     apache_beam.utils.subprocess_server:subprocess_server.py:126 Sep 19, 2022 6:11:03 AM org.apache.beam.sdk.expansion.service.ExpansionService expand
INFO     apache_beam.utils.subprocess_server:subprocess_server.py:126 INFO: Expanding 'SqlTransform(beam:external:java:sql:v1)' with URN 'beam:external:java:sql:v1'
INFO     apache_beam.utils.subprocess_server:subprocess_server.py:126 Sep 19, 2022 6:11:03 AM org.apache.beam.sdk.expansion.service.ExpansionService$ExternalTransformRegistrarLoader payloadToConfig
INFO     apache_beam.utils.subprocess_server:subprocess_server.py:126 WARNING: Configuration class 'org.apache.beam.sdk.extensions.sql.expansion.ExternalSqlTransformRegistrar$Configuration' has no schema registered. Attempting to construct with setter approach.
INFO     apache_beam.utils.subprocess_server:subprocess_server.py:126 Sep 19, 2022 6:11:03 AM org.apache.beam.sdk.expansion.service.ExpansionService$ExternalTransformRegistrarLoader payloadToConfig
INFO     apache_beam.utils.subprocess_server:subprocess_server.py:126 WARNING: Configuration class 'org.apache.beam.sdk.extensions.sql.expansion.ExternalSqlTransformRegistrar$Configuration' has no schema registered. Attempting to construct with setter approach.
INFO     apache_beam.utils.subprocess_server:subprocess_server.py:126 Sep 19, 2022 6:11:05 AM org.apache.beam.sdk.extensions.sql.impl.CalciteQueryPlanner convertToBeamRel
INFO     apache_beam.utils.subprocess_server:subprocess_server.py:126 INFO: SQL:
INFO     apache_beam.utils.subprocess_server:subprocess_server.py:126 SELECT COUNT(*) AS `count`
INFO     apache_beam.utils.subprocess_server:subprocess_server.py:126 FROM `beam`.`PCOLLECTION` AS `PCOLLECTION`
INFO     apache_beam.utils.subprocess_server:subprocess_server.py:126 Sep 19, 2022 6:11:05 AM org.apache.beam.sdk.extensions.sql.impl.CalciteQueryPlanner convertToBeamRel
INFO     apache_beam.utils.subprocess_server:subprocess_server.py:126 INFO: SQLPlan>
INFO     apache_beam.utils.subprocess_server:subprocess_server.py:126 LogicalAggregate(group=[{}], count=[COUNT()])
INFO     apache_beam.utils.subprocess_server:subprocess_server.py:126   BeamIOSourceRel(table=[[beam, PCOLLECTION]])
INFO     apache_beam.utils.subprocess_server:subprocess_server.py:126 
INFO     apache_beam.utils.subprocess_server:subprocess_server.py:126 Sep 19, 2022 6:11:06 AM org.apache.beam.sdk.extensions.sql.impl.CalciteQueryPlanner convertToBeamRel
INFO     apache_beam.utils.subprocess_server:subprocess_server.py:126 INFO: BEAMPlan>
INFO     apache_beam.utils.subprocess_server:subprocess_server.py:126 BeamAggregationRel(group=[{}], count=[COUNT()])
INFO     apache_beam.utils.subprocess_server:subprocess_server.py:126   BeamIOSourceRel(table=[[beam, PCOLLECTION]])
INFO     apache_beam.utils.subprocess_server:subprocess_server.py:126 
INFO     root:environments.py:376 Default Python SDK image for environment is apache/beam_python3.7_sdk:2.43.0.dev
INFO     root:environments.py:299 No image given, using default Python SDK image
INFO     root:environments.py:376 Default Python SDK image for environment is apache/beam_python3.7_sdk:2.43.0.dev
INFO     root:environments.py:304 Python SDK container image set to "apache/beam_python3.7_sdk:2.43.0.dev" for Docker environment
INFO     apache_beam.runners.portability.fn_api_runner.translations:translations.py:714 ==================== <function pack_combiners at 0x7fa100c0ddd0> ====================
INFO     apache_beam.runners.portability.fn_api_runner.translations:translations.py:714 ==================== <function lift_combiners at 0x7fa100c0de60> ====================
INFO     apache_beam.runners.portability.fn_api_runner.translations:translations.py:714 ==================== <function sort_stages at 0x7fa100c0e5f0> ====================
INFO     apache_beam.runners.portability.portable_runner:portable_runner.py:583 Job state changed to STOPPED
INFO     apache_beam.runners.portability.portable_runner:portable_runner.py:583 Job state changed to STARTING
INFO     apache_beam.runners.portability.portable_runner:portable_runner.py:583 Job state changed to RUNNING
INFO     apache_beam.runners.portability.portable_runner:portable_runner.py:583 Job state changed to DONE
PASSED                                                                   [ 88%]
apache_beam/transforms/sql_test.py::SqlTransformTest::test_zetasql_generate_data 
-------------------------------- live log call ---------------------------------
INFO     apache_beam.utils.subprocess_server:subprocess_server.py:239 Using pre-built snapshot at <https://ci-beam.apache.org/job/beam_PostCommit_XVR_Samza/ws/src/sdks/java/extensions/sql/expansion-service/build/libs/beam-sdks-java-extensions-sql-expansion-service-2.43.0-SNAPSHOT.jar>
INFO     root:external.py:773 Starting a JAR-based expansion service from JAR <https://ci-beam.apache.org/job/beam_PostCommit_XVR_Samza/ws/src/sdks/java/extensions/sql/expansion-service/build/libs/beam-sdks-java-extensions-sql-expansion-service-2.43.0-SNAPSHOT.jar> 
INFO     apache_beam.utils.subprocess_server:subprocess_server.py:116 Starting service with ['java' '-jar' '<https://ci-beam.apache.org/job/beam_PostCommit_XVR_Samza/ws/src/sdks/java/extensions/sql/expansion-service/build/libs/beam-sdks-java-extensions-sql-expansion-service-2.43.0-SNAPSHOT.jar'> '60493' '--filesToStage=<https://ci-beam.apache.org/job/beam_PostCommit_XVR_Samza/ws/src/sdks/java/extensions/sql/expansion-service/build/libs/beam-sdks-java-extensions-sql-expansion-service-2.43.0-SNAPSHOT.jar']>
INFO     apache_beam.utils.subprocess_server:subprocess_server.py:126 Starting expansion service at localhost:60493
INFO     apache_beam.utils.subprocess_server:subprocess_server.py:126 Sep 19, 2022 6:11:25 AM org.apache.beam.sdk.expansion.service.ExpansionService loadRegisteredTransforms
INFO     apache_beam.utils.subprocess_server:subprocess_server.py:126 INFO: Registering external transforms: [beam:external:java:sql:v1, beam:transform:org.apache.beam:pubsub_read:v1, beam:transform:org.apache.beam:pubsub_write:v1, beam:transform:org.apache.beam:pubsublite_write:v1, beam:transform:org.apache.beam:pubsublite_read:v1, beam:transform:org.apache.beam:spanner_insert:v1, beam:transform:org.apache.beam:spanner_update:v1, beam:transform:org.apache.beam:spanner_replace:v1, beam:transform:org.apache.beam:spanner_insert_or_update:v1, beam:transform:org.apache.beam:spanner_delete:v1, beam:transform:org.apache.beam:spanner_read:v1, beam:transform:org.apache.beam:kafka_read_with_metadata:v1, beam:transform:org.apache.beam:kafka_read_without_metadata:v1, beam:transform:org.apache.beam:kafka_write:v1, beam:external:java:generate_sequence:v1]
INFO     apache_beam.utils.subprocess_server:subprocess_server.py:126 	beam:external:java:sql:v1: org.apache.beam.sdk.expansion.service.ExpansionService$ExternalTransformRegistrarLoader$1@47eaca72
INFO     apache_beam.utils.subprocess_server:subprocess_server.py:126 	beam:transform:org.apache.beam:pubsub_read:v1: org.apache.beam.sdk.expansion.service.ExpansionService$ExternalTransformRegistrarLoader$1@55141def
INFO     apache_beam.utils.subprocess_server:subprocess_server.py:126 	beam:transform:org.apache.beam:pubsub_write:v1: org.apache.beam.sdk.expansion.service.ExpansionService$ExternalTransformRegistrarLoader$1@55182842
INFO     apache_beam.utils.subprocess_server:subprocess_server.py:126 	beam:transform:org.apache.beam:pubsublite_write:v1: org.apache.beam.sdk.expansion.service.ExpansionService$ExternalTransformRegistrarLoader$1@3270d194
INFO     apache_beam.utils.subprocess_server:subprocess_server.py:126 	beam:transform:org.apache.beam:pubsublite_read:v1: org.apache.beam.sdk.expansion.service.ExpansionService$ExternalTransformRegistrarLoader$1@235834f2
INFO     apache_beam.utils.subprocess_server:subprocess_server.py:126 	beam:transform:org.apache.beam:spanner_insert:v1: org.apache.beam.sdk.expansion.service.ExpansionService$ExternalTransformRegistrarLoader$1@5656be13
INFO     apache_beam.utils.subprocess_server:subprocess_server.py:126 	beam:transform:org.apache.beam:spanner_update:v1: org.apache.beam.sdk.expansion.service.ExpansionService$ExternalTransformRegistrarLoader$1@4218d6a3
INFO     apache_beam.utils.subprocess_server:subprocess_server.py:126 	beam:transform:org.apache.beam:spanner_replace:v1: org.apache.beam.sdk.expansion.service.ExpansionService$ExternalTransformRegistrarLoader$1@76505305
INFO     apache_beam.utils.subprocess_server:subprocess_server.py:126 	beam:transform:org.apache.beam:spanner_insert_or_update:v1: org.apache.beam.sdk.expansion.service.ExpansionService$ExternalTransformRegistrarLoader$1@14cd1699
INFO     apache_beam.utils.subprocess_server:subprocess_server.py:126 	beam:transform:org.apache.beam:spanner_delete:v1: org.apache.beam.sdk.expansion.service.ExpansionService$ExternalTransformRegistrarLoader$1@77888435
INFO     apache_beam.utils.subprocess_server:subprocess_server.py:126 	beam:transform:org.apache.beam:spanner_read:v1: org.apache.beam.sdk.expansion.service.ExpansionService$ExternalTransformRegistrarLoader$1@73a1e9a9
INFO     apache_beam.utils.subprocess_server:subprocess_server.py:126 	beam:transform:org.apache.beam:kafka_read_with_metadata:v1: org.apache.beam.sdk.expansion.service.ExpansionService$ExternalTransformRegistrarLoader$1@71d44a3
INFO     apache_beam.utils.subprocess_server:subprocess_server.py:126 	beam:transform:org.apache.beam:kafka_read_without_metadata:v1: org.apache.beam.sdk.expansion.service.ExpansionService$ExternalTransformRegistrarLoader$1@7b98f307
INFO     apache_beam.utils.subprocess_server:subprocess_server.py:126 	beam:transform:org.apache.beam:kafka_write:v1: org.apache.beam.sdk.expansion.service.ExpansionService$ExternalTransformRegistrarLoader$1@4802796d
INFO     apache_beam.utils.subprocess_server:subprocess_server.py:126 	beam:external:java:generate_sequence:v1: org.apache.beam.sdk.expansion.service.ExpansionService$ExternalTransformRegistrarLoader$1@34123d65
INFO     apache_beam.utils.subprocess_server:subprocess_server.py:126 Sep 19, 2022 6:11:26 AM org.apache.beam.sdk.expansion.service.ExpansionService expand
INFO     apache_beam.utils.subprocess_server:subprocess_server.py:126 INFO: Expanding 'SqlTransform(beam:external:java:sql:v1)' with URN 'beam:external:java:sql:v1'
INFO     apache_beam.utils.subprocess_server:subprocess_server.py:126 Sep 19, 2022 6:11:26 AM org.apache.beam.sdk.expansion.service.ExpansionService$ExternalTransformRegistrarLoader payloadToConfig
INFO     apache_beam.utils.subprocess_server:subprocess_server.py:126 WARNING: Configuration class 'org.apache.beam.sdk.extensions.sql.expansion.ExternalSqlTransformRegistrar$Configuration' has no schema registered. Attempting to construct with setter approach.
INFO     apache_beam.utils.subprocess_server:subprocess_server.py:126 Sep 19, 2022 6:11:27 AM org.apache.beam.sdk.expansion.service.ExpansionService$ExternalTransformRegistrarLoader payloadToConfig
INFO     apache_beam.utils.subprocess_server:subprocess_server.py:126 WARNING: Configuration class 'org.apache.beam.sdk.extensions.sql.expansion.ExternalSqlTransformRegistrar$Configuration' has no schema registered. Attempting to construct with setter approach.
INFO     apache_beam.utils.subprocess_server:subprocess_server.py:126 Sep 19, 2022 6:11:29 AM com.google.zetasql.io.grpc.NameResolverRegistry getDefaultRegistry
INFO     apache_beam.utils.subprocess_server:subprocess_server.py:126 WARNING: No NameResolverProviders found via ServiceLoader, including for DNS. This is probably due to a broken build. If using ProGuard, check your configuration
INFO     apache_beam.utils.subprocess_server:subprocess_server.py:126 Sep 19, 2022 6:11:30 AM org.apache.beam.sdk.extensions.sql.zetasql.ZetaSQLQueryPlanner convertToBeamRelInternal
INFO     apache_beam.utils.subprocess_server:subprocess_server.py:126 INFO: BEAMPlan>
INFO     apache_beam.utils.subprocess_server:subprocess_server.py:126 BeamZetaSqlCalcRel(expr#0=[{inputs}], expr#1=[1:BIGINT], expr#2=['foo':VARCHAR], expr#3=[3.1400000000000001243E0:DOUBLE], int=[$t1], str=[$t2], flt=[$t3])
INFO     apache_beam.utils.subprocess_server:subprocess_server.py:126   BeamValuesRel(tuples=[[{ 0 }]])
INFO     apache_beam.utils.subprocess_server:subprocess_server.py:126 
INFO     root:environments.py:376 Default Python SDK image for environment is apache/beam_python3.7_sdk:2.43.0.dev
INFO     root:environments.py:299 No image given, using default Python SDK image
INFO     root:environments.py:376 Default Python SDK image for environment is apache/beam_python3.7_sdk:2.43.0.dev
INFO     root:environments.py:304 Python SDK container image set to "apache/beam_python3.7_sdk:2.43.0.dev" for Docker environment
INFO     apache_beam.runners.portability.fn_api_runner.translations:translations.py:714 ==================== <function pack_combiners at 0x7fa100c0ddd0> ====================
INFO     apache_beam.runners.portability.fn_api_runner.translations:translations.py:714 ==================== <function lift_combiners at 0x7fa100c0de60> ====================
INFO     apache_beam.runners.portability.fn_api_runner.translations:translations.py:714 ==================== <function sort_stages at 0x7fa100c0e5f0> ====================
INFO     apache_beam.runners.portability.portable_runner:portable_runner.py:583 Job state changed to STOPPED
INFO     apache_beam.runners.portability.portable_runner:portable_runner.py:583 Job state changed to STARTING
INFO     apache_beam.runners.portability.portable_runner:portable_runner.py:583 Job state changed to RUNNING
INFO     apache_beam.runners.portability.portable_runner:portable_runner.py:583 Job state changed to DONE
PASSED                                                                   [100%]

=============================== warnings summary ===============================
../../build/gradleenv/1922375555/lib/python3.7/site-packages/hdfs/config.py:15
  <https://ci-beam.apache.org/job/beam_PostCommit_XVR_Samza/ws/src/build/gradleenv/1922375555/lib/python3.7/site-packages/hdfs/config.py>:15: DeprecationWarning: the imp module is deprecated in favour of importlib; see the module's documentation for alternative uses
    from imp import load_source

../../build/gradleenv/1922375555/lib/python3.7/site-packages/google/api_core/grpc_helpers.py:42
  <https://ci-beam.apache.org/job/beam_PostCommit_XVR_Samza/ws/src/build/gradleenv/1922375555/lib/python3.7/site-packages/google/api_core/grpc_helpers.py>:42: DeprecationWarning: Support for grpcio-gcp is deprecated. This feature will be
              removed from `google-api-core` after January 1, 2024. If you need to
              continue to use this feature, please pin to a specific version of
              `google-api-core`.
    DeprecationWarning,

-- Docs: https://docs.pytest.org/en/stable/how-to/capture-warnings.html
- generated xml file: <https://ci-beam.apache.org/job/beam_PostCommit_XVR_Samza/ws/src/sdks/python/pytest_xlangSqlValidateRunner.xml> -
==== 9 passed, 3 skipped, 6661 deselected, 2 warnings in 225.83s (0:03:45) =====

> Task :runners:samza:job-server:samzaJobServerCleanup
Stopping job server pid: 1701916.

> Task :runners:samza:job-server:validatesCrossLanguageRunnerCleanup
Stopping expansion service pid: 1712005.
Stopping expansion service pid: 1712006.

FAILURE: Build failed with an exception.

* Where:
Build file '<https://ci-beam.apache.org/job/beam_PostCommit_XVR_Samza/ws/src/sdks/go/test/build.gradle'> line: 195

* What went wrong:
Execution failed for task ':runners:samza:job-server:validatesCrossLanguageRunnerGoUsingJava'.
> Process 'command 'sh'' finished with non-zero exit value 1

* Try:
> Run with --stacktrace option to get the stack trace.
> Run with --info or --debug option to get more log output.

* Get more help at https://help.gradle.org

Deprecated Gradle features were used in this build, making it incompatible with Gradle 8.0.

You can use '--warning-mode all' to show the individual deprecation warnings and determine if they come from your own scripts or plugins.

See https://docs.gradle.org/7.5.1/userguide/command_line_interface.html#sec:command_line_warnings

Execution optimizations have been disabled for 1 invalid unit(s) of work during this build to ensure correctness.
Please consult deprecation warnings for more details.

BUILD FAILED in 29m 28s
260 actionable tasks: 171 executed, 77 from cache, 12 up-to-date

Publishing build scan...
https://gradle.com/s/ookr5yofxhutg

Build step 'Invoke Gradle script' changed build result to FAILURE
Build step 'Invoke Gradle script' marked build as failure

---------------------------------------------------------------------
To unsubscribe, e-mail: builds-unsubscribe@beam.apache.org
For additional commands, e-mail: builds-help@beam.apache.org


Jenkins build is back to normal : beam_PostCommit_XVR_Samza #1690

Posted by Apache Jenkins Server <je...@builds.apache.org>.
See <https://ci-beam.apache.org/job/beam_PostCommit_XVR_Samza/1690/display/redirect?page=changes>


---------------------------------------------------------------------
To unsubscribe, e-mail: builds-unsubscribe@beam.apache.org
For additional commands, e-mail: builds-help@beam.apache.org


Build failed in Jenkins: beam_PostCommit_XVR_Samza #1689

Posted by Apache Jenkins Server <je...@builds.apache.org>.
See <https://ci-beam.apache.org/job/beam_PostCommit_XVR_Samza/1689/display/redirect?page=changes>

Changes:

[noreply] [BEAM-13416] Introduce Schema provider for AWS models and deprecate low


------------------------------------------
[...truncated 1.43 MB...]
INFO     apache_beam.utils.subprocess_server:subprocess_server.py:116 Starting service with ['java' '-jar' '<https://ci-beam.apache.org/job/beam_PostCommit_XVR_Samza/ws/src/sdks/java/extensions/sql/expansion-service/build/libs/beam-sdks-java-extensions-sql-expansion-service-2.43.0-SNAPSHOT.jar'> '39039' '--filesToStage=<https://ci-beam.apache.org/job/beam_PostCommit_XVR_Samza/ws/src/sdks/java/extensions/sql/expansion-service/build/libs/beam-sdks-java-extensions-sql-expansion-service-2.43.0-SNAPSHOT.jar']>
INFO     apache_beam.utils.subprocess_server:subprocess_server.py:126 Starting expansion service at localhost:39039
INFO     apache_beam.utils.subprocess_server:subprocess_server.py:126 Sep 20, 2022 12:08:46 AM org.apache.beam.sdk.expansion.service.ExpansionService loadRegisteredTransforms
INFO     apache_beam.utils.subprocess_server:subprocess_server.py:126 INFO: Registering external transforms: [beam:external:java:sql:v1, beam:transform:org.apache.beam:pubsub_read:v1, beam:transform:org.apache.beam:pubsub_write:v1, beam:transform:org.apache.beam:pubsublite_write:v1, beam:transform:org.apache.beam:pubsublite_read:v1, beam:transform:org.apache.beam:spanner_insert:v1, beam:transform:org.apache.beam:spanner_update:v1, beam:transform:org.apache.beam:spanner_replace:v1, beam:transform:org.apache.beam:spanner_insert_or_update:v1, beam:transform:org.apache.beam:spanner_delete:v1, beam:transform:org.apache.beam:spanner_read:v1, beam:transform:org.apache.beam:kafka_read_with_metadata:v1, beam:transform:org.apache.beam:kafka_read_without_metadata:v1, beam:transform:org.apache.beam:kafka_write:v1, beam:external:java:generate_sequence:v1]
INFO     apache_beam.utils.subprocess_server:subprocess_server.py:126 	beam:external:java:sql:v1: org.apache.beam.sdk.expansion.service.ExpansionService$ExternalTransformRegistrarLoader$1@47eaca72
INFO     apache_beam.utils.subprocess_server:subprocess_server.py:126 	beam:transform:org.apache.beam:pubsub_read:v1: org.apache.beam.sdk.expansion.service.ExpansionService$ExternalTransformRegistrarLoader$1@55141def
INFO     apache_beam.utils.subprocess_server:subprocess_server.py:126 	beam:transform:org.apache.beam:pubsub_write:v1: org.apache.beam.sdk.expansion.service.ExpansionService$ExternalTransformRegistrarLoader$1@55182842
INFO     apache_beam.utils.subprocess_server:subprocess_server.py:126 	beam:transform:org.apache.beam:pubsublite_write:v1: org.apache.beam.sdk.expansion.service.ExpansionService$ExternalTransformRegistrarLoader$1@3270d194
INFO     apache_beam.utils.subprocess_server:subprocess_server.py:126 	beam:transform:org.apache.beam:pubsublite_read:v1: org.apache.beam.sdk.expansion.service.ExpansionService$ExternalTransformRegistrarLoader$1@235834f2
INFO     apache_beam.utils.subprocess_server:subprocess_server.py:126 	beam:transform:org.apache.beam:spanner_insert:v1: org.apache.beam.sdk.expansion.service.ExpansionService$ExternalTransformRegistrarLoader$1@5656be13
INFO     apache_beam.utils.subprocess_server:subprocess_server.py:126 	beam:transform:org.apache.beam:spanner_update:v1: org.apache.beam.sdk.expansion.service.ExpansionService$ExternalTransformRegistrarLoader$1@4218d6a3
INFO     apache_beam.utils.subprocess_server:subprocess_server.py:126 	beam:transform:org.apache.beam:spanner_replace:v1: org.apache.beam.sdk.expansion.service.ExpansionService$ExternalTransformRegistrarLoader$1@76505305
INFO     apache_beam.utils.subprocess_server:subprocess_server.py:126 	beam:transform:org.apache.beam:spanner_insert_or_update:v1: org.apache.beam.sdk.expansion.service.ExpansionService$ExternalTransformRegistrarLoader$1@14cd1699
INFO     apache_beam.utils.subprocess_server:subprocess_server.py:126 	beam:transform:org.apache.beam:spanner_delete:v1: org.apache.beam.sdk.expansion.service.ExpansionService$ExternalTransformRegistrarLoader$1@77888435
INFO     apache_beam.utils.subprocess_server:subprocess_server.py:126 	beam:transform:org.apache.beam:spanner_read:v1: org.apache.beam.sdk.expansion.service.ExpansionService$ExternalTransformRegistrarLoader$1@73a1e9a9
INFO     apache_beam.utils.subprocess_server:subprocess_server.py:126 	beam:transform:org.apache.beam:kafka_read_with_metadata:v1: org.apache.beam.sdk.expansion.service.ExpansionService$ExternalTransformRegistrarLoader$1@71d44a3
INFO     apache_beam.utils.subprocess_server:subprocess_server.py:126 	beam:transform:org.apache.beam:kafka_read_without_metadata:v1: org.apache.beam.sdk.expansion.service.ExpansionService$ExternalTransformRegistrarLoader$1@7b98f307
INFO     apache_beam.utils.subprocess_server:subprocess_server.py:126 	beam:transform:org.apache.beam:kafka_write:v1: org.apache.beam.sdk.expansion.service.ExpansionService$ExternalTransformRegistrarLoader$1@4802796d
INFO     apache_beam.utils.subprocess_server:subprocess_server.py:126 	beam:external:java:generate_sequence:v1: org.apache.beam.sdk.expansion.service.ExpansionService$ExternalTransformRegistrarLoader$1@34123d65
INFO     apache_beam.utils.subprocess_server:subprocess_server.py:126 Sep 20, 2022 12:08:48 AM org.apache.beam.sdk.expansion.service.ExpansionService expand
INFO     apache_beam.utils.subprocess_server:subprocess_server.py:126 INFO: Expanding 'SqlTransform(beam:external:java:sql:v1)' with URN 'beam:external:java:sql:v1'
INFO     apache_beam.utils.subprocess_server:subprocess_server.py:126 Sep 20, 2022 12:08:48 AM org.apache.beam.sdk.expansion.service.ExpansionService$ExternalTransformRegistrarLoader payloadToConfig
INFO     apache_beam.utils.subprocess_server:subprocess_server.py:126 WARNING: Configuration class 'org.apache.beam.sdk.extensions.sql.expansion.ExternalSqlTransformRegistrar$Configuration' has no schema registered. Attempting to construct with setter approach.
INFO     apache_beam.utils.subprocess_server:subprocess_server.py:126 Sep 20, 2022 12:08:48 AM org.apache.beam.sdk.expansion.service.ExpansionService$ExternalTransformRegistrarLoader payloadToConfig
INFO     apache_beam.utils.subprocess_server:subprocess_server.py:126 WARNING: Configuration class 'org.apache.beam.sdk.extensions.sql.expansion.ExternalSqlTransformRegistrar$Configuration' has no schema registered. Attempting to construct with setter approach.
INFO     apache_beam.utils.subprocess_server:subprocess_server.py:126 Sep 20, 2022 12:08:50 AM org.apache.beam.sdk.extensions.sql.impl.CalciteQueryPlanner convertToBeamRel
INFO     apache_beam.utils.subprocess_server:subprocess_server.py:126 INFO: SQL:
INFO     apache_beam.utils.subprocess_server:subprocess_server.py:126 SELECT `simple`.`id` AS `id`, `enrich`.`metadata` AS `metadata`
INFO     apache_beam.utils.subprocess_server:subprocess_server.py:126 FROM `beam`.`simple` AS `simple`
INFO     apache_beam.utils.subprocess_server:subprocess_server.py:126 INNER JOIN `beam`.`enrich` AS `enrich` ON `simple`.`id` = `enrich`.`id`
INFO     apache_beam.utils.subprocess_server:subprocess_server.py:126 Sep 20, 2022 12:08:50 AM org.apache.beam.sdk.extensions.sql.impl.CalciteQueryPlanner convertToBeamRel
INFO     apache_beam.utils.subprocess_server:subprocess_server.py:126 INFO: SQLPlan>
INFO     apache_beam.utils.subprocess_server:subprocess_server.py:126 LogicalProject(id=[$0], metadata=[$4])
INFO     apache_beam.utils.subprocess_server:subprocess_server.py:126   LogicalJoin(condition=[=($0, $3)], joinType=[inner])
INFO     apache_beam.utils.subprocess_server:subprocess_server.py:126     BeamIOSourceRel(table=[[beam, simple]])
INFO     apache_beam.utils.subprocess_server:subprocess_server.py:126     BeamIOSourceRel(table=[[beam, enrich]])
INFO     apache_beam.utils.subprocess_server:subprocess_server.py:126 
INFO     apache_beam.utils.subprocess_server:subprocess_server.py:126 Sep 20, 2022 12:08:50 AM org.apache.beam.sdk.extensions.sql.impl.CalciteQueryPlanner convertToBeamRel
INFO     apache_beam.utils.subprocess_server:subprocess_server.py:126 INFO: BEAMPlan>
INFO     apache_beam.utils.subprocess_server:subprocess_server.py:126 BeamCalcRel(expr#0..4=[{inputs}], id=[$t0], metadata=[$t4])
INFO     apache_beam.utils.subprocess_server:subprocess_server.py:126   BeamCoGBKJoinRel(condition=[=($0, $3)], joinType=[inner])
INFO     apache_beam.utils.subprocess_server:subprocess_server.py:126     BeamIOSourceRel(table=[[beam, simple]])
INFO     apache_beam.utils.subprocess_server:subprocess_server.py:126     BeamIOSourceRel(table=[[beam, enrich]])
INFO     apache_beam.utils.subprocess_server:subprocess_server.py:126 
INFO     root:environments.py:376 Default Python SDK image for environment is apache/beam_python3.7_sdk:2.43.0.dev
INFO     root:environments.py:299 No image given, using default Python SDK image
INFO     root:environments.py:376 Default Python SDK image for environment is apache/beam_python3.7_sdk:2.43.0.dev
INFO     root:environments.py:304 Python SDK container image set to "apache/beam_python3.7_sdk:2.43.0.dev" for Docker environment
INFO     apache_beam.runners.portability.fn_api_runner.translations:translations.py:714 ==================== <function pack_combiners at 0x7fe37480b680> ====================
INFO     apache_beam.runners.portability.fn_api_runner.translations:translations.py:714 ==================== <function lift_combiners at 0x7fe37480b710> ====================
INFO     apache_beam.runners.portability.fn_api_runner.translations:translations.py:714 ==================== <function sort_stages at 0x7fe37480be60> ====================
INFO     apache_beam.runners.portability.portable_runner:portable_runner.py:583 Job state changed to STOPPED
INFO     apache_beam.runners.portability.portable_runner:portable_runner.py:583 Job state changed to STARTING
INFO     apache_beam.runners.portability.portable_runner:portable_runner.py:583 Job state changed to RUNNING
INFO     apache_beam.runners.portability.portable_runner:portable_runner.py:583 Job state changed to DONE
PASSED                                                                   [ 77%]
apache_beam/transforms/sql_test.py::SqlTransformTest::test_windowing_before_sql 
-------------------------------- live log call ---------------------------------
INFO     apache_beam.utils.subprocess_server:subprocess_server.py:239 Using pre-built snapshot at <https://ci-beam.apache.org/job/beam_PostCommit_XVR_Samza/ws/src/sdks/java/extensions/sql/expansion-service/build/libs/beam-sdks-java-extensions-sql-expansion-service-2.43.0-SNAPSHOT.jar>
INFO     root:external.py:773 Starting a JAR-based expansion service from JAR <https://ci-beam.apache.org/job/beam_PostCommit_XVR_Samza/ws/src/sdks/java/extensions/sql/expansion-service/build/libs/beam-sdks-java-extensions-sql-expansion-service-2.43.0-SNAPSHOT.jar> 
INFO     apache_beam.utils.subprocess_server:subprocess_server.py:116 Starting service with ['java' '-jar' '<https://ci-beam.apache.org/job/beam_PostCommit_XVR_Samza/ws/src/sdks/java/extensions/sql/expansion-service/build/libs/beam-sdks-java-extensions-sql-expansion-service-2.43.0-SNAPSHOT.jar'> '54535' '--filesToStage=<https://ci-beam.apache.org/job/beam_PostCommit_XVR_Samza/ws/src/sdks/java/extensions/sql/expansion-service/build/libs/beam-sdks-java-extensions-sql-expansion-service-2.43.0-SNAPSHOT.jar']>
INFO     apache_beam.utils.subprocess_server:subprocess_server.py:126 Starting expansion service at localhost:54535
INFO     apache_beam.utils.subprocess_server:subprocess_server.py:126 Sep 20, 2022 12:09:10 AM org.apache.beam.sdk.expansion.service.ExpansionService loadRegisteredTransforms
INFO     apache_beam.utils.subprocess_server:subprocess_server.py:126 INFO: Registering external transforms: [beam:external:java:sql:v1, beam:transform:org.apache.beam:pubsub_read:v1, beam:transform:org.apache.beam:pubsub_write:v1, beam:transform:org.apache.beam:pubsublite_write:v1, beam:transform:org.apache.beam:pubsublite_read:v1, beam:transform:org.apache.beam:spanner_insert:v1, beam:transform:org.apache.beam:spanner_update:v1, beam:transform:org.apache.beam:spanner_replace:v1, beam:transform:org.apache.beam:spanner_insert_or_update:v1, beam:transform:org.apache.beam:spanner_delete:v1, beam:transform:org.apache.beam:spanner_read:v1, beam:transform:org.apache.beam:kafka_read_with_metadata:v1, beam:transform:org.apache.beam:kafka_read_without_metadata:v1, beam:transform:org.apache.beam:kafka_write:v1, beam:external:java:generate_sequence:v1]
INFO     apache_beam.utils.subprocess_server:subprocess_server.py:126 	beam:external:java:sql:v1: org.apache.beam.sdk.expansion.service.ExpansionService$ExternalTransformRegistrarLoader$1@47eaca72
INFO     apache_beam.utils.subprocess_server:subprocess_server.py:126 	beam:transform:org.apache.beam:pubsub_read:v1: org.apache.beam.sdk.expansion.service.ExpansionService$ExternalTransformRegistrarLoader$1@55141def
INFO     apache_beam.utils.subprocess_server:subprocess_server.py:126 	beam:transform:org.apache.beam:pubsub_write:v1: org.apache.beam.sdk.expansion.service.ExpansionService$ExternalTransformRegistrarLoader$1@55182842
INFO     apache_beam.utils.subprocess_server:subprocess_server.py:126 	beam:transform:org.apache.beam:pubsublite_write:v1: org.apache.beam.sdk.expansion.service.ExpansionService$ExternalTransformRegistrarLoader$1@3270d194
INFO     apache_beam.utils.subprocess_server:subprocess_server.py:126 	beam:transform:org.apache.beam:pubsublite_read:v1: org.apache.beam.sdk.expansion.service.ExpansionService$ExternalTransformRegistrarLoader$1@235834f2
INFO     apache_beam.utils.subprocess_server:subprocess_server.py:126 	beam:transform:org.apache.beam:spanner_insert:v1: org.apache.beam.sdk.expansion.service.ExpansionService$ExternalTransformRegistrarLoader$1@5656be13
INFO     apache_beam.utils.subprocess_server:subprocess_server.py:126 	beam:transform:org.apache.beam:spanner_update:v1: org.apache.beam.sdk.expansion.service.ExpansionService$ExternalTransformRegistrarLoader$1@4218d6a3
INFO     apache_beam.utils.subprocess_server:subprocess_server.py:126 	beam:transform:org.apache.beam:spanner_replace:v1: org.apache.beam.sdk.expansion.service.ExpansionService$ExternalTransformRegistrarLoader$1@76505305
INFO     apache_beam.utils.subprocess_server:subprocess_server.py:126 	beam:transform:org.apache.beam:spanner_insert_or_update:v1: org.apache.beam.sdk.expansion.service.ExpansionService$ExternalTransformRegistrarLoader$1@14cd1699
INFO     apache_beam.utils.subprocess_server:subprocess_server.py:126 	beam:transform:org.apache.beam:spanner_delete:v1: org.apache.beam.sdk.expansion.service.ExpansionService$ExternalTransformRegistrarLoader$1@77888435
INFO     apache_beam.utils.subprocess_server:subprocess_server.py:126 	beam:transform:org.apache.beam:spanner_read:v1: org.apache.beam.sdk.expansion.service.ExpansionService$ExternalTransformRegistrarLoader$1@73a1e9a9
INFO     apache_beam.utils.subprocess_server:subprocess_server.py:126 	beam:transform:org.apache.beam:kafka_read_with_metadata:v1: org.apache.beam.sdk.expansion.service.ExpansionService$ExternalTransformRegistrarLoader$1@71d44a3
INFO     apache_beam.utils.subprocess_server:subprocess_server.py:126 	beam:transform:org.apache.beam:kafka_read_without_metadata:v1: org.apache.beam.sdk.expansion.service.ExpansionService$ExternalTransformRegistrarLoader$1@7b98f307
INFO     apache_beam.utils.subprocess_server:subprocess_server.py:126 	beam:transform:org.apache.beam:kafka_write:v1: org.apache.beam.sdk.expansion.service.ExpansionService$ExternalTransformRegistrarLoader$1@4802796d
INFO     apache_beam.utils.subprocess_server:subprocess_server.py:126 	beam:external:java:generate_sequence:v1: org.apache.beam.sdk.expansion.service.ExpansionService$ExternalTransformRegistrarLoader$1@34123d65
INFO     apache_beam.utils.subprocess_server:subprocess_server.py:126 Sep 20, 2022 12:09:11 AM org.apache.beam.sdk.expansion.service.ExpansionService expand
INFO     apache_beam.utils.subprocess_server:subprocess_server.py:126 INFO: Expanding 'SqlTransform(beam:external:java:sql:v1)' with URN 'beam:external:java:sql:v1'
INFO     apache_beam.utils.subprocess_server:subprocess_server.py:126 Sep 20, 2022 12:09:12 AM org.apache.beam.sdk.expansion.service.ExpansionService$ExternalTransformRegistrarLoader payloadToConfig
INFO     apache_beam.utils.subprocess_server:subprocess_server.py:126 WARNING: Configuration class 'org.apache.beam.sdk.extensions.sql.expansion.ExternalSqlTransformRegistrar$Configuration' has no schema registered. Attempting to construct with setter approach.
INFO     apache_beam.utils.subprocess_server:subprocess_server.py:126 Sep 20, 2022 12:09:12 AM org.apache.beam.sdk.expansion.service.ExpansionService$ExternalTransformRegistrarLoader payloadToConfig
INFO     apache_beam.utils.subprocess_server:subprocess_server.py:126 WARNING: Configuration class 'org.apache.beam.sdk.extensions.sql.expansion.ExternalSqlTransformRegistrar$Configuration' has no schema registered. Attempting to construct with setter approach.
INFO     apache_beam.utils.subprocess_server:subprocess_server.py:126 Sep 20, 2022 12:09:13 AM org.apache.beam.sdk.extensions.sql.impl.CalciteQueryPlanner convertToBeamRel
INFO     apache_beam.utils.subprocess_server:subprocess_server.py:126 INFO: SQL:
INFO     apache_beam.utils.subprocess_server:subprocess_server.py:126 SELECT COUNT(*) AS `count`
INFO     apache_beam.utils.subprocess_server:subprocess_server.py:126 FROM `beam`.`PCOLLECTION` AS `PCOLLECTION`
INFO     apache_beam.utils.subprocess_server:subprocess_server.py:126 Sep 20, 2022 12:09:14 AM org.apache.beam.sdk.extensions.sql.impl.CalciteQueryPlanner convertToBeamRel
INFO     apache_beam.utils.subprocess_server:subprocess_server.py:126 INFO: SQLPlan>
INFO     apache_beam.utils.subprocess_server:subprocess_server.py:126 LogicalAggregate(group=[{}], count=[COUNT()])
INFO     apache_beam.utils.subprocess_server:subprocess_server.py:126   BeamIOSourceRel(table=[[beam, PCOLLECTION]])
INFO     apache_beam.utils.subprocess_server:subprocess_server.py:126 
INFO     apache_beam.utils.subprocess_server:subprocess_server.py:126 Sep 20, 2022 12:09:14 AM org.apache.beam.sdk.extensions.sql.impl.CalciteQueryPlanner convertToBeamRel
INFO     apache_beam.utils.subprocess_server:subprocess_server.py:126 INFO: BEAMPlan>
INFO     apache_beam.utils.subprocess_server:subprocess_server.py:126 BeamAggregationRel(group=[{}], count=[COUNT()])
INFO     apache_beam.utils.subprocess_server:subprocess_server.py:126   BeamIOSourceRel(table=[[beam, PCOLLECTION]])
INFO     apache_beam.utils.subprocess_server:subprocess_server.py:126 
INFO     root:environments.py:376 Default Python SDK image for environment is apache/beam_python3.7_sdk:2.43.0.dev
INFO     root:environments.py:299 No image given, using default Python SDK image
INFO     root:environments.py:376 Default Python SDK image for environment is apache/beam_python3.7_sdk:2.43.0.dev
INFO     root:environments.py:304 Python SDK container image set to "apache/beam_python3.7_sdk:2.43.0.dev" for Docker environment
INFO     apache_beam.runners.portability.fn_api_runner.translations:translations.py:714 ==================== <function pack_combiners at 0x7fe37480b680> ====================
INFO     apache_beam.runners.portability.fn_api_runner.translations:translations.py:714 ==================== <function lift_combiners at 0x7fe37480b710> ====================
INFO     apache_beam.runners.portability.fn_api_runner.translations:translations.py:714 ==================== <function sort_stages at 0x7fe37480be60> ====================
INFO     apache_beam.runners.portability.portable_runner:portable_runner.py:583 Job state changed to STOPPED
INFO     apache_beam.runners.portability.portable_runner:portable_runner.py:583 Job state changed to STARTING
INFO     apache_beam.runners.portability.portable_runner:portable_runner.py:583 Job state changed to RUNNING
INFO     apache_beam.runners.portability.portable_runner:portable_runner.py:583 Job state changed to DONE
PASSED                                                                   [ 88%]
apache_beam/transforms/sql_test.py::SqlTransformTest::test_zetasql_generate_data 
-------------------------------- live log call ---------------------------------
INFO     apache_beam.utils.subprocess_server:subprocess_server.py:239 Using pre-built snapshot at <https://ci-beam.apache.org/job/beam_PostCommit_XVR_Samza/ws/src/sdks/java/extensions/sql/expansion-service/build/libs/beam-sdks-java-extensions-sql-expansion-service-2.43.0-SNAPSHOT.jar>
INFO     root:external.py:773 Starting a JAR-based expansion service from JAR <https://ci-beam.apache.org/job/beam_PostCommit_XVR_Samza/ws/src/sdks/java/extensions/sql/expansion-service/build/libs/beam-sdks-java-extensions-sql-expansion-service-2.43.0-SNAPSHOT.jar> 
INFO     apache_beam.utils.subprocess_server:subprocess_server.py:116 Starting service with ['java' '-jar' '<https://ci-beam.apache.org/job/beam_PostCommit_XVR_Samza/ws/src/sdks/java/extensions/sql/expansion-service/build/libs/beam-sdks-java-extensions-sql-expansion-service-2.43.0-SNAPSHOT.jar'> '50563' '--filesToStage=<https://ci-beam.apache.org/job/beam_PostCommit_XVR_Samza/ws/src/sdks/java/extensions/sql/expansion-service/build/libs/beam-sdks-java-extensions-sql-expansion-service-2.43.0-SNAPSHOT.jar']>
INFO     apache_beam.utils.subprocess_server:subprocess_server.py:126 Starting expansion service at localhost:50563
INFO     apache_beam.utils.subprocess_server:subprocess_server.py:126 Sep 20, 2022 12:09:33 AM org.apache.beam.sdk.expansion.service.ExpansionService loadRegisteredTransforms
INFO     apache_beam.utils.subprocess_server:subprocess_server.py:126 INFO: Registering external transforms: [beam:external:java:sql:v1, beam:transform:org.apache.beam:pubsub_read:v1, beam:transform:org.apache.beam:pubsub_write:v1, beam:transform:org.apache.beam:pubsublite_write:v1, beam:transform:org.apache.beam:pubsublite_read:v1, beam:transform:org.apache.beam:spanner_insert:v1, beam:transform:org.apache.beam:spanner_update:v1, beam:transform:org.apache.beam:spanner_replace:v1, beam:transform:org.apache.beam:spanner_insert_or_update:v1, beam:transform:org.apache.beam:spanner_delete:v1, beam:transform:org.apache.beam:spanner_read:v1, beam:transform:org.apache.beam:kafka_read_with_metadata:v1, beam:transform:org.apache.beam:kafka_read_without_metadata:v1, beam:transform:org.apache.beam:kafka_write:v1, beam:external:java:generate_sequence:v1]
INFO     apache_beam.utils.subprocess_server:subprocess_server.py:126 	beam:external:java:sql:v1: org.apache.beam.sdk.expansion.service.ExpansionService$ExternalTransformRegistrarLoader$1@47eaca72
INFO     apache_beam.utils.subprocess_server:subprocess_server.py:126 	beam:transform:org.apache.beam:pubsub_read:v1: org.apache.beam.sdk.expansion.service.ExpansionService$ExternalTransformRegistrarLoader$1@55141def
INFO     apache_beam.utils.subprocess_server:subprocess_server.py:126 	beam:transform:org.apache.beam:pubsub_write:v1: org.apache.beam.sdk.expansion.service.ExpansionService$ExternalTransformRegistrarLoader$1@55182842
INFO     apache_beam.utils.subprocess_server:subprocess_server.py:126 	beam:transform:org.apache.beam:pubsublite_write:v1: org.apache.beam.sdk.expansion.service.ExpansionService$ExternalTransformRegistrarLoader$1@3270d194
INFO     apache_beam.utils.subprocess_server:subprocess_server.py:126 	beam:transform:org.apache.beam:pubsublite_read:v1: org.apache.beam.sdk.expansion.service.ExpansionService$ExternalTransformRegistrarLoader$1@235834f2
INFO     apache_beam.utils.subprocess_server:subprocess_server.py:126 	beam:transform:org.apache.beam:spanner_insert:v1: org.apache.beam.sdk.expansion.service.ExpansionService$ExternalTransformRegistrarLoader$1@5656be13
INFO     apache_beam.utils.subprocess_server:subprocess_server.py:126 	beam:transform:org.apache.beam:spanner_update:v1: org.apache.beam.sdk.expansion.service.ExpansionService$ExternalTransformRegistrarLoader$1@4218d6a3
INFO     apache_beam.utils.subprocess_server:subprocess_server.py:126 	beam:transform:org.apache.beam:spanner_replace:v1: org.apache.beam.sdk.expansion.service.ExpansionService$ExternalTransformRegistrarLoader$1@76505305
INFO     apache_beam.utils.subprocess_server:subprocess_server.py:126 	beam:transform:org.apache.beam:spanner_insert_or_update:v1: org.apache.beam.sdk.expansion.service.ExpansionService$ExternalTransformRegistrarLoader$1@14cd1699
INFO     apache_beam.utils.subprocess_server:subprocess_server.py:126 	beam:transform:org.apache.beam:spanner_delete:v1: org.apache.beam.sdk.expansion.service.ExpansionService$ExternalTransformRegistrarLoader$1@77888435
INFO     apache_beam.utils.subprocess_server:subprocess_server.py:126 	beam:transform:org.apache.beam:spanner_read:v1: org.apache.beam.sdk.expansion.service.ExpansionService$ExternalTransformRegistrarLoader$1@73a1e9a9
INFO     apache_beam.utils.subprocess_server:subprocess_server.py:126 	beam:transform:org.apache.beam:kafka_read_with_metadata:v1: org.apache.beam.sdk.expansion.service.ExpansionService$ExternalTransformRegistrarLoader$1@71d44a3
INFO     apache_beam.utils.subprocess_server:subprocess_server.py:126 	beam:transform:org.apache.beam:kafka_read_without_metadata:v1: org.apache.beam.sdk.expansion.service.ExpansionService$ExternalTransformRegistrarLoader$1@7b98f307
INFO     apache_beam.utils.subprocess_server:subprocess_server.py:126 	beam:transform:org.apache.beam:kafka_write:v1: org.apache.beam.sdk.expansion.service.ExpansionService$ExternalTransformRegistrarLoader$1@4802796d
INFO     apache_beam.utils.subprocess_server:subprocess_server.py:126 	beam:external:java:generate_sequence:v1: org.apache.beam.sdk.expansion.service.ExpansionService$ExternalTransformRegistrarLoader$1@34123d65
INFO     apache_beam.utils.subprocess_server:subprocess_server.py:126 Sep 20, 2022 12:09:34 AM org.apache.beam.sdk.expansion.service.ExpansionService expand
INFO     apache_beam.utils.subprocess_server:subprocess_server.py:126 INFO: Expanding 'SqlTransform(beam:external:java:sql:v1)' with URN 'beam:external:java:sql:v1'
INFO     apache_beam.utils.subprocess_server:subprocess_server.py:126 Sep 20, 2022 12:09:35 AM org.apache.beam.sdk.expansion.service.ExpansionService$ExternalTransformRegistrarLoader payloadToConfig
INFO     apache_beam.utils.subprocess_server:subprocess_server.py:126 WARNING: Configuration class 'org.apache.beam.sdk.extensions.sql.expansion.ExternalSqlTransformRegistrar$Configuration' has no schema registered. Attempting to construct with setter approach.
INFO     apache_beam.utils.subprocess_server:subprocess_server.py:126 Sep 20, 2022 12:09:35 AM org.apache.beam.sdk.expansion.service.ExpansionService$ExternalTransformRegistrarLoader payloadToConfig
INFO     apache_beam.utils.subprocess_server:subprocess_server.py:126 WARNING: Configuration class 'org.apache.beam.sdk.extensions.sql.expansion.ExternalSqlTransformRegistrar$Configuration' has no schema registered. Attempting to construct with setter approach.
INFO     apache_beam.utils.subprocess_server:subprocess_server.py:126 Sep 20, 2022 12:09:37 AM com.google.zetasql.io.grpc.NameResolverRegistry getDefaultRegistry
INFO     apache_beam.utils.subprocess_server:subprocess_server.py:126 WARNING: No NameResolverProviders found via ServiceLoader, including for DNS. This is probably due to a broken build. If using ProGuard, check your configuration
INFO     apache_beam.utils.subprocess_server:subprocess_server.py:126 Sep 20, 2022 12:09:38 AM org.apache.beam.sdk.extensions.sql.zetasql.ZetaSQLQueryPlanner convertToBeamRelInternal
INFO     apache_beam.utils.subprocess_server:subprocess_server.py:126 INFO: BEAMPlan>
INFO     apache_beam.utils.subprocess_server:subprocess_server.py:126 BeamZetaSqlCalcRel(expr#0=[{inputs}], expr#1=[1:BIGINT], expr#2=['foo':VARCHAR], expr#3=[3.1400000000000001243E0:DOUBLE], int=[$t1], str=[$t2], flt=[$t3])
INFO     apache_beam.utils.subprocess_server:subprocess_server.py:126   BeamValuesRel(tuples=[[{ 0 }]])
INFO     apache_beam.utils.subprocess_server:subprocess_server.py:126 
INFO     root:environments.py:376 Default Python SDK image for environment is apache/beam_python3.7_sdk:2.43.0.dev
INFO     root:environments.py:299 No image given, using default Python SDK image
INFO     root:environments.py:376 Default Python SDK image for environment is apache/beam_python3.7_sdk:2.43.0.dev
INFO     root:environments.py:304 Python SDK container image set to "apache/beam_python3.7_sdk:2.43.0.dev" for Docker environment
INFO     apache_beam.runners.portability.fn_api_runner.translations:translations.py:714 ==================== <function pack_combiners at 0x7fe37480b680> ====================
INFO     apache_beam.runners.portability.fn_api_runner.translations:translations.py:714 ==================== <function lift_combiners at 0x7fe37480b710> ====================
INFO     apache_beam.runners.portability.fn_api_runner.translations:translations.py:714 ==================== <function sort_stages at 0x7fe37480be60> ====================
INFO     apache_beam.runners.portability.portable_runner:portable_runner.py:583 Job state changed to STOPPED
INFO     apache_beam.runners.portability.portable_runner:portable_runner.py:583 Job state changed to STARTING
INFO     apache_beam.runners.portability.portable_runner:portable_runner.py:583 Job state changed to RUNNING
INFO     apache_beam.runners.portability.portable_runner:portable_runner.py:583 Job state changed to DONE
PASSED                                                                   [100%]

=============================== warnings summary ===============================
../../build/gradleenv/1922375555/lib/python3.7/site-packages/hdfs/config.py:15
  <https://ci-beam.apache.org/job/beam_PostCommit_XVR_Samza/ws/src/build/gradleenv/1922375555/lib/python3.7/site-packages/hdfs/config.py>:15: DeprecationWarning: the imp module is deprecated in favour of importlib; see the module's documentation for alternative uses
    from imp import load_source

../../build/gradleenv/1922375555/lib/python3.7/site-packages/google/api_core/grpc_helpers.py:42
  <https://ci-beam.apache.org/job/beam_PostCommit_XVR_Samza/ws/src/build/gradleenv/1922375555/lib/python3.7/site-packages/google/api_core/grpc_helpers.py>:42: DeprecationWarning: Support for grpcio-gcp is deprecated. This feature will be
              removed from `google-api-core` after January 1, 2024. If you need to
              continue to use this feature, please pin to a specific version of
              `google-api-core`.
    DeprecationWarning,

-- Docs: https://docs.pytest.org/en/stable/how-to/capture-warnings.html
- generated xml file: <https://ci-beam.apache.org/job/beam_PostCommit_XVR_Samza/ws/src/sdks/python/pytest_xlangSqlValidateRunner.xml> -
==== 9 passed, 3 skipped, 6657 deselected, 2 warnings in 219.21s (0:03:39) =====

> Task :runners:samza:job-server:samzaJobServerCleanup
Stopping job server pid: 2842646.

> Task :runners:samza:job-server:validatesCrossLanguageRunnerCleanup
Stopping expansion service pid: 2851953.
Stopping expansion service pid: 2851954.

> Task :runners:samza:job-server:validatesCrossLanguageRunner

Deprecated Gradle features were used in this build, making it incompatible with Gradle 8.0.

You can use '--warning-mode all' to show the individual deprecation warnings and determine if they come from your own scripts or plugins.

See https://docs.gradle.org/7.5.1/userguide/command_line_interface.html#sec:command_line_warnings

Execution optimizations have been disabled for 1 invalid unit(s) of work during this build to ensure correctness.
Please consult deprecation warnings for more details.

BUILD SUCCESSFUL in 27m 27s
260 actionable tasks: 171 executed, 77 from cache, 12 up-to-date

Publishing build scan...
https://gradle.com/s/lv3dp6daesw4q

Build step 'Invoke Gradle script' changed build result to SUCCESS
[beam_PostCommit_XVR_Samza] $ /bin/bash -xe /tmp/jenkins6719368043466498340.sh
+ echo '*** RUN CROSS-LANGUAGE SAMZA USING PYTHON 3.10 ***'
*** RUN CROSS-LANGUAGE SAMZA USING PYTHON 3.10 ***
[Gradle] - Launching build.
[src] $ <https://ci-beam.apache.org/job/beam_PostCommit_XVR_Samza/ws/src/gradlew> --continue --max-workers=8 -Dorg.gradle.jvmargs=-Xms2g -Dorg.gradle.jvmargs=-Xmx6g -Dorg.gradle.vfs.watch=false -Pdocker-pull-licenses -PpythonVersion=3.10 :runners:samza:job-server:validatesCrossLanguageRunner
Configuration on demand is an incubating feature.
> Task :buildSrc:compileJava NO-SOURCE
> Task :buildSrc:compileGroovy UP-TO-DATE
> Task :buildSrc:pluginDescriptors UP-TO-DATE
> Task :buildSrc:processResources UP-TO-DATE
> Task :buildSrc:classes UP-TO-DATE
> Task :buildSrc:jar UP-TO-DATE
> Task :buildSrc:assemble UP-TO-DATE
> Task :buildSrc:spotlessGroovy UP-TO-DATE
> Task :buildSrc:spotlessGroovyCheck UP-TO-DATE
> Task :buildSrc:spotlessGroovyGradle UP-TO-DATE
> Task :buildSrc:spotlessGroovyGradleCheck UP-TO-DATE
> Task :buildSrc:spotlessCheck UP-TO-DATE
> Task :buildSrc:pluginUnderTestMetadata UP-TO-DATE
> Task :buildSrc:compileTestJava NO-SOURCE
> Task :buildSrc:compileTestGroovy NO-SOURCE
> Task :buildSrc:processTestResources NO-SOURCE
> Task :buildSrc:testClasses UP-TO-DATE
> Task :buildSrc:test NO-SOURCE
> Task :buildSrc:validatePlugins UP-TO-DATE
> Task :buildSrc:check UP-TO-DATE
> Task :buildSrc:build UP-TO-DATE

FAILURE: Build failed with an exception.

* What went wrong:
Could not determine the dependencies of task ':runners:samza:job-server:validatesCrossLanguageRunnerSetup'.
> Task with path ':sdks:python:container:py310:docker' not found in project ':runners:samza:job-server'.

* Try:
> Run with --stacktrace option to get the stack trace.
> Run with --info or --debug option to get more log output.

* Get more help at https://help.gradle.org

BUILD FAILED in 2s
10 actionable tasks: 10 up-to-date

Publishing build scan...
https://gradle.com/s/5brtgo2jwwjro

Build step 'Invoke Gradle script' changed build result to FAILURE
Build step 'Invoke Gradle script' marked build as failure

---------------------------------------------------------------------
To unsubscribe, e-mail: builds-unsubscribe@beam.apache.org
For additional commands, e-mail: builds-help@beam.apache.org


Build failed in Jenkins: beam_PostCommit_XVR_Samza #1688

Posted by Apache Jenkins Server <je...@builds.apache.org>.
See <https://ci-beam.apache.org/job/beam_PostCommit_XVR_Samza/1688/display/redirect?page=changes>

Changes:

[Pablo Estrada] Revert "Trying out property-based tests for Beam python coders (#22233)"

[noreply] Bump google.golang.org/api from 0.95.0 to 0.96.0 in /sdks (#23246)

[noreply] [Go SDK] Add timer coder support (#23222)

[noreply] Fix wrong comment (#23272)

[noreply] [Playground] [Backend] Cache component for playground examples (#22869)


------------------------------------------
[...truncated 1.90 MB...]
        urn: "beam:coders:javasdk:0.1"
        payload: "\202SNAPPY\000\000\000\000\001\000\000\000\001\000\000\001.\307\003\360@\254\355\000\005sr\000&org.apache.beam.sdk.coders.SnappyCoder1\033\243\356\177\362\366,\002\000\001L\000\ninner\005\030 t\000\"Lorg/a\005B\000/\001B\020/sdk/\tB\000/\005$\020;xr\000*ng\000 tructured\005/8s\277\022\016\325\3246\021\002\000\000xr\000 j9\000\005/\034C\335\325\211\256\274~\370\001/\020psr\000,j1\000,Serializable\005= \010\364 \216\305ynl\002\001\327\\\004typet\000\021Ljava/lang/Class\001\300n'\001\024Custom\005PPj\260\010\235\013;\035\013\002\000\000xq\000~\000\003vr\000$N\221\000\\io.BoundedSource!`v\023\177\370QA\0019\010r\000\035Z3\000\t,0\020\213\372\020Y\214\347\323\002\000\000xp"
      >
    >
  >
  coders: <
    key: "VgUyUIMFsOTimestampedValueCoder"
    value: <
      spec: <
        urn: "beam:coders:javasdk:0.1"
        payload: "\202SNAPPY\000\000\000\000\001\000\000\000\001\000\000\001?\315\003\270\254\355\000\005sr\000Aorg.apache.beam.sdk.values.TimestampedV\001\022\000$>\021\000LCoder\364\376\202p\274iX-\002\000\001L\000\nv\001)\005\030\034t\000\"Lorg/\t]\000/\001],/sdk/coders/\005$\020;xr\000*N\202\000\t%(.Structured\005/8s\277\022\016\325\3246\021\002\000\000xr\000 j9\000\005/\034C\335\325\211\256\274~\370\001/\020psr\000,j1\000(Serializabl\t\277\034\010\364 \216\305ynl\005\327\\\004typet\000\021Ljava/lang/Class\001\300\000&jV\000\024Custom\005\215Pj\260\010\235\013;\035\013\002\000\000xq\000~\000\003vr\000;N;\000Pio.BoundedReadFromUnb\t\021`Source$Shardd\236\240U\205\000j\363\002\000\000xp"
      >
    >
  >
  coders: <
    key: "VgUyUIMFsOValueWithRecordIdCoder"
    value: <
      spec: <
        urn: "beam:coders:javasdk:0.1"
        payload: "\202SNAPPY\000\000\000\000\001\000\000\000\001\000\000\001\213\311\005\320\254\355\000\005sr\000Corg.apache.beam.sdk.values.ValueWithRecordId$B\022\000LCoder{\343\376bQ\014\204>\002\000\002L\000\007i\t\025\034t\000+Lorg/\t\\\000/\001\\\024/sdk/c\0012(s/ByteArray\005B\014;L\000\n\005u\005\016\010t\000\"n;\000\005$\020;xr\000*N\274\000\t`(.Structured\005/8s\277\022\016\325\3246\021\002\000\000xr\000 j9\000\005/\034C\335\325\211\256\274~\370\001/\020psr\000)j1\0006\312\000\034\351\277\005|\263\3746\333\001:\010r\000&j8\000\024Atomic\005o\034\307\354\265\314\205tPF\0015 q\000~\000\003sr\000-N;\000$io.kafka.K\001\006\000R%\227\005B<I\320\251Y\032\341{#\002\000\001L\000\007kv\005\025\010t\000$nH\001\000K\t&\000;\025s\000\"Ns\000-P\r- j\000\275\271\035\243\3126\002!\353\010\010ke)\277\001\264\000\0022\303\001\005\022\025Y\000(jY\000\030Nullabl)\372\034E\333\0336>\220\247\007\005\307]\022.O\000\001\014,\006sq\000~\000\016q\000~\000\020"
      >
    >
  >
  coders: <
    key: "VgUyUIMFsOVarIntCoder"
    value: <
      spec: <
        urn: "beam:coders:javasdk:0.1"
        payload: "\202SNAPPY\000\000\000\000\001\000\000\000\001\000\000\000\210\330\001\350\254\355\000\005sr\000&org.apache.beam.sdk.coders.VarIntCoder\300K2\332\251KVh\002\000\000xrr5\000\024Atomic\0055 \307\354\265\314\205tPF\002\0055\000*jj\000$Structured\0059\034s\277\022\016\325\3246\021\t9\000 j9\000\005/0C\335\325\211\256\274~\370\002\000\000xp"
      >
    >
  >
  coders: <
    key: "VgUyUIMFsOVoidCoder"
    value: <
      spec: <
        urn: "beam:coders:javasdk:0.1"
        payload: "\202SNAPPY\000\000\000\000\001\000\000\000\001\000\000\000\210\326\001\350\254\355\000\005sr\000$org.apache.beam.sdk.coders.VoidCoder\271\277U\233\350\r\257U\002\000\000xr\000&j3\000\024Atomic\0055 \307\354\265\314\205tPF\002\0055\000*j5\000$Structured\0059\034s\277\022\016\325\3246\021\t9\000 j9\000\005/0C\335\325\211\256\274~\370\002\000\000xp"
      >
    >
  >
  coders: <
    key: "c0"
    value: <
      spec: <
        urn: "beam:coder:bytes:v1"
      >
    >
  >
  coders: <
    key: "c1"
    value: <
      spec: <
        urn: "beam:coder:global_window:v1"
      >
    >
  >
  coders: <
    key: "c2"
    value: <
      spec: <
        urn: "beam:go:coder:custom:v1"
        payload: "Cgd2YXJpbnR6EgIIAhpdCklnaXRodWIuY29tL2FwYWNoZS9iZWFtL3Nka3MvdjIvZ28vcGtnL2JlYW0vY29yZS9ydW50aW1lL2NvZGVyeC5lbmNWYXJJbnRaEhAIFiIECBlADyoGCBQSAggIImkKSWdpdGh1Yi5jb20vYXBhY2hlL2JlYW0vc2Rrcy92Mi9nby9wa2cvYmVhbS9jb3JlL3J1bnRpbWUvY29kZXJ4LmRlY1ZhckludFoSHAgWIgQIGUADIgYIFBICCAgqBAgZQA8qBAgZQAE="
      >
    >
  >
  coders: <
    key: "c3"
    value: <
      spec: <
        urn: "beam:coder:length_prefix:v1"
      >
      component_coder_ids: "c2"
    >
  >
  coders: <
    key: "c4"
    value: <
      spec: <
        urn: "beam:coder:kv:v1"
      >
      component_coder_ids: "c0"
      component_coder_ids: "c0"
    >
  >
  environments: <
    key: "VgUyUIMFsObeam:env:docker:v1"
    value: <
      urn: "beam:env:docker:v1"
      payload: "\n apache/beam_java8_sdk:2.43.0.dev"
      capabilities: "beam:coder:bytes:v1"
      capabilities: "beam:coder:bool:v1"
      capabilities: "beam:coder:varint:v1"
      capabilities: "beam:coder:string_utf8:v1"
      capabilities: "beam:coder:iterable:v1"
      capabilities: "beam:coder:timer:v1"
      capabilities: "beam:coder:kv:v1"
      capabilities: "beam:coder:length_prefix:v1"
      capabilities: "beam:coder:global_window:v1"
      capabilities: "beam:coder:interval_window:v1"
      capabilities: "beam:coder:custom_window:v1"
      capabilities: "beam:coder:windowed_value:v1"
      capabilities: "beam:coder:double:v1"
      capabilities: "beam:coder:row:v1"
      capabilities: "beam:coder:param_windowed_value:v1"
      capabilities: "beam:coder:state_backed_iterable:v1"
      capabilities: "beam:coder:sharded_key:v1"
      capabilities: "beam:coder:nullable:v1"
      capabilities: "beam:protocol:multi_core_bundle_processing:v1"
      capabilities: "beam:protocol:progress_reporting:v1"
      capabilities: "beam:protocol:harness_monitoring_infos:v1"
      capabilities: "beam:protocol:control_request_elements_embedding:v1"
      capabilities: "beam:protocol:state_caching:v1"
      capabilities: "beam:version:sdk_base:apache/beam_java8_sdk:2.43.0.dev"
      capabilities: "beam:transform:sdf_truncate_sized_restrictions:v1"
      capabilities: "beam:transform:to_string:v1"
      dependencies: <
        type_urn: "beam:artifact:type:file:v1"
        type_payload: "\nL/tmp/artifacts/icedtea-sound-CGRxIE9edPHnbxQhM-L5mp8h21H-ySB79uQtSquPV_Q.jar\022@086471204f5e74f1e76f142133e2f99a9f21db51fec9207bf6e42d4aab8f57f4"
        role_urn: "beam:artifact:role:staging_to:v1"
        role_payload: "\n=icedtea-sound-CGRxIE9edPHnbxQhM-L5mp8h21H-ySB79uQtSquPV_Q.jar"
      >
      dependencies: <
        type_urn: "beam:artifact:type:file:v1"
        type_payload: "\nF/tmp/artifacts/jaccess-FBI0Bb27lF3oEBieWAi7SP8X1zBR8k4BJQOVpsoK9a0.jar\022@14123405bdbb945de810189e5808bb48ff17d73051f24e01250395a6ca0af5ad"
        role_urn: "beam:artifact:role:staging_to:v1"
        role_payload: "\n7jaccess-FBI0Bb27lF3oEBieWAi7SP8X1zBR8k4BJQOVpsoK9a0.jar"
      >
      dependencies: <
        type_urn: "beam:artifact:type:file:v1"
        type_payload: "\nI/tmp/artifacts/localedata-kJ2mc8rBH5-IklhfR1XzNotlIQ_mnVMA-pgaXv2r8Ag.jar\022@909da673cac11f9f8892585f4755f3368b65210fe69d5300fa981a5efdabf008"
        role_urn: "beam:artifact:role:staging_to:v1"
        role_payload: "\n:localedata-kJ2mc8rBH5-IklhfR1XzNotlIQ_mnVMA-pgaXv2r8Ag.jar"
      >
      dependencies: <
        type_urn: "beam:artifact:type:file:v1"
        type_payload: "\nF/tmp/artifacts/nashorn-B0CAb3QpJET_6VsT3hcC_89VtvhV616H8N2bHAIaqWo.jar\022@0740806f74292444ffe95b13de1702ffcf55b6f855eb5e87f0dd9b1c021aa96a"
        role_urn: "beam:artifact:role:staging_to:v1"
        role_payload: "\n7nashorn-B0CAb3QpJET_6VsT3hcC_89VtvhV616H8N2bHAIaqWo.jar"
      >
      dependencies: <
        type_urn: "beam:artifact:type:file:v1"
        type_payload: "\nG/tmp/artifacts/cldrdata-gclqV9lOGqQOKesG-a6TAUTGEYlyIDqpyd4M_k7gtWo.jar\022@81c96a57d94e1aa40e29eb06f9ae930144c6118972203aa9c9de0cfe4ee0b56a"
        role_urn: "beam:artifact:role:staging_to:v1"
        role_payload: "\n8cldrdata-gclqV9lOGqQOKesG-a6TAUTGEYlyIDqpyd4M_k7gtWo.jar"
      >
      dependencies: <
        type_urn: "beam:artifact:type:file:v1"
        type_payload: "\nD/tmp/artifacts/dnsns-byzoQxdXengTvA5IlbH9gSIzfhNQElRYltuMJN0vjcc.jar\022@6f2ce84317577a7813bc0e4895b1fd8122337e135012545896db8c24dd2f8dc7"
        role_urn: "beam:artifact:role:staging_to:v1"
        role_payload: "\n5dnsns-byzoQxdXengTvA5IlbH9gSIzfhNQElRYltuMJN0vjcc.jar"
      >
      dependencies: <
        type_urn: "beam:artifact:type:file:v1"
        type_payload: "\nr/tmp/artifacts/beam-sdks-java-io-expansion-service-2.43.0-SNAPSHOT-wafbc-s8NjC9GYh1S6flL_8n1jlalnrUP6fvu6JgEuM.jar\022@c1a7db73eb3c3630bd1988754ba7e52fff27d6395a967ad43fa7efbba26012e3"
        role_urn: "beam:artifact:role:staging_to:v1"
        role_payload: "\ncbeam-sdks-java-io-expansion-service-2.43.0-SNAPSHOT-wafbc-s8NjC9GYh1S6flL_8n1jlalnrUP6fvu6JgEuM.jar"
      >
    >
  >
  environments: <
    key: "go"
    value: <
      urn: "beam:env:docker:v1"
      payload: "\n\026apache/beam_go_sdk:dev"
      capabilities: "beam:protocol:progress_reporting:v1"
      capabilities: "beam:protocol:multi_core_bundle_processing:v1"
      capabilities: "beam:transform:sdf_truncate_sized_restrictions:v1"
      capabilities: "beam:protocol:worker_status:v1"
      capabilities: "beam:protocol:monitoring_info_short_ids:v1"
      capabilities: "beam:version:sdk_base:go"
      capabilities: "beam:coder:bytes:v1"
      capabilities: "beam:coder:bool:v1"
      capabilities: "beam:coder:varint:v1"
      capabilities: "beam:coder:double:v1"
      capabilities: "beam:coder:string_utf8:v1"
      capabilities: "beam:coder:length_prefix:v1"
      capabilities: "beam:coder:kv:v1"
      capabilities: "beam:coder:iterable:v1"
      capabilities: "beam:coder:state_backed_iterable:v1"
      capabilities: "beam:coder:windowed_value:v1"
      capabilities: "beam:coder:global_window:v1"
      capabilities: "beam:coder:interval_window:v1"
      capabilities: "beam:coder:row:v1"
      capabilities: "beam:coder:nullable:v1"
      dependencies: <
        type_urn: "beam:artifact:type:file:v1"
        role_urn: "beam:artifact:role:go_worker_binary:v1"
      >
    >
  >
>
root_transform_ids: "s1"
root_transform_ids: "e4"
root_transform_ids: "e5"
root_transform_ids: "s3"
requirements: "beam:requirement:pardo:splittable_dofn:v1"
2022/09/19 18:25:51 Cross-compiling <https://ci-beam.apache.org/job/beam_PostCommit_XVR_Samza/ws/src/sdks/go/test/integration/io/xlang/kafka/kafka_test.go> as /tmp/worker-2-1663611951020158133
2022/09/19 18:25:53 Prepared job with id: go-testkafkaio_basicreadwrite-799_39d07998-3af8-422c-9823-9c3ddbe09596 and staging token: go-testkafkaio_basicreadwrite-799_39d07998-3af8-422c-9823-9c3ddbe09596
2022/09/19 18:25:53 Staged binary artifact with token: 
2022/09/19 18:25:53 Submitted job: go0testkafkaio0basicreadwrite0799-jenkins-0919182553-cd33459c_85cbcbb4-3553-4bbf-9a45-211164b9c1ea
2022/09/19 18:25:53 Job state: STOPPED
2022/09/19 18:25:53 Job state: STARTING
2022/09/19 18:25:53 Job state: RUNNING
2022/09/19 18:26:06 Job state: DONE
--- PASS: TestKafkaIO_BasicReadWrite (40.67s)
PASS
ok  	github.com/apache/beam/sdks/v2/go/test/integration/io/xlang/kafka	46.709s
FAIL

> Task :runners:samza:job-server:validatesCrossLanguageRunnerGoUsingJava FAILED
> Task :runners:samza:job-server:validatesCrossLanguageRunnerJavaUsingPython
> Task :runners:samza:job-server:validatesCrossLanguageRunnerPythonUsingJava
> Task :runners:samza:job-server:validatesCrossLanguageRunnerPythonUsingSql
> Task :runners:samza:job-server:samzaJobServerCleanup
> Task :runners:samza:job-server:validatesCrossLanguageRunnerCleanup

FAILURE: Build failed with an exception.

* Where:
Build file '<https://ci-beam.apache.org/job/beam_PostCommit_XVR_Samza/ws/src/sdks/go/test/build.gradle'> line: 195

* What went wrong:
Execution failed for task ':runners:samza:job-server:validatesCrossLanguageRunnerGoUsingJava'.
> Process 'command 'sh'' finished with non-zero exit value 1

* Try:
> Run with --stacktrace option to get the stack trace.
> Run with --info or --debug option to get more log output.

* Get more help at https://help.gradle.org

Deprecated Gradle features were used in this build, making it incompatible with Gradle 8.0.

You can use '--warning-mode all' to show the individual deprecation warnings and determine if they come from your own scripts or plugins.

See https://docs.gradle.org/7.5.1/userguide/command_line_interface.html#sec:command_line_warnings

Execution optimizations have been disabled for 1 invalid unit(s) of work during this build to ensure correctness.
Please consult deprecation warnings for more details.

BUILD FAILED in 28m 51s
245 actionable tasks: 32 executed, 213 up-to-date

Publishing build scan...
https://gradle.com/s/cwr77525iero2

Build step 'Invoke Gradle script' changed build result to FAILURE
Build step 'Invoke Gradle script' marked build as failure

---------------------------------------------------------------------
To unsubscribe, e-mail: builds-unsubscribe@beam.apache.org
For additional commands, e-mail: builds-help@beam.apache.org


Build failed in Jenkins: beam_PostCommit_XVR_Samza #1687

Posted by Apache Jenkins Server <je...@builds.apache.org>.
See <https://ci-beam.apache.org/job/beam_PostCommit_XVR_Samza/1687/display/redirect>

Changes:


------------------------------------------
[...truncated 1.06 MB...]
INFO     apache_beam.utils.subprocess_server:subprocess_server.py:126 Sep 19, 2022 12:11:28 PM org.apache.beam.sdk.expansion.service.ExpansionService$ExternalTransformRegistrarLoader payloadToConfig
INFO     apache_beam.utils.subprocess_server:subprocess_server.py:126 WARNING: Configuration class 'org.apache.beam.sdk.extensions.sql.expansion.ExternalSqlTransformRegistrar$Configuration' has no schema registered. Attempting to construct with setter approach.
INFO     apache_beam.utils.subprocess_server:subprocess_server.py:126 Sep 19, 2022 12:11:29 PM org.apache.beam.sdk.expansion.service.ExpansionService$ExternalTransformRegistrarLoader payloadToConfig
INFO     apache_beam.utils.subprocess_server:subprocess_server.py:126 WARNING: Configuration class 'org.apache.beam.sdk.extensions.sql.expansion.ExternalSqlTransformRegistrar$Configuration' has no schema registered. Attempting to construct with setter approach.
INFO     apache_beam.utils.subprocess_server:subprocess_server.py:126 Sep 19, 2022 12:11:30 PM org.apache.beam.sdk.extensions.sql.impl.CalciteQueryPlanner convertToBeamRel
INFO     apache_beam.utils.subprocess_server:subprocess_server.py:126 INFO: SQL:
INFO     apache_beam.utils.subprocess_server:subprocess_server.py:126 SELECT `PCOLLECTION`.`a` * `PCOLLECTION`.`a` AS `s`, `LENGTH`(`PCOLLECTION`.`b`) AS `c`
INFO     apache_beam.utils.subprocess_server:subprocess_server.py:126 FROM `beam`.`PCOLLECTION` AS `PCOLLECTION`
INFO     apache_beam.utils.subprocess_server:subprocess_server.py:126 Sep 19, 2022 12:11:31 PM org.apache.beam.sdk.extensions.sql.impl.CalciteQueryPlanner convertToBeamRel
INFO     apache_beam.utils.subprocess_server:subprocess_server.py:126 INFO: SQLPlan>
INFO     apache_beam.utils.subprocess_server:subprocess_server.py:126 LogicalProject(s=[*($0, $0)], c=[LENGTH($1)])
INFO     apache_beam.utils.subprocess_server:subprocess_server.py:126   BeamIOSourceRel(table=[[beam, PCOLLECTION]])
INFO     apache_beam.utils.subprocess_server:subprocess_server.py:126 
INFO     apache_beam.utils.subprocess_server:subprocess_server.py:126 Sep 19, 2022 12:11:31 PM org.apache.beam.sdk.extensions.sql.impl.CalciteQueryPlanner convertToBeamRel
INFO     apache_beam.utils.subprocess_server:subprocess_server.py:126 INFO: BEAMPlan>
INFO     apache_beam.utils.subprocess_server:subprocess_server.py:126 BeamCalcRel(expr#0..1=[{inputs}], expr#2=[*($t0, $t0)], expr#3=[LENGTH($t1)], s=[$t2], c=[$t3])
INFO     apache_beam.utils.subprocess_server:subprocess_server.py:126   BeamIOSourceRel(table=[[beam, PCOLLECTION]])
INFO     apache_beam.utils.subprocess_server:subprocess_server.py:126 
INFO     root:environments.py:376 Default Python SDK image for environment is apache/beam_python3.7_sdk:2.43.0.dev
INFO     root:environments.py:299 No image given, using default Python SDK image
INFO     root:environments.py:376 Default Python SDK image for environment is apache/beam_python3.7_sdk:2.43.0.dev
INFO     root:environments.py:304 Python SDK container image set to "apache/beam_python3.7_sdk:2.43.0.dev" for Docker environment
INFO     apache_beam.runners.portability.fn_api_runner.translations:translations.py:714 ==================== <function pack_combiners at 0x7f25b0b4ddd0> ====================
INFO     apache_beam.runners.portability.fn_api_runner.translations:translations.py:714 ==================== <function lift_combiners at 0x7f25b0b4de60> ====================
INFO     apache_beam.runners.portability.fn_api_runner.translations:translations.py:714 ==================== <function sort_stages at 0x7f25b0b4e5f0> ====================
INFO     apache_beam.runners.portability.portable_runner:portable_runner.py:583 Job state changed to STOPPED
INFO     apache_beam.runners.portability.portable_runner:portable_runner.py:583 Job state changed to STARTING
INFO     apache_beam.runners.portability.portable_runner:portable_runner.py:583 Job state changed to RUNNING
INFO     apache_beam.runners.portability.portable_runner:portable_runner.py:583 Job state changed to DONE
PASSED                                                                   [ 66%]
apache_beam/transforms/sql_test.py::SqlTransformTest::test_tagged_join 
-------------------------------- live log call ---------------------------------
INFO     apache_beam.utils.subprocess_server:subprocess_server.py:239 Using pre-built snapshot at <https://ci-beam.apache.org/job/beam_PostCommit_XVR_Samza/ws/src/sdks/java/extensions/sql/expansion-service/build/libs/beam-sdks-java-extensions-sql-expansion-service-2.43.0-SNAPSHOT.jar>
INFO     root:external.py:773 Starting a JAR-based expansion service from JAR <https://ci-beam.apache.org/job/beam_PostCommit_XVR_Samza/ws/src/sdks/java/extensions/sql/expansion-service/build/libs/beam-sdks-java-extensions-sql-expansion-service-2.43.0-SNAPSHOT.jar> 
INFO     apache_beam.utils.subprocess_server:subprocess_server.py:116 Starting service with ['java' '-jar' '<https://ci-beam.apache.org/job/beam_PostCommit_XVR_Samza/ws/src/sdks/java/extensions/sql/expansion-service/build/libs/beam-sdks-java-extensions-sql-expansion-service-2.43.0-SNAPSHOT.jar'> '35535' '--filesToStage=<https://ci-beam.apache.org/job/beam_PostCommit_XVR_Samza/ws/src/sdks/java/extensions/sql/expansion-service/build/libs/beam-sdks-java-extensions-sql-expansion-service-2.43.0-SNAPSHOT.jar']>
INFO     apache_beam.utils.subprocess_server:subprocess_server.py:126 Starting expansion service at localhost:35535
INFO     apache_beam.utils.subprocess_server:subprocess_server.py:126 Sep 19, 2022 12:11:51 PM org.apache.beam.sdk.expansion.service.ExpansionService loadRegisteredTransforms
INFO     apache_beam.utils.subprocess_server:subprocess_server.py:126 INFO: Registering external transforms: [beam:external:java:sql:v1, beam:transform:org.apache.beam:pubsub_read:v1, beam:transform:org.apache.beam:pubsub_write:v1, beam:transform:org.apache.beam:pubsublite_write:v1, beam:transform:org.apache.beam:pubsublite_read:v1, beam:transform:org.apache.beam:spanner_insert:v1, beam:transform:org.apache.beam:spanner_update:v1, beam:transform:org.apache.beam:spanner_replace:v1, beam:transform:org.apache.beam:spanner_insert_or_update:v1, beam:transform:org.apache.beam:spanner_delete:v1, beam:transform:org.apache.beam:spanner_read:v1, beam:transform:org.apache.beam:kafka_read_with_metadata:v1, beam:transform:org.apache.beam:kafka_read_without_metadata:v1, beam:transform:org.apache.beam:kafka_write:v1, beam:external:java:generate_sequence:v1]
INFO     apache_beam.utils.subprocess_server:subprocess_server.py:126 	beam:external:java:sql:v1: org.apache.beam.sdk.expansion.service.ExpansionService$ExternalTransformRegistrarLoader$1@47eaca72
INFO     apache_beam.utils.subprocess_server:subprocess_server.py:126 	beam:transform:org.apache.beam:pubsub_read:v1: org.apache.beam.sdk.expansion.service.ExpansionService$ExternalTransformRegistrarLoader$1@55141def
INFO     apache_beam.utils.subprocess_server:subprocess_server.py:126 	beam:transform:org.apache.beam:pubsub_write:v1: org.apache.beam.sdk.expansion.service.ExpansionService$ExternalTransformRegistrarLoader$1@55182842
INFO     apache_beam.utils.subprocess_server:subprocess_server.py:126 	beam:transform:org.apache.beam:pubsublite_write:v1: org.apache.beam.sdk.expansion.service.ExpansionService$ExternalTransformRegistrarLoader$1@3270d194
INFO     apache_beam.utils.subprocess_server:subprocess_server.py:126 	beam:transform:org.apache.beam:pubsublite_read:v1: org.apache.beam.sdk.expansion.service.ExpansionService$ExternalTransformRegistrarLoader$1@235834f2
INFO     apache_beam.utils.subprocess_server:subprocess_server.py:126 	beam:transform:org.apache.beam:spanner_insert:v1: org.apache.beam.sdk.expansion.service.ExpansionService$ExternalTransformRegistrarLoader$1@5656be13
INFO     apache_beam.utils.subprocess_server:subprocess_server.py:126 	beam:transform:org.apache.beam:spanner_update:v1: org.apache.beam.sdk.expansion.service.ExpansionService$ExternalTransformRegistrarLoader$1@4218d6a3
INFO     apache_beam.utils.subprocess_server:subprocess_server.py:126 	beam:transform:org.apache.beam:spanner_replace:v1: org.apache.beam.sdk.expansion.service.ExpansionService$ExternalTransformRegistrarLoader$1@76505305
INFO     apache_beam.utils.subprocess_server:subprocess_server.py:126 	beam:transform:org.apache.beam:spanner_insert_or_update:v1: org.apache.beam.sdk.expansion.service.ExpansionService$ExternalTransformRegistrarLoader$1@14cd1699
INFO     apache_beam.utils.subprocess_server:subprocess_server.py:126 	beam:transform:org.apache.beam:spanner_delete:v1: org.apache.beam.sdk.expansion.service.ExpansionService$ExternalTransformRegistrarLoader$1@77888435
INFO     apache_beam.utils.subprocess_server:subprocess_server.py:126 	beam:transform:org.apache.beam:spanner_read:v1: org.apache.beam.sdk.expansion.service.ExpansionService$ExternalTransformRegistrarLoader$1@73a1e9a9
INFO     apache_beam.utils.subprocess_server:subprocess_server.py:126 	beam:transform:org.apache.beam:kafka_read_with_metadata:v1: org.apache.beam.sdk.expansion.service.ExpansionService$ExternalTransformRegistrarLoader$1@71d44a3
INFO     apache_beam.utils.subprocess_server:subprocess_server.py:126 	beam:transform:org.apache.beam:kafka_read_without_metadata:v1: org.apache.beam.sdk.expansion.service.ExpansionService$ExternalTransformRegistrarLoader$1@7b98f307
INFO     apache_beam.utils.subprocess_server:subprocess_server.py:126 	beam:transform:org.apache.beam:kafka_write:v1: org.apache.beam.sdk.expansion.service.ExpansionService$ExternalTransformRegistrarLoader$1@4802796d
INFO     apache_beam.utils.subprocess_server:subprocess_server.py:126 	beam:external:java:generate_sequence:v1: org.apache.beam.sdk.expansion.service.ExpansionService$ExternalTransformRegistrarLoader$1@34123d65
INFO     apache_beam.utils.subprocess_server:subprocess_server.py:126 Sep 19, 2022 12:11:52 PM org.apache.beam.sdk.expansion.service.ExpansionService expand
INFO     apache_beam.utils.subprocess_server:subprocess_server.py:126 INFO: Expanding 'SqlTransform(beam:external:java:sql:v1)' with URN 'beam:external:java:sql:v1'
INFO     apache_beam.utils.subprocess_server:subprocess_server.py:126 Sep 19, 2022 12:11:52 PM org.apache.beam.sdk.expansion.service.ExpansionService$ExternalTransformRegistrarLoader payloadToConfig
INFO     apache_beam.utils.subprocess_server:subprocess_server.py:126 WARNING: Configuration class 'org.apache.beam.sdk.extensions.sql.expansion.ExternalSqlTransformRegistrar$Configuration' has no schema registered. Attempting to construct with setter approach.
INFO     apache_beam.utils.subprocess_server:subprocess_server.py:126 Sep 19, 2022 12:11:53 PM org.apache.beam.sdk.expansion.service.ExpansionService$ExternalTransformRegistrarLoader payloadToConfig
INFO     apache_beam.utils.subprocess_server:subprocess_server.py:126 WARNING: Configuration class 'org.apache.beam.sdk.extensions.sql.expansion.ExternalSqlTransformRegistrar$Configuration' has no schema registered. Attempting to construct with setter approach.
INFO     apache_beam.utils.subprocess_server:subprocess_server.py:126 Sep 19, 2022 12:11:54 PM org.apache.beam.sdk.extensions.sql.impl.CalciteQueryPlanner convertToBeamRel
INFO     apache_beam.utils.subprocess_server:subprocess_server.py:126 INFO: SQL:
INFO     apache_beam.utils.subprocess_server:subprocess_server.py:126 SELECT `simple`.`id` AS `id`, `enrich`.`metadata` AS `metadata`
INFO     apache_beam.utils.subprocess_server:subprocess_server.py:126 FROM `beam`.`simple` AS `simple`
INFO     apache_beam.utils.subprocess_server:subprocess_server.py:126 INNER JOIN `beam`.`enrich` AS `enrich` ON `simple`.`id` = `enrich`.`id`
INFO     apache_beam.utils.subprocess_server:subprocess_server.py:126 Sep 19, 2022 12:11:55 PM org.apache.beam.sdk.extensions.sql.impl.CalciteQueryPlanner convertToBeamRel
INFO     apache_beam.utils.subprocess_server:subprocess_server.py:126 INFO: SQLPlan>
INFO     apache_beam.utils.subprocess_server:subprocess_server.py:126 LogicalProject(id=[$0], metadata=[$4])
INFO     apache_beam.utils.subprocess_server:subprocess_server.py:126   LogicalJoin(condition=[=($0, $3)], joinType=[inner])
INFO     apache_beam.utils.subprocess_server:subprocess_server.py:126     BeamIOSourceRel(table=[[beam, simple]])
INFO     apache_beam.utils.subprocess_server:subprocess_server.py:126     BeamIOSourceRel(table=[[beam, enrich]])
INFO     apache_beam.utils.subprocess_server:subprocess_server.py:126 
INFO     apache_beam.utils.subprocess_server:subprocess_server.py:126 Sep 19, 2022 12:11:55 PM org.apache.beam.sdk.extensions.sql.impl.CalciteQueryPlanner convertToBeamRel
INFO     apache_beam.utils.subprocess_server:subprocess_server.py:126 INFO: BEAMPlan>
INFO     apache_beam.utils.subprocess_server:subprocess_server.py:126 BeamCalcRel(expr#0..4=[{inputs}], id=[$t0], metadata=[$t4])
INFO     apache_beam.utils.subprocess_server:subprocess_server.py:126   BeamCoGBKJoinRel(condition=[=($0, $3)], joinType=[inner])
INFO     apache_beam.utils.subprocess_server:subprocess_server.py:126     BeamIOSourceRel(table=[[beam, simple]])
INFO     apache_beam.utils.subprocess_server:subprocess_server.py:126     BeamIOSourceRel(table=[[beam, enrich]])
INFO     apache_beam.utils.subprocess_server:subprocess_server.py:126 
INFO     root:environments.py:376 Default Python SDK image for environment is apache/beam_python3.7_sdk:2.43.0.dev
INFO     root:environments.py:299 No image given, using default Python SDK image
INFO     root:environments.py:376 Default Python SDK image for environment is apache/beam_python3.7_sdk:2.43.0.dev
INFO     root:environments.py:304 Python SDK container image set to "apache/beam_python3.7_sdk:2.43.0.dev" for Docker environment
INFO     apache_beam.runners.portability.fn_api_runner.translations:translations.py:714 ==================== <function pack_combiners at 0x7f25b0b4ddd0> ====================
INFO     apache_beam.runners.portability.fn_api_runner.translations:translations.py:714 ==================== <function lift_combiners at 0x7f25b0b4de60> ====================
INFO     apache_beam.runners.portability.fn_api_runner.translations:translations.py:714 ==================== <function sort_stages at 0x7f25b0b4e5f0> ====================
INFO     apache_beam.runners.portability.portable_runner:portable_runner.py:583 Job state changed to STOPPED
INFO     apache_beam.runners.portability.portable_runner:portable_runner.py:583 Job state changed to STARTING
INFO     apache_beam.runners.portability.portable_runner:portable_runner.py:583 Job state changed to RUNNING
INFO     apache_beam.runners.portability.portable_runner:portable_runner.py:583 Job state changed to DONE
PASSED                                                                   [ 77%]
apache_beam/transforms/sql_test.py::SqlTransformTest::test_windowing_before_sql 
-------------------------------- live log call ---------------------------------
INFO     apache_beam.utils.subprocess_server:subprocess_server.py:239 Using pre-built snapshot at <https://ci-beam.apache.org/job/beam_PostCommit_XVR_Samza/ws/src/sdks/java/extensions/sql/expansion-service/build/libs/beam-sdks-java-extensions-sql-expansion-service-2.43.0-SNAPSHOT.jar>
INFO     root:external.py:773 Starting a JAR-based expansion service from JAR <https://ci-beam.apache.org/job/beam_PostCommit_XVR_Samza/ws/src/sdks/java/extensions/sql/expansion-service/build/libs/beam-sdks-java-extensions-sql-expansion-service-2.43.0-SNAPSHOT.jar> 
INFO     apache_beam.utils.subprocess_server:subprocess_server.py:116 Starting service with ['java' '-jar' '<https://ci-beam.apache.org/job/beam_PostCommit_XVR_Samza/ws/src/sdks/java/extensions/sql/expansion-service/build/libs/beam-sdks-java-extensions-sql-expansion-service-2.43.0-SNAPSHOT.jar'> '52381' '--filesToStage=<https://ci-beam.apache.org/job/beam_PostCommit_XVR_Samza/ws/src/sdks/java/extensions/sql/expansion-service/build/libs/beam-sdks-java-extensions-sql-expansion-service-2.43.0-SNAPSHOT.jar']>
INFO     apache_beam.utils.subprocess_server:subprocess_server.py:126 Starting expansion service at localhost:52381
INFO     apache_beam.utils.subprocess_server:subprocess_server.py:126 Sep 19, 2022 12:12:16 PM org.apache.beam.sdk.expansion.service.ExpansionService loadRegisteredTransforms
INFO     apache_beam.utils.subprocess_server:subprocess_server.py:126 INFO: Registering external transforms: [beam:external:java:sql:v1, beam:transform:org.apache.beam:pubsub_read:v1, beam:transform:org.apache.beam:pubsub_write:v1, beam:transform:org.apache.beam:pubsublite_write:v1, beam:transform:org.apache.beam:pubsublite_read:v1, beam:transform:org.apache.beam:spanner_insert:v1, beam:transform:org.apache.beam:spanner_update:v1, beam:transform:org.apache.beam:spanner_replace:v1, beam:transform:org.apache.beam:spanner_insert_or_update:v1, beam:transform:org.apache.beam:spanner_delete:v1, beam:transform:org.apache.beam:spanner_read:v1, beam:transform:org.apache.beam:kafka_read_with_metadata:v1, beam:transform:org.apache.beam:kafka_read_without_metadata:v1, beam:transform:org.apache.beam:kafka_write:v1, beam:external:java:generate_sequence:v1]
INFO     apache_beam.utils.subprocess_server:subprocess_server.py:126 	beam:external:java:sql:v1: org.apache.beam.sdk.expansion.service.ExpansionService$ExternalTransformRegistrarLoader$1@47eaca72
INFO     apache_beam.utils.subprocess_server:subprocess_server.py:126 	beam:transform:org.apache.beam:pubsub_read:v1: org.apache.beam.sdk.expansion.service.ExpansionService$ExternalTransformRegistrarLoader$1@55141def
INFO     apache_beam.utils.subprocess_server:subprocess_server.py:126 	beam:transform:org.apache.beam:pubsub_write:v1: org.apache.beam.sdk.expansion.service.ExpansionService$ExternalTransformRegistrarLoader$1@55182842
INFO     apache_beam.utils.subprocess_server:subprocess_server.py:126 	beam:transform:org.apache.beam:pubsublite_write:v1: org.apache.beam.sdk.expansion.service.ExpansionService$ExternalTransformRegistrarLoader$1@3270d194
INFO     apache_beam.utils.subprocess_server:subprocess_server.py:126 	beam:transform:org.apache.beam:pubsublite_read:v1: org.apache.beam.sdk.expansion.service.ExpansionService$ExternalTransformRegistrarLoader$1@235834f2
INFO     apache_beam.utils.subprocess_server:subprocess_server.py:126 	beam:transform:org.apache.beam:spanner_insert:v1: org.apache.beam.sdk.expansion.service.ExpansionService$ExternalTransformRegistrarLoader$1@5656be13
INFO     apache_beam.utils.subprocess_server:subprocess_server.py:126 	beam:transform:org.apache.beam:spanner_update:v1: org.apache.beam.sdk.expansion.service.ExpansionService$ExternalTransformRegistrarLoader$1@4218d6a3
INFO     apache_beam.utils.subprocess_server:subprocess_server.py:126 	beam:transform:org.apache.beam:spanner_replace:v1: org.apache.beam.sdk.expansion.service.ExpansionService$ExternalTransformRegistrarLoader$1@76505305
INFO     apache_beam.utils.subprocess_server:subprocess_server.py:126 	beam:transform:org.apache.beam:spanner_insert_or_update:v1: org.apache.beam.sdk.expansion.service.ExpansionService$ExternalTransformRegistrarLoader$1@14cd1699
INFO     apache_beam.utils.subprocess_server:subprocess_server.py:126 	beam:transform:org.apache.beam:spanner_delete:v1: org.apache.beam.sdk.expansion.service.ExpansionService$ExternalTransformRegistrarLoader$1@77888435
INFO     apache_beam.utils.subprocess_server:subprocess_server.py:126 	beam:transform:org.apache.beam:spanner_read:v1: org.apache.beam.sdk.expansion.service.ExpansionService$ExternalTransformRegistrarLoader$1@73a1e9a9
INFO     apache_beam.utils.subprocess_server:subprocess_server.py:126 	beam:transform:org.apache.beam:kafka_read_with_metadata:v1: org.apache.beam.sdk.expansion.service.ExpansionService$ExternalTransformRegistrarLoader$1@71d44a3
INFO     apache_beam.utils.subprocess_server:subprocess_server.py:126 	beam:transform:org.apache.beam:kafka_read_without_metadata:v1: org.apache.beam.sdk.expansion.service.ExpansionService$ExternalTransformRegistrarLoader$1@7b98f307
INFO     apache_beam.utils.subprocess_server:subprocess_server.py:126 	beam:transform:org.apache.beam:kafka_write:v1: org.apache.beam.sdk.expansion.service.ExpansionService$ExternalTransformRegistrarLoader$1@4802796d
INFO     apache_beam.utils.subprocess_server:subprocess_server.py:126 	beam:external:java:generate_sequence:v1: org.apache.beam.sdk.expansion.service.ExpansionService$ExternalTransformRegistrarLoader$1@34123d65
INFO     apache_beam.utils.subprocess_server:subprocess_server.py:126 Sep 19, 2022 12:12:18 PM org.apache.beam.sdk.expansion.service.ExpansionService expand
INFO     apache_beam.utils.subprocess_server:subprocess_server.py:126 INFO: Expanding 'SqlTransform(beam:external:java:sql:v1)' with URN 'beam:external:java:sql:v1'
INFO     apache_beam.utils.subprocess_server:subprocess_server.py:126 Sep 19, 2022 12:12:18 PM org.apache.beam.sdk.expansion.service.ExpansionService$ExternalTransformRegistrarLoader payloadToConfig
INFO     apache_beam.utils.subprocess_server:subprocess_server.py:126 WARNING: Configuration class 'org.apache.beam.sdk.extensions.sql.expansion.ExternalSqlTransformRegistrar$Configuration' has no schema registered. Attempting to construct with setter approach.
INFO     apache_beam.utils.subprocess_server:subprocess_server.py:126 Sep 19, 2022 12:12:19 PM org.apache.beam.sdk.expansion.service.ExpansionService$ExternalTransformRegistrarLoader payloadToConfig
INFO     apache_beam.utils.subprocess_server:subprocess_server.py:126 WARNING: Configuration class 'org.apache.beam.sdk.extensions.sql.expansion.ExternalSqlTransformRegistrar$Configuration' has no schema registered. Attempting to construct with setter approach.
INFO     apache_beam.utils.subprocess_server:subprocess_server.py:126 Sep 19, 2022 12:12:20 PM org.apache.beam.sdk.extensions.sql.impl.CalciteQueryPlanner convertToBeamRel
INFO     apache_beam.utils.subprocess_server:subprocess_server.py:126 INFO: SQL:
INFO     apache_beam.utils.subprocess_server:subprocess_server.py:126 SELECT COUNT(*) AS `count`
INFO     apache_beam.utils.subprocess_server:subprocess_server.py:126 FROM `beam`.`PCOLLECTION` AS `PCOLLECTION`
INFO     apache_beam.utils.subprocess_server:subprocess_server.py:126 Sep 19, 2022 12:12:20 PM org.apache.beam.sdk.extensions.sql.impl.CalciteQueryPlanner convertToBeamRel
INFO     apache_beam.utils.subprocess_server:subprocess_server.py:126 INFO: SQLPlan>
INFO     apache_beam.utils.subprocess_server:subprocess_server.py:126 LogicalAggregate(group=[{}], count=[COUNT()])
INFO     apache_beam.utils.subprocess_server:subprocess_server.py:126   BeamIOSourceRel(table=[[beam, PCOLLECTION]])
INFO     apache_beam.utils.subprocess_server:subprocess_server.py:126 
INFO     apache_beam.utils.subprocess_server:subprocess_server.py:126 Sep 19, 2022 12:12:21 PM org.apache.beam.sdk.extensions.sql.impl.CalciteQueryPlanner convertToBeamRel
INFO     apache_beam.utils.subprocess_server:subprocess_server.py:126 INFO: BEAMPlan>
INFO     apache_beam.utils.subprocess_server:subprocess_server.py:126 BeamAggregationRel(group=[{}], count=[COUNT()])
INFO     apache_beam.utils.subprocess_server:subprocess_server.py:126   BeamIOSourceRel(table=[[beam, PCOLLECTION]])
INFO     apache_beam.utils.subprocess_server:subprocess_server.py:126 
INFO     root:environments.py:376 Default Python SDK image for environment is apache/beam_python3.7_sdk:2.43.0.dev
INFO     root:environments.py:299 No image given, using default Python SDK image
INFO     root:environments.py:376 Default Python SDK image for environment is apache/beam_python3.7_sdk:2.43.0.dev
INFO     root:environments.py:304 Python SDK container image set to "apache/beam_python3.7_sdk:2.43.0.dev" for Docker environment
INFO     apache_beam.runners.portability.fn_api_runner.translations:translations.py:714 ==================== <function pack_combiners at 0x7f25b0b4ddd0> ====================
INFO     apache_beam.runners.portability.fn_api_runner.translations:translations.py:714 ==================== <function lift_combiners at 0x7f25b0b4de60> ====================
INFO     apache_beam.runners.portability.fn_api_runner.translations:translations.py:714 ==================== <function sort_stages at 0x7f25b0b4e5f0> ====================
INFO     apache_beam.runners.portability.portable_runner:portable_runner.py:583 Job state changed to STOPPED
INFO     apache_beam.runners.portability.portable_runner:portable_runner.py:583 Job state changed to STARTING
INFO     apache_beam.runners.portability.portable_runner:portable_runner.py:583 Job state changed to RUNNING
INFO     apache_beam.runners.portability.portable_runner:portable_runner.py:583 Job state changed to DONE
PASSED                                                                   [ 88%]
apache_beam/transforms/sql_test.py::SqlTransformTest::test_zetasql_generate_data 
-------------------------------- live log call ---------------------------------
INFO     apache_beam.utils.subprocess_server:subprocess_server.py:239 Using pre-built snapshot at <https://ci-beam.apache.org/job/beam_PostCommit_XVR_Samza/ws/src/sdks/java/extensions/sql/expansion-service/build/libs/beam-sdks-java-extensions-sql-expansion-service-2.43.0-SNAPSHOT.jar>
INFO     root:external.py:773 Starting a JAR-based expansion service from JAR <https://ci-beam.apache.org/job/beam_PostCommit_XVR_Samza/ws/src/sdks/java/extensions/sql/expansion-service/build/libs/beam-sdks-java-extensions-sql-expansion-service-2.43.0-SNAPSHOT.jar> 
INFO     apache_beam.utils.subprocess_server:subprocess_server.py:116 Starting service with ['java' '-jar' '<https://ci-beam.apache.org/job/beam_PostCommit_XVR_Samza/ws/src/sdks/java/extensions/sql/expansion-service/build/libs/beam-sdks-java-extensions-sql-expansion-service-2.43.0-SNAPSHOT.jar'> '52435' '--filesToStage=<https://ci-beam.apache.org/job/beam_PostCommit_XVR_Samza/ws/src/sdks/java/extensions/sql/expansion-service/build/libs/beam-sdks-java-extensions-sql-expansion-service-2.43.0-SNAPSHOT.jar']>
INFO     apache_beam.utils.subprocess_server:subprocess_server.py:126 Starting expansion service at localhost:52435
INFO     apache_beam.utils.subprocess_server:subprocess_server.py:126 Sep 19, 2022 12:12:42 PM org.apache.beam.sdk.expansion.service.ExpansionService loadRegisteredTransforms
INFO     apache_beam.utils.subprocess_server:subprocess_server.py:126 INFO: Registering external transforms: [beam:external:java:sql:v1, beam:transform:org.apache.beam:pubsub_read:v1, beam:transform:org.apache.beam:pubsub_write:v1, beam:transform:org.apache.beam:pubsublite_write:v1, beam:transform:org.apache.beam:pubsublite_read:v1, beam:transform:org.apache.beam:spanner_insert:v1, beam:transform:org.apache.beam:spanner_update:v1, beam:transform:org.apache.beam:spanner_replace:v1, beam:transform:org.apache.beam:spanner_insert_or_update:v1, beam:transform:org.apache.beam:spanner_delete:v1, beam:transform:org.apache.beam:spanner_read:v1, beam:transform:org.apache.beam:kafka_read_with_metadata:v1, beam:transform:org.apache.beam:kafka_read_without_metadata:v1, beam:transform:org.apache.beam:kafka_write:v1, beam:external:java:generate_sequence:v1]
INFO     apache_beam.utils.subprocess_server:subprocess_server.py:126 	beam:external:java:sql:v1: org.apache.beam.sdk.expansion.service.ExpansionService$ExternalTransformRegistrarLoader$1@47eaca72
INFO     apache_beam.utils.subprocess_server:subprocess_server.py:126 	beam:transform:org.apache.beam:pubsub_read:v1: org.apache.beam.sdk.expansion.service.ExpansionService$ExternalTransformRegistrarLoader$1@55141def
INFO     apache_beam.utils.subprocess_server:subprocess_server.py:126 	beam:transform:org.apache.beam:pubsub_write:v1: org.apache.beam.sdk.expansion.service.ExpansionService$ExternalTransformRegistrarLoader$1@55182842
INFO     apache_beam.utils.subprocess_server:subprocess_server.py:126 	beam:transform:org.apache.beam:pubsublite_write:v1: org.apache.beam.sdk.expansion.service.ExpansionService$ExternalTransformRegistrarLoader$1@3270d194
INFO     apache_beam.utils.subprocess_server:subprocess_server.py:126 	beam:transform:org.apache.beam:pubsublite_read:v1: org.apache.beam.sdk.expansion.service.ExpansionService$ExternalTransformRegistrarLoader$1@235834f2
INFO     apache_beam.utils.subprocess_server:subprocess_server.py:126 	beam:transform:org.apache.beam:spanner_insert:v1: org.apache.beam.sdk.expansion.service.ExpansionService$ExternalTransformRegistrarLoader$1@5656be13
INFO     apache_beam.utils.subprocess_server:subprocess_server.py:126 	beam:transform:org.apache.beam:spanner_update:v1: org.apache.beam.sdk.expansion.service.ExpansionService$ExternalTransformRegistrarLoader$1@4218d6a3
INFO     apache_beam.utils.subprocess_server:subprocess_server.py:126 	beam:transform:org.apache.beam:spanner_replace:v1: org.apache.beam.sdk.expansion.service.ExpansionService$ExternalTransformRegistrarLoader$1@76505305
INFO     apache_beam.utils.subprocess_server:subprocess_server.py:126 	beam:transform:org.apache.beam:spanner_insert_or_update:v1: org.apache.beam.sdk.expansion.service.ExpansionService$ExternalTransformRegistrarLoader$1@14cd1699
INFO     apache_beam.utils.subprocess_server:subprocess_server.py:126 	beam:transform:org.apache.beam:spanner_delete:v1: org.apache.beam.sdk.expansion.service.ExpansionService$ExternalTransformRegistrarLoader$1@77888435
INFO     apache_beam.utils.subprocess_server:subprocess_server.py:126 	beam:transform:org.apache.beam:spanner_read:v1: org.apache.beam.sdk.expansion.service.ExpansionService$ExternalTransformRegistrarLoader$1@73a1e9a9
INFO     apache_beam.utils.subprocess_server:subprocess_server.py:126 	beam:transform:org.apache.beam:kafka_read_with_metadata:v1: org.apache.beam.sdk.expansion.service.ExpansionService$ExternalTransformRegistrarLoader$1@71d44a3
INFO     apache_beam.utils.subprocess_server:subprocess_server.py:126 	beam:transform:org.apache.beam:kafka_read_without_metadata:v1: org.apache.beam.sdk.expansion.service.ExpansionService$ExternalTransformRegistrarLoader$1@7b98f307
INFO     apache_beam.utils.subprocess_server:subprocess_server.py:126 	beam:transform:org.apache.beam:kafka_write:v1: org.apache.beam.sdk.expansion.service.ExpansionService$ExternalTransformRegistrarLoader$1@4802796d
INFO     apache_beam.utils.subprocess_server:subprocess_server.py:126 	beam:external:java:generate_sequence:v1: org.apache.beam.sdk.expansion.service.ExpansionService$ExternalTransformRegistrarLoader$1@34123d65
INFO     apache_beam.utils.subprocess_server:subprocess_server.py:126 Sep 19, 2022 12:12:44 PM org.apache.beam.sdk.expansion.service.ExpansionService expand
INFO     apache_beam.utils.subprocess_server:subprocess_server.py:126 INFO: Expanding 'SqlTransform(beam:external:java:sql:v1)' with URN 'beam:external:java:sql:v1'
INFO     apache_beam.utils.subprocess_server:subprocess_server.py:126 Sep 19, 2022 12:12:44 PM org.apache.beam.sdk.expansion.service.ExpansionService$ExternalTransformRegistrarLoader payloadToConfig
INFO     apache_beam.utils.subprocess_server:subprocess_server.py:126 WARNING: Configuration class 'org.apache.beam.sdk.extensions.sql.expansion.ExternalSqlTransformRegistrar$Configuration' has no schema registered. Attempting to construct with setter approach.
INFO     apache_beam.utils.subprocess_server:subprocess_server.py:126 Sep 19, 2022 12:12:44 PM org.apache.beam.sdk.expansion.service.ExpansionService$ExternalTransformRegistrarLoader payloadToConfig
INFO     apache_beam.utils.subprocess_server:subprocess_server.py:126 WARNING: Configuration class 'org.apache.beam.sdk.extensions.sql.expansion.ExternalSqlTransformRegistrar$Configuration' has no schema registered. Attempting to construct with setter approach.
INFO     apache_beam.utils.subprocess_server:subprocess_server.py:126 Sep 19, 2022 12:12:46 PM com.google.zetasql.io.grpc.NameResolverRegistry getDefaultRegistry
INFO     apache_beam.utils.subprocess_server:subprocess_server.py:126 WARNING: No NameResolverProviders found via ServiceLoader, including for DNS. This is probably due to a broken build. If using ProGuard, check your configuration
INFO     apache_beam.utils.subprocess_server:subprocess_server.py:126 Sep 19, 2022 12:12:47 PM org.apache.beam.sdk.extensions.sql.zetasql.ZetaSQLQueryPlanner convertToBeamRelInternal
INFO     apache_beam.utils.subprocess_server:subprocess_server.py:126 INFO: BEAMPlan>
INFO     apache_beam.utils.subprocess_server:subprocess_server.py:126 BeamZetaSqlCalcRel(expr#0=[{inputs}], expr#1=[1:BIGINT], expr#2=['foo':VARCHAR], expr#3=[3.1400000000000001243E0:DOUBLE], int=[$t1], str=[$t2], flt=[$t3])
INFO     apache_beam.utils.subprocess_server:subprocess_server.py:126   BeamValuesRel(tuples=[[{ 0 }]])
INFO     apache_beam.utils.subprocess_server:subprocess_server.py:126 
INFO     root:environments.py:376 Default Python SDK image for environment is apache/beam_python3.7_sdk:2.43.0.dev
INFO     root:environments.py:299 No image given, using default Python SDK image
INFO     root:environments.py:376 Default Python SDK image for environment is apache/beam_python3.7_sdk:2.43.0.dev
INFO     root:environments.py:304 Python SDK container image set to "apache/beam_python3.7_sdk:2.43.0.dev" for Docker environment
INFO     apache_beam.runners.portability.fn_api_runner.translations:translations.py:714 ==================== <function pack_combiners at 0x7f25b0b4ddd0> ====================
INFO     apache_beam.runners.portability.fn_api_runner.translations:translations.py:714 ==================== <function lift_combiners at 0x7f25b0b4de60> ====================
INFO     apache_beam.runners.portability.fn_api_runner.translations:translations.py:714 ==================== <function sort_stages at 0x7f25b0b4e5f0> ====================
INFO     apache_beam.runners.portability.portable_runner:portable_runner.py:583 Job state changed to STOPPED
INFO     apache_beam.runners.portability.portable_runner:portable_runner.py:583 Job state changed to STARTING
INFO     apache_beam.runners.portability.portable_runner:portable_runner.py:583 Job state changed to RUNNING
INFO     apache_beam.runners.portability.portable_runner:portable_runner.py:583 Job state changed to DONE
PASSED                                                                   [100%]

=============================== warnings summary ===============================
../../build/gradleenv/1922375555/lib/python3.7/site-packages/hdfs/config.py:15
  <https://ci-beam.apache.org/job/beam_PostCommit_XVR_Samza/ws/src/build/gradleenv/1922375555/lib/python3.7/site-packages/hdfs/config.py>:15: DeprecationWarning: the imp module is deprecated in favour of importlib; see the module's documentation for alternative uses
    from imp import load_source

../../build/gradleenv/1922375555/lib/python3.7/site-packages/google/api_core/grpc_helpers.py:42
  <https://ci-beam.apache.org/job/beam_PostCommit_XVR_Samza/ws/src/build/gradleenv/1922375555/lib/python3.7/site-packages/google/api_core/grpc_helpers.py>:42: DeprecationWarning: Support for grpcio-gcp is deprecated. This feature will be
              removed from `google-api-core` after January 1, 2024. If you need to
              continue to use this feature, please pin to a specific version of
              `google-api-core`.
    DeprecationWarning,

-- Docs: https://docs.pytest.org/en/stable/how-to/capture-warnings.html
- generated xml file: <https://ci-beam.apache.org/job/beam_PostCommit_XVR_Samza/ws/src/sdks/python/pytest_xlangSqlValidateRunner.xml> -
==== 9 passed, 3 skipped, 6661 deselected, 2 warnings in 236.18s (0:03:56) =====

> Task :runners:samza:job-server:samzaJobServerCleanup
Stopping job server pid: 1980461.

> Task :runners:samza:job-server:validatesCrossLanguageRunnerCleanup
Stopping expansion service pid: 1990721.
Stopping expansion service pid: 1990722.

FAILURE: Build failed with an exception.

* Where:
Build file '<https://ci-beam.apache.org/job/beam_PostCommit_XVR_Samza/ws/src/sdks/go/test/build.gradle'> line: 195

* What went wrong:
Execution failed for task ':runners:samza:job-server:validatesCrossLanguageRunnerGoUsingJava'.
> Process 'command 'sh'' finished with non-zero exit value 1

* Try:
> Run with --stacktrace option to get the stack trace.
> Run with --info or --debug option to get more log output.

* Get more help at https://help.gradle.org

Deprecated Gradle features were used in this build, making it incompatible with Gradle 8.0.

You can use '--warning-mode all' to show the individual deprecation warnings and determine if they come from your own scripts or plugins.

See https://docs.gradle.org/7.5.1/userguide/command_line_interface.html#sec:command_line_warnings

Execution optimizations have been disabled for 1 invalid unit(s) of work during this build to ensure correctness.
Please consult deprecation warnings for more details.

BUILD FAILED in 30m 46s
260 actionable tasks: 171 executed, 77 from cache, 12 up-to-date

Publishing build scan...
https://gradle.com/s/ujfwbjjlu76jq

Build step 'Invoke Gradle script' changed build result to FAILURE
Build step 'Invoke Gradle script' marked build as failure

---------------------------------------------------------------------
To unsubscribe, e-mail: builds-unsubscribe@beam.apache.org
For additional commands, e-mail: builds-help@beam.apache.org