You are viewing a plain text version of this content. The canonical link for it is here.
Posted to issues@tez.apache.org by Apache Jenkins Server <je...@builds.apache.org> on 2016/01/20 01:40:16 UTC
Failed: TEZ-3053 PreCommit Build #1427
Jira: https://issues.apache.org/jira/browse/TEZ-3053
Build: https://builds.apache.org/job/PreCommit-TEZ-Build/1427/
###################################################################################
########################## LAST 60 LINES OF THE CONSOLE ###########################
[...truncated 3573 lines...]
[ERROR] [Help 2] http://cwiki.apache.org/confluence/display/MAVEN/MojoExecutionException
[ERROR]
[ERROR] After correcting the problems, you can resume the build with the command
[ERROR] mvn <goals> -rf :tez-tests
[INFO] Build failures were ignored.
{color:red}-1 overall{color}. Here are the results of testing the latest attachment
http://issues.apache.org/jira/secure/attachment/12783206/TEZ-3053.1.txt
against master revision 9e47c63.
{color:green}+1 @author{color}. The patch does not contain any @author tags.
{color:green}+1 tests included{color}. The patch appears to include 1 new or modified test files.
{color:green}+1 javac{color}. The applied patch does not increase the total number of javac compiler warnings.
{color:green}+1 javadoc{color}. There were no new javadoc warning messages.
{color:green}+1 findbugs{color}. The patch does not introduce any new Findbugs (version 3.0.1) warnings.
{color:green}+1 release audit{color}. The applied patch does not increase the total number of release audit warnings.
{color:red}-1 core tests{color}. The patch failed these unit tests in :
org.apache.tez.test.TestRecovery
Test results: https://builds.apache.org/job/PreCommit-TEZ-Build/1427//testReport/
Console output: https://builds.apache.org/job/PreCommit-TEZ-Build/1427//console
This message is automatically generated.
======================================================================
======================================================================
Adding comment to Jira.
======================================================================
======================================================================
Comment added.
f61a7bc94ff5f99c7a6187db8faaf69af37d7662 logged out
======================================================================
======================================================================
Finished build.
======================================================================
======================================================================
Build step 'Execute shell' marked build as failure
Archiving artifacts
Compressed 3.17 MB of artifacts by 27.6% relative to #1421
[description-setter] Could not determine description.
Recording test results
Email was triggered for: Failure - Any
Sending email for trigger: Failure - Any
###################################################################################
############################## FAILED TESTS (if any) ##############################
1 tests failed.
FAILED: org.apache.tez.test.TestRecovery.testRecovery_HashJoin
Error Message:
port out of range:-1
Stack Trace:
java.lang.IllegalArgumentException: port out of range:-1
at java.net.InetSocketAddress.checkPort(InetSocketAddress.java:143)
at java.net.InetSocketAddress.createUnresolved(InetSocketAddress.java:254)
at org.apache.hadoop.net.NetUtils.createSocketAddrForHost(NetUtils.java:244)
at org.apache.tez.client.TezClientUtils.getAMProxy(TezClientUtils.java:910)
at org.apache.tez.client.TezClientUtils.getAMProxy(TezClientUtils.java:902)
at org.apache.tez.client.TezClient.getAMProxy(TezClient.java:821)
at org.apache.tez.client.TezClient.getAppMasterStatus(TezClient.java:699)
at org.apache.tez.client.TezClient.waitNonSessionTillReady(TezClient.java:797)
at org.apache.tez.client.TezClient.submitDAGApplication(TezClient.java:900)
at org.apache.tez.client.TezClient.submitDAGApplication(TezClient.java:855)
at org.apache.tez.client.TezClient.submitDAG(TezClient.java:454)
at org.apache.tez.examples.TezExampleBase.runDag(TezExampleBase.java:180)
at org.apache.tez.examples.HashJoinExample.runJob(HashJoinExample.java:130)
at org.apache.tez.examples.TezExampleBase._execute(TezExampleBase.java:232)
at org.apache.tez.examples.TezExampleBase.run(TezExampleBase.java:113)
at org.apache.tez.test.TestRecovery.testHashJoinExample(TestRecovery.java:476)
at org.apache.tez.test.TestRecovery.testRecovery_HashJoin(TestRecovery.java:405)
Success: TEZ-3053 PreCommit Build #1428
Posted by Apache Jenkins Server <je...@builds.apache.org>.
Jira: https://issues.apache.org/jira/browse/TEZ-3053
Build: https://builds.apache.org/job/PreCommit-TEZ-Build/1428/
###################################################################################
########################## LAST 60 LINES OF THE CONSOLE ###########################
[...truncated 3765 lines...]
[INFO] Tez ............................................... SUCCESS [ 0.033 s]
[INFO] ------------------------------------------------------------------------
[INFO] BUILD SUCCESS
[INFO] ------------------------------------------------------------------------
[INFO] Total time: 54:04 min
[INFO] Finished at: 2016-01-20T02:28:48+00:00
[INFO] Final Memory: 89M/1409M
[INFO] ------------------------------------------------------------------------
{color:green}+1 overall{color}. Here are the results of testing the latest attachment
http://issues.apache.org/jira/secure/attachment/12783206/TEZ-3053.1.txt
against master revision cc06400.
{color:green}+1 @author{color}. The patch does not contain any @author tags.
{color:green}+1 tests included{color}. The patch appears to include 1 new or modified test files.
{color:green}+1 javac{color}. The applied patch does not increase the total number of javac compiler warnings.
{color:green}+1 javadoc{color}. There were no new javadoc warning messages.
{color:green}+1 findbugs{color}. The patch does not introduce any new Findbugs (version 3.0.1) warnings.
{color:green}+1 release audit{color}. The applied patch does not increase the total number of release audit warnings.
{color:green}+1 core tests{color}. The patch passed unit tests in .
Test results: https://builds.apache.org/job/PreCommit-TEZ-Build/1428//testReport/
Console output: https://builds.apache.org/job/PreCommit-TEZ-Build/1428//console
This message is automatically generated.
======================================================================
======================================================================
Adding comment to Jira.
======================================================================
======================================================================
Comment added.
1c5e1e6a90266e431f803e2769da3b54d07c7299 logged out
======================================================================
======================================================================
Finished build.
======================================================================
======================================================================
Archiving artifacts
[description-setter] Description set: TEZ-3053
Recording test results
Email was triggered for: Success
Sending email for trigger: Success
###################################################################################
############################## FAILED TESTS (if any) ##############################
All tests passed