You are viewing a plain text version of this content. The canonical link for it is here.
Posted to builds@solr.apache.org by Apache Jenkins Server <je...@builds.apache.org> on 2024/12/08 22:18:59 UTC
[JENKINS] Solr » Solr-NightlyTests-main - Build # 1305 - Still Unstable!
Build: https://ci-builds.apache.org/job/Solr/job/Solr-NightlyTests-main/1305/
10 tests failed.
FAILED: org.apache.solr.cloud.UnloadDistributedZkTest.test
Error Message:
com.carrotsearch.randomizedtesting.UncaughtExceptionError: Captured an uncaught exception in thread: Thread[id=80046, name=zkCallback-52082-thread-4, state=RUNNABLE, group=TGRP-UnloadDistributedZkTest]
Stack Trace:
com.carrotsearch.randomizedtesting.UncaughtExceptionError: Captured an uncaught exception in thread: Thread[id=80046, name=zkCallback-52082-thread-4, state=RUNNABLE, group=TGRP-UnloadDistributedZkTest]
at __randomizedtesting.SeedInfo.seed([B08CAB6CDDEC9EC8:38D894B67310F330]:0)
Caused by: org.apache.solr.common.SolrException: core not found: multiunload0
at __randomizedtesting.SeedInfo.seed([B08CAB6CDDEC9EC8]:0)
at app//org.apache.solr.handler.admin.PrepRecoveryOp.lambda$execute$0(PrepRecoveryOp.java:94)
at app//org.apache.solr.common.cloud.ZkStateReader.lambda$waitForState$10(ZkStateReader.java:1645)
at app//org.apache.solr.common.cloud.ZkStateReader$DocCollectionAndLiveNodesWatcherWrapper.onChange(ZkStateReader.java:2148)
at app//org.apache.solr.common.cloud.ZkStateReader.lambda$refreshLiveNodes$2(ZkStateReader.java:833)
at java.base@21.0.4/java.util.concurrent.ConcurrentHashMap$KeySetView.forEach(ConcurrentHashMap.java:4709)
at app//org.apache.solr.common.cloud.ZkStateReader.refreshLiveNodes(ZkStateReader.java:831)
at app//org.apache.solr.common.cloud.ZkStateReader$LiveNodeWatcher.refreshAndWatch(ZkStateReader.java:1386)
at app//org.apache.solr.common.cloud.ZkStateReader$LiveNodeWatcher.process(ZkStateReader.java:1381)
at app//org.apache.solr.common.cloud.SolrZkClient$ProcessWatchWithExecutor.lambda$process$0(SolrZkClient.java:1179)
at app//org.apache.solr.common.util.ExecutorUtil$MDCAwareThreadPoolExecutor.lambda$execute$0(ExecutorUtil.java:380)
at java.base@21.0.4/java.util.concurrent.ThreadPoolExecutor.runWorker(ThreadPoolExecutor.java:1144)
at java.base@21.0.4/java.util.concurrent.ThreadPoolExecutor$Worker.run(ThreadPoolExecutor.java:642)
at java.base@21.0.4/java.lang.Thread.run(Thread.java:1583)
FAILED: org.apache.solr.handler.admin.api.ClusterPropsAPITest.testClusterPropertyOpsAllGood
Error Message:
java.lang.AssertionError: expected:<0> but was:<1>
Stack Trace:
java.lang.AssertionError: expected:<0> but was:<1>
at __randomizedtesting.SeedInfo.seed([B08CAB6CDDEC9EC8:EB56A2EDC4CEB5EB]:0)
at org.junit.Assert.fail(Assert.java:89)
at org.junit.Assert.failNotEquals(Assert.java:835)
at org.junit.Assert.assertEquals(Assert.java:647)
at org.junit.Assert.assertEquals(Assert.java:633)
at org.apache.solr.handler.admin.api.ClusterPropsAPITest.testClusterPropertyOpsAllGood(ClusterPropsAPITest.java:93)
at java.base/jdk.internal.reflect.DirectMethodHandleAccessor.invoke(DirectMethodHandleAccessor.java:103)
at java.base/java.lang.reflect.Method.invoke(Method.java:580)
at com.carrotsearch.randomizedtesting.RandomizedRunner.invoke(RandomizedRunner.java:1758)
at com.carrotsearch.randomizedtesting.RandomizedRunner$8.evaluate(RandomizedRunner.java:946)
at com.carrotsearch.randomizedtesting.RandomizedRunner$9.evaluate(RandomizedRunner.java:982)
at com.carrotsearch.randomizedtesting.RandomizedRunner$10.evaluate(RandomizedRunner.java:996)
at com.carrotsearch.randomizedtesting.rules.SystemPropertiesRestoreRule$1.evaluate(SystemPropertiesRestoreRule.java:80)
at org.junit.rules.RunRules.evaluate(RunRules.java:20)
at org.apache.lucene.tests.util.TestRuleSetupTeardownChained$1.evaluate(TestRuleSetupTeardownChained.java:48)
at org.apache.lucene.tests.util.AbstractBeforeAfterRule$1.evaluate(AbstractBeforeAfterRule.java:43)
at org.apache.lucene.tests.util.TestRuleThreadAndTestName$1.evaluate(TestRuleThreadAndTestName.java:45)
at org.apache.lucene.tests.util.TestRuleIgnoreAfterMaxFailures$1.evaluate(TestRuleIgnoreAfterMaxFailures.java:60)
at org.apache.lucene.tests.util.TestRuleMarkFailure$1.evaluate(TestRuleMarkFailure.java:44)
at org.junit.rules.RunRules.evaluate(RunRules.java:20)
at com.carrotsearch.randomizedtesting.rules.StatementAdapter.evaluate(StatementAdapter.java:36)
at com.carrotsearch.randomizedtesting.ThreadLeakControl$StatementRunner.run(ThreadLeakControl.java:390)
at com.carrotsearch.randomizedtesting.ThreadLeakControl.forkTimeoutingTask(ThreadLeakControl.java:843)
at com.carrotsearch.randomizedtesting.ThreadLeakControl$3.evaluate(ThreadLeakControl.java:490)
at com.carrotsearch.randomizedtesting.RandomizedRunner.runSingleTest(RandomizedRunner.java:955)
at com.carrotsearch.randomizedtesting.RandomizedRunner$5.evaluate(RandomizedRunner.java:840)
at com.carrotsearch.randomizedtesting.RandomizedRunner$6.evaluate(RandomizedRunner.java:891)
at com.carrotsearch.randomizedtesting.RandomizedRunner$7.evaluate(RandomizedRunner.java:902)
at com.carrotsearch.randomizedtesting.rules.StatementAdapter.evaluate(StatementAdapter.java:36)
at com.carrotsearch.randomizedtesting.rules.StatementAdapter.evaluate(StatementAdapter.java:36)
at org.apache.lucene.tests.util.AbstractBeforeAfterRule$1.evaluate(AbstractBeforeAfterRule.java:43)
at com.carrotsearch.randomizedtesting.rules.SystemPropertiesRestoreRule$1.evaluate(SystemPropertiesRestoreRule.java:80)
at org.junit.rules.RunRules.evaluate(RunRules.java:20)
at org.apache.lucene.tests.util.AbstractBeforeAfterRule$1.evaluate(AbstractBeforeAfterRule.java:43)
at com.carrotsearch.randomizedtesting.rules.StatementAdapter.evaluate(StatementAdapter.java:36)
at org.apache.lucene.tests.util.TestRuleStoreClassName$1.evaluate(TestRuleStoreClassName.java:38)
at com.carrotsearch.randomizedtesting.rules.NoShadowingOrOverridesOnMethodsRule$1.evaluate(NoShadowingOrOverridesOnMethodsRule.java:40)
at com.carrotsearch.randomizedtesting.rules.NoShadowingOrOverridesOnMethodsRule$1.evaluate(NoShadowingOrOverridesOnMethodsRule.java:40)
at com.carrotsearch.randomizedtesting.rules.StatementAdapter.evaluate(StatementAdapter.java:36)
at com.carrotsearch.randomizedtesting.rules.StatementAdapter.evaluate(StatementAdapter.java:36)
at org.apache.lucene.tests.util.TestRuleAssertionsRequired$1.evaluate(TestRuleAssertionsRequired.java:53)
at org.apache.lucene.tests.util.AbstractBeforeAfterRule$1.evaluate(AbstractBeforeAfterRule.java:43)
at org.apache.lucene.tests.util.TestRuleMarkFailure$1.evaluate(TestRuleMarkFailure.java:44)
at org.apache.lucene.tests.util.TestRuleIgnoreAfterMaxFailures$1.evaluate(TestRuleIgnoreAfterMaxFailures.java:60)
at org.apache.lucene.tests.util.TestRuleIgnoreTestSuites$1.evaluate(TestRuleIgnoreTestSuites.java:47)
at org.junit.rules.RunRules.evaluate(RunRules.java:20)
at com.carrotsearch.randomizedtesting.rules.StatementAdapter.evaluate(StatementAdapter.java:36)
at com.carrotsearch.randomizedtesting.ThreadLeakControl$StatementRunner.run(ThreadLeakControl.java:390)
at com.carrotsearch.randomizedtesting.ThreadLeakControl.lambda$forkTimeoutingTask$0(ThreadLeakControl.java:850)
at java.base/java.lang.Thread.run(Thread.java:1583)
FAILED: org.apache.solr.handler.admin.api.ClusterPropsAPITest.testClusterPropertyOpsAllGood
Error Message:
java.lang.AssertionError: expected:<0> but was:<1>
Stack Trace:
java.lang.AssertionError: expected:<0> but was:<1>
at __randomizedtesting.SeedInfo.seed([B08CAB6CDDEC9EC8:EB56A2EDC4CEB5EB]:0)
at org.junit.Assert.fail(Assert.java:89)
at org.junit.Assert.failNotEquals(Assert.java:835)
at org.junit.Assert.assertEquals(Assert.java:647)
at org.junit.Assert.assertEquals(Assert.java:633)
at org.apache.solr.handler.admin.api.ClusterPropsAPITest.testClusterPropertyOpsAllGood(ClusterPropsAPITest.java:93)
at java.base/jdk.internal.reflect.DirectMethodHandleAccessor.invoke(DirectMethodHandleAccessor.java:103)
at java.base/java.lang.reflect.Method.invoke(Method.java:580)
at com.carrotsearch.randomizedtesting.RandomizedRunner.invoke(RandomizedRunner.java:1758)
at com.carrotsearch.randomizedtesting.RandomizedRunner$8.evaluate(RandomizedRunner.java:946)
at com.carrotsearch.randomizedtesting.RandomizedRunner$9.evaluate(RandomizedRunner.java:982)
at com.carrotsearch.randomizedtesting.RandomizedRunner$10.evaluate(RandomizedRunner.java:996)
at com.carrotsearch.randomizedtesting.rules.SystemPropertiesRestoreRule$1.evaluate(SystemPropertiesRestoreRule.java:80)
at org.junit.rules.RunRules.evaluate(RunRules.java:20)
at org.apache.lucene.tests.util.TestRuleSetupTeardownChained$1.evaluate(TestRuleSetupTeardownChained.java:48)
at org.apache.lucene.tests.util.AbstractBeforeAfterRule$1.evaluate(AbstractBeforeAfterRule.java:43)
at org.apache.lucene.tests.util.TestRuleThreadAndTestName$1.evaluate(TestRuleThreadAndTestName.java:45)
at org.apache.lucene.tests.util.TestRuleIgnoreAfterMaxFailures$1.evaluate(TestRuleIgnoreAfterMaxFailures.java:60)
at org.apache.lucene.tests.util.TestRuleMarkFailure$1.evaluate(TestRuleMarkFailure.java:44)
at org.junit.rules.RunRules.evaluate(RunRules.java:20)
at com.carrotsearch.randomizedtesting.rules.StatementAdapter.evaluate(StatementAdapter.java:36)
at com.carrotsearch.randomizedtesting.ThreadLeakControl$StatementRunner.run(ThreadLeakControl.java:390)
at com.carrotsearch.randomizedtesting.ThreadLeakControl.forkTimeoutingTask(ThreadLeakControl.java:843)
at com.carrotsearch.randomizedtesting.ThreadLeakControl$3.evaluate(ThreadLeakControl.java:490)
at com.carrotsearch.randomizedtesting.RandomizedRunner.runSingleTest(RandomizedRunner.java:955)
at com.carrotsearch.randomizedtesting.RandomizedRunner$5.evaluate(RandomizedRunner.java:840)
at com.carrotsearch.randomizedtesting.RandomizedRunner$6.evaluate(RandomizedRunner.java:891)
at com.carrotsearch.randomizedtesting.RandomizedRunner$7.evaluate(RandomizedRunner.java:902)
at com.carrotsearch.randomizedtesting.rules.StatementAdapter.evaluate(StatementAdapter.java:36)
at com.carrotsearch.randomizedtesting.rules.StatementAdapter.evaluate(StatementAdapter.java:36)
at org.apache.lucene.tests.util.AbstractBeforeAfterRule$1.evaluate(AbstractBeforeAfterRule.java:43)
at com.carrotsearch.randomizedtesting.rules.SystemPropertiesRestoreRule$1.evaluate(SystemPropertiesRestoreRule.java:80)
at org.junit.rules.RunRules.evaluate(RunRules.java:20)
at org.apache.lucene.tests.util.AbstractBeforeAfterRule$1.evaluate(AbstractBeforeAfterRule.java:43)
at com.carrotsearch.randomizedtesting.rules.StatementAdapter.evaluate(StatementAdapter.java:36)
at org.apache.lucene.tests.util.TestRuleStoreClassName$1.evaluate(TestRuleStoreClassName.java:38)
at com.carrotsearch.randomizedtesting.rules.NoShadowingOrOverridesOnMethodsRule$1.evaluate(NoShadowingOrOverridesOnMethodsRule.java:40)
at com.carrotsearch.randomizedtesting.rules.NoShadowingOrOverridesOnMethodsRule$1.evaluate(NoShadowingOrOverridesOnMethodsRule.java:40)
at com.carrotsearch.randomizedtesting.rules.StatementAdapter.evaluate(StatementAdapter.java:36)
at com.carrotsearch.randomizedtesting.rules.StatementAdapter.evaluate(StatementAdapter.java:36)
at org.apache.lucene.tests.util.TestRuleAssertionsRequired$1.evaluate(TestRuleAssertionsRequired.java:53)
at org.apache.lucene.tests.util.AbstractBeforeAfterRule$1.evaluate(AbstractBeforeAfterRule.java:43)
at org.apache.lucene.tests.util.TestRuleMarkFailure$1.evaluate(TestRuleMarkFailure.java:44)
at org.apache.lucene.tests.util.TestRuleIgnoreAfterMaxFailures$1.evaluate(TestRuleIgnoreAfterMaxFailures.java:60)
at org.apache.lucene.tests.util.TestRuleIgnoreTestSuites$1.evaluate(TestRuleIgnoreTestSuites.java:47)
at org.junit.rules.RunRules.evaluate(RunRules.java:20)
at com.carrotsearch.randomizedtesting.rules.StatementAdapter.evaluate(StatementAdapter.java:36)
at com.carrotsearch.randomizedtesting.ThreadLeakControl$StatementRunner.run(ThreadLeakControl.java:390)
at com.carrotsearch.randomizedtesting.ThreadLeakControl.lambda$forkTimeoutingTask$0(ThreadLeakControl.java:850)
at java.base/java.lang.Thread.run(Thread.java:1583)
FAILED: org.apache.solr.handler.admin.api.ClusterPropsAPITest.testClusterPropertyOpsAllGood
Error Message:
java.lang.AssertionError: expected:<0> but was:<1>
Stack Trace:
java.lang.AssertionError: expected:<0> but was:<1>
at __randomizedtesting.SeedInfo.seed([B08CAB6CDDEC9EC8:EB56A2EDC4CEB5EB]:0)
at org.junit.Assert.fail(Assert.java:89)
at org.junit.Assert.failNotEquals(Assert.java:835)
at org.junit.Assert.assertEquals(Assert.java:647)
at org.junit.Assert.assertEquals(Assert.java:633)
at org.apache.solr.handler.admin.api.ClusterPropsAPITest.testClusterPropertyOpsAllGood(ClusterPropsAPITest.java:93)
at java.base/jdk.internal.reflect.DirectMethodHandleAccessor.invoke(DirectMethodHandleAccessor.java:103)
at java.base/java.lang.reflect.Method.invoke(Method.java:580)
at com.carrotsearch.randomizedtesting.RandomizedRunner.invoke(RandomizedRunner.java:1758)
at com.carrotsearch.randomizedtesting.RandomizedRunner$8.evaluate(RandomizedRunner.java:946)
at com.carrotsearch.randomizedtesting.RandomizedRunner$9.evaluate(RandomizedRunner.java:982)
at com.carrotsearch.randomizedtesting.RandomizedRunner$10.evaluate(RandomizedRunner.java:996)
at com.carrotsearch.randomizedtesting.rules.SystemPropertiesRestoreRule$1.evaluate(SystemPropertiesRestoreRule.java:80)
at org.junit.rules.RunRules.evaluate(RunRules.java:20)
at org.apache.lucene.tests.util.TestRuleSetupTeardownChained$1.evaluate(TestRuleSetupTeardownChained.java:48)
at org.apache.lucene.tests.util.AbstractBeforeAfterRule$1.evaluate(AbstractBeforeAfterRule.java:43)
at org.apache.lucene.tests.util.TestRuleThreadAndTestName$1.evaluate(TestRuleThreadAndTestName.java:45)
at org.apache.lucene.tests.util.TestRuleIgnoreAfterMaxFailures$1.evaluate(TestRuleIgnoreAfterMaxFailures.java:60)
at org.apache.lucene.tests.util.TestRuleMarkFailure$1.evaluate(TestRuleMarkFailure.java:44)
at org.junit.rules.RunRules.evaluate(RunRules.java:20)
at com.carrotsearch.randomizedtesting.rules.StatementAdapter.evaluate(StatementAdapter.java:36)
at com.carrotsearch.randomizedtesting.ThreadLeakControl$StatementRunner.run(ThreadLeakControl.java:390)
at com.carrotsearch.randomizedtesting.ThreadLeakControl.forkTimeoutingTask(ThreadLeakControl.java:843)
at com.carrotsearch.randomizedtesting.ThreadLeakControl$3.evaluate(ThreadLeakControl.java:490)
at com.carrotsearch.randomizedtesting.RandomizedRunner.runSingleTest(RandomizedRunner.java:955)
at com.carrotsearch.randomizedtesting.RandomizedRunner$5.evaluate(RandomizedRunner.java:840)
at com.carrotsearch.randomizedtesting.RandomizedRunner$6.evaluate(RandomizedRunner.java:891)
at com.carrotsearch.randomizedtesting.RandomizedRunner$7.evaluate(RandomizedRunner.java:902)
at com.carrotsearch.randomizedtesting.rules.StatementAdapter.evaluate(StatementAdapter.java:36)
at com.carrotsearch.randomizedtesting.rules.StatementAdapter.evaluate(StatementAdapter.java:36)
at org.apache.lucene.tests.util.AbstractBeforeAfterRule$1.evaluate(AbstractBeforeAfterRule.java:43)
at com.carrotsearch.randomizedtesting.rules.SystemPropertiesRestoreRule$1.evaluate(SystemPropertiesRestoreRule.java:80)
at org.junit.rules.RunRules.evaluate(RunRules.java:20)
at org.apache.lucene.tests.util.AbstractBeforeAfterRule$1.evaluate(AbstractBeforeAfterRule.java:43)
at com.carrotsearch.randomizedtesting.rules.StatementAdapter.evaluate(StatementAdapter.java:36)
at org.apache.lucene.tests.util.TestRuleStoreClassName$1.evaluate(TestRuleStoreClassName.java:38)
at com.carrotsearch.randomizedtesting.rules.NoShadowingOrOverridesOnMethodsRule$1.evaluate(NoShadowingOrOverridesOnMethodsRule.java:40)
at com.carrotsearch.randomizedtesting.rules.NoShadowingOrOverridesOnMethodsRule$1.evaluate(NoShadowingOrOverridesOnMethodsRule.java:40)
at com.carrotsearch.randomizedtesting.rules.StatementAdapter.evaluate(StatementAdapter.java:36)
at com.carrotsearch.randomizedtesting.rules.StatementAdapter.evaluate(StatementAdapter.java:36)
at org.apache.lucene.tests.util.TestRuleAssertionsRequired$1.evaluate(TestRuleAssertionsRequired.java:53)
at org.apache.lucene.tests.util.AbstractBeforeAfterRule$1.evaluate(AbstractBeforeAfterRule.java:43)
at org.apache.lucene.tests.util.TestRuleMarkFailure$1.evaluate(TestRuleMarkFailure.java:44)
at org.apache.lucene.tests.util.TestRuleIgnoreAfterMaxFailures$1.evaluate(TestRuleIgnoreAfterMaxFailures.java:60)
at org.apache.lucene.tests.util.TestRuleIgnoreTestSuites$1.evaluate(TestRuleIgnoreTestSuites.java:47)
at org.junit.rules.RunRules.evaluate(RunRules.java:20)
at com.carrotsearch.randomizedtesting.rules.StatementAdapter.evaluate(StatementAdapter.java:36)
at com.carrotsearch.randomizedtesting.ThreadLeakControl$StatementRunner.run(ThreadLeakControl.java:390)
at com.carrotsearch.randomizedtesting.ThreadLeakControl.lambda$forkTimeoutingTask$0(ThreadLeakControl.java:850)
at java.base/java.lang.Thread.run(Thread.java:1583)
FAILED: org.apache.solr.handler.admin.api.ClusterPropsAPITest.testClusterPropertyOpsAllGood
Error Message:
java.lang.AssertionError: expected:<0> but was:<1>
Stack Trace:
java.lang.AssertionError: expected:<0> but was:<1>
at __randomizedtesting.SeedInfo.seed([B08CAB6CDDEC9EC8:EB56A2EDC4CEB5EB]:0)
at org.junit.Assert.fail(Assert.java:89)
at org.junit.Assert.failNotEquals(Assert.java:835)
at org.junit.Assert.assertEquals(Assert.java:647)
at org.junit.Assert.assertEquals(Assert.java:633)
at org.apache.solr.handler.admin.api.ClusterPropsAPITest.testClusterPropertyOpsAllGood(ClusterPropsAPITest.java:93)
at java.base/jdk.internal.reflect.DirectMethodHandleAccessor.invoke(DirectMethodHandleAccessor.java:103)
at java.base/java.lang.reflect.Method.invoke(Method.java:580)
at com.carrotsearch.randomizedtesting.RandomizedRunner.invoke(RandomizedRunner.java:1758)
at com.carrotsearch.randomizedtesting.RandomizedRunner$8.evaluate(RandomizedRunner.java:946)
at com.carrotsearch.randomizedtesting.RandomizedRunner$9.evaluate(RandomizedRunner.java:982)
at com.carrotsearch.randomizedtesting.RandomizedRunner$10.evaluate(RandomizedRunner.java:996)
at com.carrotsearch.randomizedtesting.rules.SystemPropertiesRestoreRule$1.evaluate(SystemPropertiesRestoreRule.java:80)
at org.junit.rules.RunRules.evaluate(RunRules.java:20)
at org.apache.lucene.tests.util.TestRuleSetupTeardownChained$1.evaluate(TestRuleSetupTeardownChained.java:48)
at org.apache.lucene.tests.util.AbstractBeforeAfterRule$1.evaluate(AbstractBeforeAfterRule.java:43)
at org.apache.lucene.tests.util.TestRuleThreadAndTestName$1.evaluate(TestRuleThreadAndTestName.java:45)
at org.apache.lucene.tests.util.TestRuleIgnoreAfterMaxFailures$1.evaluate(TestRuleIgnoreAfterMaxFailures.java:60)
at org.apache.lucene.tests.util.TestRuleMarkFailure$1.evaluate(TestRuleMarkFailure.java:44)
at org.junit.rules.RunRules.evaluate(RunRules.java:20)
at com.carrotsearch.randomizedtesting.rules.StatementAdapter.evaluate(StatementAdapter.java:36)
at com.carrotsearch.randomizedtesting.ThreadLeakControl$StatementRunner.run(ThreadLeakControl.java:390)
at com.carrotsearch.randomizedtesting.ThreadLeakControl.forkTimeoutingTask(ThreadLeakControl.java:843)
at com.carrotsearch.randomizedtesting.ThreadLeakControl$3.evaluate(ThreadLeakControl.java:490)
at com.carrotsearch.randomizedtesting.RandomizedRunner.runSingleTest(RandomizedRunner.java:955)
at com.carrotsearch.randomizedtesting.RandomizedRunner$5.evaluate(RandomizedRunner.java:840)
at com.carrotsearch.randomizedtesting.RandomizedRunner$6.evaluate(RandomizedRunner.java:891)
at com.carrotsearch.randomizedtesting.RandomizedRunner$7.evaluate(RandomizedRunner.java:902)
at com.carrotsearch.randomizedtesting.rules.StatementAdapter.evaluate(StatementAdapter.java:36)
at com.carrotsearch.randomizedtesting.rules.StatementAdapter.evaluate(StatementAdapter.java:36)
at org.apache.lucene.tests.util.AbstractBeforeAfterRule$1.evaluate(AbstractBeforeAfterRule.java:43)
at com.carrotsearch.randomizedtesting.rules.SystemPropertiesRestoreRule$1.evaluate(SystemPropertiesRestoreRule.java:80)
at org.junit.rules.RunRules.evaluate(RunRules.java:20)
at org.apache.lucene.tests.util.AbstractBeforeAfterRule$1.evaluate(AbstractBeforeAfterRule.java:43)
at com.carrotsearch.randomizedtesting.rules.StatementAdapter.evaluate(StatementAdapter.java:36)
at org.apache.lucene.tests.util.TestRuleStoreClassName$1.evaluate(TestRuleStoreClassName.java:38)
at com.carrotsearch.randomizedtesting.rules.NoShadowingOrOverridesOnMethodsRule$1.evaluate(NoShadowingOrOverridesOnMethodsRule.java:40)
at com.carrotsearch.randomizedtesting.rules.NoShadowingOrOverridesOnMethodsRule$1.evaluate(NoShadowingOrOverridesOnMethodsRule.java:40)
at com.carrotsearch.randomizedtesting.rules.StatementAdapter.evaluate(StatementAdapter.java:36)
at com.carrotsearch.randomizedtesting.rules.StatementAdapter.evaluate(StatementAdapter.java:36)
at org.apache.lucene.tests.util.TestRuleAssertionsRequired$1.evaluate(TestRuleAssertionsRequired.java:53)
at org.apache.lucene.tests.util.AbstractBeforeAfterRule$1.evaluate(AbstractBeforeAfterRule.java:43)
at org.apache.lucene.tests.util.TestRuleMarkFailure$1.evaluate(TestRuleMarkFailure.java:44)
at org.apache.lucene.tests.util.TestRuleIgnoreAfterMaxFailures$1.evaluate(TestRuleIgnoreAfterMaxFailures.java:60)
at org.apache.lucene.tests.util.TestRuleIgnoreTestSuites$1.evaluate(TestRuleIgnoreTestSuites.java:47)
at org.junit.rules.RunRules.evaluate(RunRules.java:20)
at com.carrotsearch.randomizedtesting.rules.StatementAdapter.evaluate(StatementAdapter.java:36)
at com.carrotsearch.randomizedtesting.ThreadLeakControl$StatementRunner.run(ThreadLeakControl.java:390)
at com.carrotsearch.randomizedtesting.ThreadLeakControl.lambda$forkTimeoutingTask$0(ThreadLeakControl.java:850)
at java.base/java.lang.Thread.run(Thread.java:1583)
FAILED: org.apache.solr.search.TestFiltering.testRandomFiltering
Error Message:
java.lang.AssertionError: FAILURE: indexSize=57 iiter=9 qiter=58 request=[q, {!cache=false tag=t} val_i:2 val_i:4 val_i:6 val_i:7 val_i:8 val_i:9 val_i:10 val_i:11 val_i:13 val_i:15 val_i:17 val_i:19 val_i:20 val_i:22 val_i:23 val_i:24 val_i:25 val_i:29 val_i:30 val_i:32 val_i:33 val_i:34 val_i:35 val_i:36 val_i:37 val_i:39 val_i:40 val_i:41 val_i:42 val_i:43 val_i:46 val_i:49 val_i:53 val_i:54, fq, -_query_:"val_s:[00022 TO 00056]", fq, {!}id:RAND-662892246 OR val_s:[00037 TO 00065}, fq, {!cache=false tag=t} -val_i:0 -val_i:2 -val_i:3 -val_i:4 -val_i:6 -val_i:7 -val_i:8 -val_i:9 -val_i:10 -val_i:11 -val_i:16 -val_i:17 -val_i:18 -val_i:24 -val_i:25 -val_i:26 -val_i:31 -val_i:33 -val_i:39 -val_i:42 -val_i:44 -val_i:46 -val_i:48 -val_i:49 -val_i:53 -val_i:55 -val_i:56, facet, true, facet.query, *:*, facet.query, {!key=multiSelect ex=t}*:*, facet.query, {!key=facetQuery frange v=val_i l=47 u=56 cache=false cost=102}]
Stack Trace:
java.lang.AssertionError: FAILURE: indexSize=57 iiter=9 qiter=58 request=[q, {!cache=false tag=t} val_i:2 val_i:4 val_i:6 val_i:7 val_i:8 val_i:9 val_i:10 val_i:11 val_i:13 val_i:15 val_i:17 val_i:19 val_i:20 val_i:22 val_i:23 val_i:24 val_i:25 val_i:29 val_i:30 val_i:32 val_i:33 val_i:34 val_i:35 val_i:36 val_i:37 val_i:39 val_i:40 val_i:41 val_i:42 val_i:43 val_i:46 val_i:49 val_i:53 val_i:54, fq, -_query_:"val_s:[00022 TO 00056]", fq, {!}id:RAND-662892246 OR val_s:[00037 TO 00065}, fq, {!cache=false tag=t} -val_i:0 -val_i:2 -val_i:3 -val_i:4 -val_i:6 -val_i:7 -val_i:8 -val_i:9 -val_i:10 -val_i:11 -val_i:16 -val_i:17 -val_i:18 -val_i:24 -val_i:25 -val_i:26 -val_i:31 -val_i:33 -val_i:39 -val_i:42 -val_i:44 -val_i:46 -val_i:48 -val_i:49 -val_i:53 -val_i:55 -val_i:56, facet, true, facet.query, *:*, facet.query, {!key=multiSelect ex=t}*:*, facet.query, {!key=facetQuery frange v=val_i l=47 u=56 cache=false cost=102}]
at __randomizedtesting.SeedInfo.seed([B08CAB6CDDEC9EC8:AFEF08A938CBDEC1]:0)
at org.junit.Assert.fail(Assert.java:89)
at org.apache.solr.search.TestFiltering.testRandomFiltering(TestFiltering.java:574)
at java.base/jdk.internal.reflect.DirectMethodHandleAccessor.invoke(DirectMethodHandleAccessor.java:103)
at java.base/java.lang.reflect.Method.invoke(Method.java:580)
at com.carrotsearch.randomizedtesting.RandomizedRunner.invoke(RandomizedRunner.java:1758)
at com.carrotsearch.randomizedtesting.RandomizedRunner$8.evaluate(RandomizedRunner.java:946)
at com.carrotsearch.randomizedtesting.RandomizedRunner$9.evaluate(RandomizedRunner.java:982)
at com.carrotsearch.randomizedtesting.RandomizedRunner$10.evaluate(RandomizedRunner.java:996)
at com.carrotsearch.randomizedtesting.rules.SystemPropertiesRestoreRule$1.evaluate(SystemPropertiesRestoreRule.java:80)
at org.junit.rules.RunRules.evaluate(RunRules.java:20)
at org.apache.lucene.tests.util.TestRuleSetupTeardownChained$1.evaluate(TestRuleSetupTeardownChained.java:48)
at org.apache.lucene.tests.util.AbstractBeforeAfterRule$1.evaluate(AbstractBeforeAfterRule.java:43)
at org.apache.lucene.tests.util.TestRuleThreadAndTestName$1.evaluate(TestRuleThreadAndTestName.java:45)
at org.apache.lucene.tests.util.TestRuleIgnoreAfterMaxFailures$1.evaluate(TestRuleIgnoreAfterMaxFailures.java:60)
at org.apache.lucene.tests.util.TestRuleMarkFailure$1.evaluate(TestRuleMarkFailure.java:44)
at org.junit.rules.RunRules.evaluate(RunRules.java:20)
at com.carrotsearch.randomizedtesting.rules.StatementAdapter.evaluate(StatementAdapter.java:36)
at com.carrotsearch.randomizedtesting.ThreadLeakControl$StatementRunner.run(ThreadLeakControl.java:390)
at com.carrotsearch.randomizedtesting.ThreadLeakControl.forkTimeoutingTask(ThreadLeakControl.java:843)
at com.carrotsearch.randomizedtesting.ThreadLeakControl$3.evaluate(ThreadLeakControl.java:490)
at com.carrotsearch.randomizedtesting.RandomizedRunner.runSingleTest(RandomizedRunner.java:955)
at com.carrotsearch.randomizedtesting.RandomizedRunner$5.evaluate(RandomizedRunner.java:840)
at com.carrotsearch.randomizedtesting.RandomizedRunner$6.evaluate(RandomizedRunner.java:891)
at com.carrotsearch.randomizedtesting.RandomizedRunner$7.evaluate(RandomizedRunner.java:902)
at com.carrotsearch.randomizedtesting.rules.StatementAdapter.evaluate(StatementAdapter.java:36)
at com.carrotsearch.randomizedtesting.rules.StatementAdapter.evaluate(StatementAdapter.java:36)
at org.apache.lucene.tests.util.AbstractBeforeAfterRule$1.evaluate(AbstractBeforeAfterRule.java:43)
at com.carrotsearch.randomizedtesting.rules.SystemPropertiesRestoreRule$1.evaluate(SystemPropertiesRestoreRule.java:80)
at org.junit.rules.RunRules.evaluate(RunRules.java:20)
at org.apache.lucene.tests.util.AbstractBeforeAfterRule$1.evaluate(AbstractBeforeAfterRule.java:43)
at com.carrotsearch.randomizedtesting.rules.StatementAdapter.evaluate(StatementAdapter.java:36)
at org.apache.lucene.tests.util.TestRuleStoreClassName$1.evaluate(TestRuleStoreClassName.java:38)
at com.carrotsearch.randomizedtesting.rules.NoShadowingOrOverridesOnMethodsRule$1.evaluate(NoShadowingOrOverridesOnMethodsRule.java:40)
at com.carrotsearch.randomizedtesting.rules.NoShadowingOrOverridesOnMethodsRule$1.evaluate(NoShadowingOrOverridesOnMethodsRule.java:40)
at com.carrotsearch.randomizedtesting.rules.StatementAdapter.evaluate(StatementAdapter.java:36)
at com.carrotsearch.randomizedtesting.rules.StatementAdapter.evaluate(StatementAdapter.java:36)
at org.apache.lucene.tests.util.TestRuleAssertionsRequired$1.evaluate(TestRuleAssertionsRequired.java:53)
at org.apache.lucene.tests.util.AbstractBeforeAfterRule$1.evaluate(AbstractBeforeAfterRule.java:43)
at org.apache.lucene.tests.util.TestRuleMarkFailure$1.evaluate(TestRuleMarkFailure.java:44)
at org.apache.lucene.tests.util.TestRuleIgnoreAfterMaxFailures$1.evaluate(TestRuleIgnoreAfterMaxFailures.java:60)
at org.apache.lucene.tests.util.TestRuleIgnoreTestSuites$1.evaluate(TestRuleIgnoreTestSuites.java:47)
at org.junit.rules.RunRules.evaluate(RunRules.java:20)
at com.carrotsearch.randomizedtesting.rules.StatementAdapter.evaluate(StatementAdapter.java:36)
at com.carrotsearch.randomizedtesting.ThreadLeakControl$StatementRunner.run(ThreadLeakControl.java:390)
at com.carrotsearch.randomizedtesting.ThreadLeakControl.lambda$forkTimeoutingTask$0(ThreadLeakControl.java:850)
at java.base/java.lang.Thread.run(Thread.java:1583)
FAILED: org.apache.solr.hdfs.cloud.MoveReplicaHdfsFailoverTest.testDataDirAndUlogAreMaintained
Error Message:
java.lang.AssertionError: expected:<1> but was:<0>
Stack Trace:
java.lang.AssertionError: expected:<1> but was:<0>
at __randomizedtesting.SeedInfo.seed([B08CAB6CDDEC9EC8:9FBF3EBF619C2CEA]:0)
at org.junit.Assert.fail(Assert.java:89)
at org.junit.Assert.failNotEquals(Assert.java:835)
at org.junit.Assert.assertEquals(Assert.java:647)
at org.junit.Assert.assertEquals(Assert.java:633)
at org.apache.solr.hdfs.cloud.MoveReplicaHdfsFailoverTest.testDataDirAndUlogAreMaintained(MoveReplicaHdfsFailoverTest.java:113)
at java.base/jdk.internal.reflect.DirectMethodHandleAccessor.invoke(DirectMethodHandleAccessor.java:103)
at java.base/java.lang.reflect.Method.invoke(Method.java:580)
at com.carrotsearch.randomizedtesting.RandomizedRunner.invoke(RandomizedRunner.java:1758)
at com.carrotsearch.randomizedtesting.RandomizedRunner$8.evaluate(RandomizedRunner.java:946)
at com.carrotsearch.randomizedtesting.RandomizedRunner$9.evaluate(RandomizedRunner.java:982)
at com.carrotsearch.randomizedtesting.RandomizedRunner$10.evaluate(RandomizedRunner.java:996)
at com.carrotsearch.randomizedtesting.rules.SystemPropertiesRestoreRule$1.evaluate(SystemPropertiesRestoreRule.java:80)
at org.junit.rules.RunRules.evaluate(RunRules.java:20)
at org.apache.lucene.tests.util.TestRuleSetupTeardownChained$1.evaluate(TestRuleSetupTeardownChained.java:48)
at org.apache.lucene.tests.util.AbstractBeforeAfterRule$1.evaluate(AbstractBeforeAfterRule.java:43)
at org.apache.lucene.tests.util.TestRuleThreadAndTestName$1.evaluate(TestRuleThreadAndTestName.java:45)
at org.apache.lucene.tests.util.TestRuleIgnoreAfterMaxFailures$1.evaluate(TestRuleIgnoreAfterMaxFailures.java:60)
at org.apache.lucene.tests.util.TestRuleMarkFailure$1.evaluate(TestRuleMarkFailure.java:44)
at org.junit.rules.RunRules.evaluate(RunRules.java:20)
at com.carrotsearch.randomizedtesting.rules.StatementAdapter.evaluate(StatementAdapter.java:36)
at com.carrotsearch.randomizedtesting.ThreadLeakControl$StatementRunner.run(ThreadLeakControl.java:390)
at com.carrotsearch.randomizedtesting.ThreadLeakControl.forkTimeoutingTask(ThreadLeakControl.java:843)
at com.carrotsearch.randomizedtesting.ThreadLeakControl$3.evaluate(ThreadLeakControl.java:490)
at com.carrotsearch.randomizedtesting.RandomizedRunner.runSingleTest(RandomizedRunner.java:955)
at com.carrotsearch.randomizedtesting.RandomizedRunner$5.evaluate(RandomizedRunner.java:840)
at com.carrotsearch.randomizedtesting.RandomizedRunner$6.evaluate(RandomizedRunner.java:891)
at com.carrotsearch.randomizedtesting.RandomizedRunner$7.evaluate(RandomizedRunner.java:902)
at com.carrotsearch.randomizedtesting.rules.StatementAdapter.evaluate(StatementAdapter.java:36)
at com.carrotsearch.randomizedtesting.rules.StatementAdapter.evaluate(StatementAdapter.java:36)
at org.apache.lucene.tests.util.AbstractBeforeAfterRule$1.evaluate(AbstractBeforeAfterRule.java:43)
at com.carrotsearch.randomizedtesting.rules.SystemPropertiesRestoreRule$1.evaluate(SystemPropertiesRestoreRule.java:80)
at org.junit.rules.RunRules.evaluate(RunRules.java:20)
at org.apache.lucene.tests.util.AbstractBeforeAfterRule$1.evaluate(AbstractBeforeAfterRule.java:43)
at com.carrotsearch.randomizedtesting.rules.StatementAdapter.evaluate(StatementAdapter.java:36)
at org.apache.lucene.tests.util.TestRuleStoreClassName$1.evaluate(TestRuleStoreClassName.java:38)
at com.carrotsearch.randomizedtesting.rules.NoShadowingOrOverridesOnMethodsRule$1.evaluate(NoShadowingOrOverridesOnMethodsRule.java:40)
at com.carrotsearch.randomizedtesting.rules.NoShadowingOrOverridesOnMethodsRule$1.evaluate(NoShadowingOrOverridesOnMethodsRule.java:40)
at com.carrotsearch.randomizedtesting.rules.StatementAdapter.evaluate(StatementAdapter.java:36)
at com.carrotsearch.randomizedtesting.rules.StatementAdapter.evaluate(StatementAdapter.java:36)
at org.apache.lucene.tests.util.TestRuleAssertionsRequired$1.evaluate(TestRuleAssertionsRequired.java:53)
at org.apache.lucene.tests.util.AbstractBeforeAfterRule$1.evaluate(AbstractBeforeAfterRule.java:43)
at org.apache.lucene.tests.util.TestRuleMarkFailure$1.evaluate(TestRuleMarkFailure.java:44)
at org.apache.lucene.tests.util.TestRuleIgnoreAfterMaxFailures$1.evaluate(TestRuleIgnoreAfterMaxFailures.java:60)
at org.apache.lucene.tests.util.TestRuleIgnoreTestSuites$1.evaluate(TestRuleIgnoreTestSuites.java:47)
at org.junit.rules.RunRules.evaluate(RunRules.java:20)
at com.carrotsearch.randomizedtesting.rules.StatementAdapter.evaluate(StatementAdapter.java:36)
at com.carrotsearch.randomizedtesting.ThreadLeakControl$StatementRunner.run(ThreadLeakControl.java:390)
at com.carrotsearch.randomizedtesting.ThreadLeakControl.lambda$forkTimeoutingTask$0(ThreadLeakControl.java:850)
at java.base/java.lang.Thread.run(Thread.java:1583)
FAILED: org.apache.solr.hdfs.cloud.MoveReplicaHdfsFailoverTest.testDataDirAndUlogAreMaintained
Error Message:
java.lang.AssertionError: expected:<1> but was:<0>
Stack Trace:
java.lang.AssertionError: expected:<1> but was:<0>
at __randomizedtesting.SeedInfo.seed([B08CAB6CDDEC9EC8:9FBF3EBF619C2CEA]:0)
at org.junit.Assert.fail(Assert.java:89)
at org.junit.Assert.failNotEquals(Assert.java:835)
at org.junit.Assert.assertEquals(Assert.java:647)
at org.junit.Assert.assertEquals(Assert.java:633)
at org.apache.solr.hdfs.cloud.MoveReplicaHdfsFailoverTest.testDataDirAndUlogAreMaintained(MoveReplicaHdfsFailoverTest.java:113)
at java.base/jdk.internal.reflect.DirectMethodHandleAccessor.invoke(DirectMethodHandleAccessor.java:103)
at java.base/java.lang.reflect.Method.invoke(Method.java:580)
at com.carrotsearch.randomizedtesting.RandomizedRunner.invoke(RandomizedRunner.java:1758)
at com.carrotsearch.randomizedtesting.RandomizedRunner$8.evaluate(RandomizedRunner.java:946)
at com.carrotsearch.randomizedtesting.RandomizedRunner$9.evaluate(RandomizedRunner.java:982)
at com.carrotsearch.randomizedtesting.RandomizedRunner$10.evaluate(RandomizedRunner.java:996)
at com.carrotsearch.randomizedtesting.rules.SystemPropertiesRestoreRule$1.evaluate(SystemPropertiesRestoreRule.java:80)
at org.junit.rules.RunRules.evaluate(RunRules.java:20)
at org.apache.lucene.tests.util.TestRuleSetupTeardownChained$1.evaluate(TestRuleSetupTeardownChained.java:48)
at org.apache.lucene.tests.util.AbstractBeforeAfterRule$1.evaluate(AbstractBeforeAfterRule.java:43)
at org.apache.lucene.tests.util.TestRuleThreadAndTestName$1.evaluate(TestRuleThreadAndTestName.java:45)
at org.apache.lucene.tests.util.TestRuleIgnoreAfterMaxFailures$1.evaluate(TestRuleIgnoreAfterMaxFailures.java:60)
at org.apache.lucene.tests.util.TestRuleMarkFailure$1.evaluate(TestRuleMarkFailure.java:44)
at org.junit.rules.RunRules.evaluate(RunRules.java:20)
at com.carrotsearch.randomizedtesting.rules.StatementAdapter.evaluate(StatementAdapter.java:36)
at com.carrotsearch.randomizedtesting.ThreadLeakControl$StatementRunner.run(ThreadLeakControl.java:390)
at com.carrotsearch.randomizedtesting.ThreadLeakControl.forkTimeoutingTask(ThreadLeakControl.java:843)
at com.carrotsearch.randomizedtesting.ThreadLeakControl$3.evaluate(ThreadLeakControl.java:490)
at com.carrotsearch.randomizedtesting.RandomizedRunner.runSingleTest(RandomizedRunner.java:955)
at com.carrotsearch.randomizedtesting.RandomizedRunner$5.evaluate(RandomizedRunner.java:840)
at com.carrotsearch.randomizedtesting.RandomizedRunner$6.evaluate(RandomizedRunner.java:891)
at com.carrotsearch.randomizedtesting.RandomizedRunner$7.evaluate(RandomizedRunner.java:902)
at com.carrotsearch.randomizedtesting.rules.StatementAdapter.evaluate(StatementAdapter.java:36)
at com.carrotsearch.randomizedtesting.rules.StatementAdapter.evaluate(StatementAdapter.java:36)
at org.apache.lucene.tests.util.AbstractBeforeAfterRule$1.evaluate(AbstractBeforeAfterRule.java:43)
at com.carrotsearch.randomizedtesting.rules.SystemPropertiesRestoreRule$1.evaluate(SystemPropertiesRestoreRule.java:80)
at org.junit.rules.RunRules.evaluate(RunRules.java:20)
at org.apache.lucene.tests.util.AbstractBeforeAfterRule$1.evaluate(AbstractBeforeAfterRule.java:43)
at com.carrotsearch.randomizedtesting.rules.StatementAdapter.evaluate(StatementAdapter.java:36)
at org.apache.lucene.tests.util.TestRuleStoreClassName$1.evaluate(TestRuleStoreClassName.java:38)
at com.carrotsearch.randomizedtesting.rules.NoShadowingOrOverridesOnMethodsRule$1.evaluate(NoShadowingOrOverridesOnMethodsRule.java:40)
at com.carrotsearch.randomizedtesting.rules.NoShadowingOrOverridesOnMethodsRule$1.evaluate(NoShadowingOrOverridesOnMethodsRule.java:40)
at com.carrotsearch.randomizedtesting.rules.StatementAdapter.evaluate(StatementAdapter.java:36)
at com.carrotsearch.randomizedtesting.rules.StatementAdapter.evaluate(StatementAdapter.java:36)
at org.apache.lucene.tests.util.TestRuleAssertionsRequired$1.evaluate(TestRuleAssertionsRequired.java:53)
at org.apache.lucene.tests.util.AbstractBeforeAfterRule$1.evaluate(AbstractBeforeAfterRule.java:43)
at org.apache.lucene.tests.util.TestRuleMarkFailure$1.evaluate(TestRuleMarkFailure.java:44)
at org.apache.lucene.tests.util.TestRuleIgnoreAfterMaxFailures$1.evaluate(TestRuleIgnoreAfterMaxFailures.java:60)
at org.apache.lucene.tests.util.TestRuleIgnoreTestSuites$1.evaluate(TestRuleIgnoreTestSuites.java:47)
at org.junit.rules.RunRules.evaluate(RunRules.java:20)
at com.carrotsearch.randomizedtesting.rules.StatementAdapter.evaluate(StatementAdapter.java:36)
at com.carrotsearch.randomizedtesting.ThreadLeakControl$StatementRunner.run(ThreadLeakControl.java:390)
at com.carrotsearch.randomizedtesting.ThreadLeakControl.lambda$forkTimeoutingTask$0(ThreadLeakControl.java:850)
at java.base/java.lang.Thread.run(Thread.java:1583)
FAILED: org.apache.solr.hdfs.cloud.MoveReplicaHdfsFailoverTest.testDataDirAndUlogAreMaintained
Error Message:
java.lang.AssertionError: expected:<1> but was:<0>
Stack Trace:
java.lang.AssertionError: expected:<1> but was:<0>
at __randomizedtesting.SeedInfo.seed([B08CAB6CDDEC9EC8:9FBF3EBF619C2CEA]:0)
at org.junit.Assert.fail(Assert.java:89)
at org.junit.Assert.failNotEquals(Assert.java:835)
at org.junit.Assert.assertEquals(Assert.java:647)
at org.junit.Assert.assertEquals(Assert.java:633)
at org.apache.solr.hdfs.cloud.MoveReplicaHdfsFailoverTest.testDataDirAndUlogAreMaintained(MoveReplicaHdfsFailoverTest.java:113)
at java.base/jdk.internal.reflect.DirectMethodHandleAccessor.invoke(DirectMethodHandleAccessor.java:103)
at java.base/java.lang.reflect.Method.invoke(Method.java:580)
at com.carrotsearch.randomizedtesting.RandomizedRunner.invoke(RandomizedRunner.java:1758)
at com.carrotsearch.randomizedtesting.RandomizedRunner$8.evaluate(RandomizedRunner.java:946)
at com.carrotsearch.randomizedtesting.RandomizedRunner$9.evaluate(RandomizedRunner.java:982)
at com.carrotsearch.randomizedtesting.RandomizedRunner$10.evaluate(RandomizedRunner.java:996)
at com.carrotsearch.randomizedtesting.rules.SystemPropertiesRestoreRule$1.evaluate(SystemPropertiesRestoreRule.java:80)
at org.junit.rules.RunRules.evaluate(RunRules.java:20)
at org.apache.lucene.tests.util.TestRuleSetupTeardownChained$1.evaluate(TestRuleSetupTeardownChained.java:48)
at org.apache.lucene.tests.util.AbstractBeforeAfterRule$1.evaluate(AbstractBeforeAfterRule.java:43)
at org.apache.lucene.tests.util.TestRuleThreadAndTestName$1.evaluate(TestRuleThreadAndTestName.java:45)
at org.apache.lucene.tests.util.TestRuleIgnoreAfterMaxFailures$1.evaluate(TestRuleIgnoreAfterMaxFailures.java:60)
at org.apache.lucene.tests.util.TestRuleMarkFailure$1.evaluate(TestRuleMarkFailure.java:44)
at org.junit.rules.RunRules.evaluate(RunRules.java:20)
at com.carrotsearch.randomizedtesting.rules.StatementAdapter.evaluate(StatementAdapter.java:36)
at com.carrotsearch.randomizedtesting.ThreadLeakControl$StatementRunner.run(ThreadLeakControl.java:390)
at com.carrotsearch.randomizedtesting.ThreadLeakControl.forkTimeoutingTask(ThreadLeakControl.java:843)
at com.carrotsearch.randomizedtesting.ThreadLeakControl$3.evaluate(ThreadLeakControl.java:490)
at com.carrotsearch.randomizedtesting.RandomizedRunner.runSingleTest(RandomizedRunner.java:955)
at com.carrotsearch.randomizedtesting.RandomizedRunner$5.evaluate(RandomizedRunner.java:840)
at com.carrotsearch.randomizedtesting.RandomizedRunner$6.evaluate(RandomizedRunner.java:891)
at com.carrotsearch.randomizedtesting.RandomizedRunner$7.evaluate(RandomizedRunner.java:902)
at com.carrotsearch.randomizedtesting.rules.StatementAdapter.evaluate(StatementAdapter.java:36)
at com.carrotsearch.randomizedtesting.rules.StatementAdapter.evaluate(StatementAdapter.java:36)
at org.apache.lucene.tests.util.AbstractBeforeAfterRule$1.evaluate(AbstractBeforeAfterRule.java:43)
at com.carrotsearch.randomizedtesting.rules.SystemPropertiesRestoreRule$1.evaluate(SystemPropertiesRestoreRule.java:80)
at org.junit.rules.RunRules.evaluate(RunRules.java:20)
at org.apache.lucene.tests.util.AbstractBeforeAfterRule$1.evaluate(AbstractBeforeAfterRule.java:43)
at com.carrotsearch.randomizedtesting.rules.StatementAdapter.evaluate(StatementAdapter.java:36)
at org.apache.lucene.tests.util.TestRuleStoreClassName$1.evaluate(TestRuleStoreClassName.java:38)
at com.carrotsearch.randomizedtesting.rules.NoShadowingOrOverridesOnMethodsRule$1.evaluate(NoShadowingOrOverridesOnMethodsRule.java:40)
at com.carrotsearch.randomizedtesting.rules.NoShadowingOrOverridesOnMethodsRule$1.evaluate(NoShadowingOrOverridesOnMethodsRule.java:40)
at com.carrotsearch.randomizedtesting.rules.StatementAdapter.evaluate(StatementAdapter.java:36)
at com.carrotsearch.randomizedtesting.rules.StatementAdapter.evaluate(StatementAdapter.java:36)
at org.apache.lucene.tests.util.TestRuleAssertionsRequired$1.evaluate(TestRuleAssertionsRequired.java:53)
at org.apache.lucene.tests.util.AbstractBeforeAfterRule$1.evaluate(AbstractBeforeAfterRule.java:43)
at org.apache.lucene.tests.util.TestRuleMarkFailure$1.evaluate(TestRuleMarkFailure.java:44)
at org.apache.lucene.tests.util.TestRuleIgnoreAfterMaxFailures$1.evaluate(TestRuleIgnoreAfterMaxFailures.java:60)
at org.apache.lucene.tests.util.TestRuleIgnoreTestSuites$1.evaluate(TestRuleIgnoreTestSuites.java:47)
at org.junit.rules.RunRules.evaluate(RunRules.java:20)
at com.carrotsearch.randomizedtesting.rules.StatementAdapter.evaluate(StatementAdapter.java:36)
at com.carrotsearch.randomizedtesting.ThreadLeakControl$StatementRunner.run(ThreadLeakControl.java:390)
at com.carrotsearch.randomizedtesting.ThreadLeakControl.lambda$forkTimeoutingTask$0(ThreadLeakControl.java:850)
at java.base/java.lang.Thread.run(Thread.java:1583)
FAILED: org.apache.solr.hdfs.cloud.MoveReplicaHdfsFailoverTest.testDataDirAndUlogAreMaintained
Error Message:
java.lang.AssertionError: expected:<1> but was:<0>
Stack Trace:
java.lang.AssertionError: expected:<1> but was:<0>
at __randomizedtesting.SeedInfo.seed([B08CAB6CDDEC9EC8:9FBF3EBF619C2CEA]:0)
at org.junit.Assert.fail(Assert.java:89)
at org.junit.Assert.failNotEquals(Assert.java:835)
at org.junit.Assert.assertEquals(Assert.java:647)
at org.junit.Assert.assertEquals(Assert.java:633)
at org.apache.solr.hdfs.cloud.MoveReplicaHdfsFailoverTest.testDataDirAndUlogAreMaintained(MoveReplicaHdfsFailoverTest.java:113)
at java.base/jdk.internal.reflect.DirectMethodHandleAccessor.invoke(DirectMethodHandleAccessor.java:103)
at java.base/java.lang.reflect.Method.invoke(Method.java:580)
at com.carrotsearch.randomizedtesting.RandomizedRunner.invoke(RandomizedRunner.java:1758)
at com.carrotsearch.randomizedtesting.RandomizedRunner$8.evaluate(RandomizedRunner.java:946)
at com.carrotsearch.randomizedtesting.RandomizedRunner$9.evaluate(RandomizedRunner.java:982)
at com.carrotsearch.randomizedtesting.RandomizedRunner$10.evaluate(RandomizedRunner.java:996)
at com.carrotsearch.randomizedtesting.rules.SystemPropertiesRestoreRule$1.evaluate(SystemPropertiesRestoreRule.java:80)
at org.junit.rules.RunRules.evaluate(RunRules.java:20)
at org.apache.lucene.tests.util.TestRuleSetupTeardownChained$1.evaluate(TestRuleSetupTeardownChained.java:48)
at org.apache.lucene.tests.util.AbstractBeforeAfterRule$1.evaluate(AbstractBeforeAfterRule.java:43)
at org.apache.lucene.tests.util.TestRuleThreadAndTestName$1.evaluate(TestRuleThreadAndTestName.java:45)
at org.apache.lucene.tests.util.TestRuleIgnoreAfterMaxFailures$1.evaluate(TestRuleIgnoreAfterMaxFailures.java:60)
at org.apache.lucene.tests.util.TestRuleMarkFailure$1.evaluate(TestRuleMarkFailure.java:44)
at org.junit.rules.RunRules.evaluate(RunRules.java:20)
at com.carrotsearch.randomizedtesting.rules.StatementAdapter.evaluate(StatementAdapter.java:36)
at com.carrotsearch.randomizedtesting.ThreadLeakControl$StatementRunner.run(ThreadLeakControl.java:390)
at com.carrotsearch.randomizedtesting.ThreadLeakControl.forkTimeoutingTask(ThreadLeakControl.java:843)
at com.carrotsearch.randomizedtesting.ThreadLeakControl$3.evaluate(ThreadLeakControl.java:490)
at com.carrotsearch.randomizedtesting.RandomizedRunner.runSingleTest(RandomizedRunner.java:955)
at com.carrotsearch.randomizedtesting.RandomizedRunner$5.evaluate(RandomizedRunner.java:840)
at com.carrotsearch.randomizedtesting.RandomizedRunner$6.evaluate(RandomizedRunner.java:891)
at com.carrotsearch.randomizedtesting.RandomizedRunner$7.evaluate(RandomizedRunner.java:902)
at com.carrotsearch.randomizedtesting.rules.StatementAdapter.evaluate(StatementAdapter.java:36)
at com.carrotsearch.randomizedtesting.rules.StatementAdapter.evaluate(StatementAdapter.java:36)
at org.apache.lucene.tests.util.AbstractBeforeAfterRule$1.evaluate(AbstractBeforeAfterRule.java:43)
at com.carrotsearch.randomizedtesting.rules.SystemPropertiesRestoreRule$1.evaluate(SystemPropertiesRestoreRule.java:80)
at org.junit.rules.RunRules.evaluate(RunRules.java:20)
at org.apache.lucene.tests.util.AbstractBeforeAfterRule$1.evaluate(AbstractBeforeAfterRule.java:43)
at com.carrotsearch.randomizedtesting.rules.StatementAdapter.evaluate(StatementAdapter.java:36)
at org.apache.lucene.tests.util.TestRuleStoreClassName$1.evaluate(TestRuleStoreClassName.java:38)
at com.carrotsearch.randomizedtesting.rules.NoShadowingOrOverridesOnMethodsRule$1.evaluate(NoShadowingOrOverridesOnMethodsRule.java:40)
at com.carrotsearch.randomizedtesting.rules.NoShadowingOrOverridesOnMethodsRule$1.evaluate(NoShadowingOrOverridesOnMethodsRule.java:40)
at com.carrotsearch.randomizedtesting.rules.StatementAdapter.evaluate(StatementAdapter.java:36)
at com.carrotsearch.randomizedtesting.rules.StatementAdapter.evaluate(StatementAdapter.java:36)
at org.apache.lucene.tests.util.TestRuleAssertionsRequired$1.evaluate(TestRuleAssertionsRequired.java:53)
at org.apache.lucene.tests.util.AbstractBeforeAfterRule$1.evaluate(AbstractBeforeAfterRule.java:43)
at org.apache.lucene.tests.util.TestRuleMarkFailure$1.evaluate(TestRuleMarkFailure.java:44)
at org.apache.lucene.tests.util.TestRuleIgnoreAfterMaxFailures$1.evaluate(TestRuleIgnoreAfterMaxFailures.java:60)
at org.apache.lucene.tests.util.TestRuleIgnoreTestSuites$1.evaluate(TestRuleIgnoreTestSuites.java:47)
at org.junit.rules.RunRules.evaluate(RunRules.java:20)
at com.carrotsearch.randomizedtesting.rules.StatementAdapter.evaluate(StatementAdapter.java:36)
at com.carrotsearch.randomizedtesting.ThreadLeakControl$StatementRunner.run(ThreadLeakControl.java:390)
at com.carrotsearch.randomizedtesting.ThreadLeakControl.lambda$forkTimeoutingTask$0(ThreadLeakControl.java:850)
at java.base/java.lang.Thread.run(Thread.java:1583)
Build Log:
[...truncated 13555 lines...]
ERROR: The following test(s) have failed:
- org.apache.solr.hdfs.cloud.MoveReplicaHdfsFailoverTest.testDataDirAndUlogAreMaintained (:solr:modules:hdfs)
Test history: https://ge.apache.org/scans/tests?search.rootProjectNames=solr-root&tests.container=org.apache.solr.hdfs.cloud.MoveReplicaHdfsFailoverTest&tests.test=testDataDirAndUlogAreMaintained http://fucit.org/solr-jenkins-reports/history-trend-of-recent-failures.html#series/org.apache.solr.hdfs.cloud.MoveReplicaHdfsFailoverTest.testDataDirAndUlogAreMaintained
Test output: /home/jenkins/jenkins-slave/workspace/Solr/Solr-NightlyTests-main/solr/modules/hdfs/build/test-results/test/outputs/OUTPUT-org.apache.solr.hdfs.cloud.MoveReplicaHdfsFailoverTest.txt
Reproduce with: ./gradlew :solr:modules:hdfs:test --tests "org.apache.solr.hdfs.cloud.MoveReplicaHdfsFailoverTest.testDataDirAndUlogAreMaintained" -Ptests.jvms=4 -Ptests.haltonfailure=false "-Ptests.jvmargs=-XX:TieredStopAtLevel=1 -XX:+UseParallelGC -XX:ActiveProcessorCount=1 -XX:ReservedCodeCacheSize=120m" -Ptests.seed=B08CAB6CDDEC9EC8 -Ptests.multiplier=2 -Ptests.nightly=true -Ptests.badapples=false -Ptests.file.encoding=UTF-8 -Ptests.linedocsfile=/home/jenkins/jenkins-slave/workspace/Solr/Solr-NightlyTests-main/test-data/enwiki.random.lines.txt
- org.apache.solr.handler.admin.api.ClusterPropsAPITest.testClusterPropertyOpsAllGood (:solr:core)
Test history: https://ge.apache.org/scans/tests?search.rootProjectNames=solr-root&tests.container=org.apache.solr.handler.admin.api.ClusterPropsAPITest&tests.test=testClusterPropertyOpsAllGood http://fucit.org/solr-jenkins-reports/history-trend-of-recent-failures.html#series/org.apache.solr.handler.admin.api.ClusterPropsAPITest.testClusterPropertyOpsAllGood
Test output: /home/jenkins/jenkins-slave/workspace/Solr/Solr-NightlyTests-main/solr/core/build/test-results/test/outputs/OUTPUT-org.apache.solr.handler.admin.api.ClusterPropsAPITest.txt
Reproduce with: ./gradlew :solr:core:test --tests "org.apache.solr.handler.admin.api.ClusterPropsAPITest.testClusterPropertyOpsAllGood" -Ptests.jvms=4 -Ptests.haltonfailure=false "-Ptests.jvmargs=-XX:TieredStopAtLevel=1 -XX:+UseParallelGC -XX:ActiveProcessorCount=1 -XX:ReservedCodeCacheSize=120m" -Ptests.seed=B08CAB6CDDEC9EC8 -Ptests.multiplier=2 -Ptests.nightly=true -Ptests.badapples=false -Ptests.file.encoding=UTF-8 -Ptests.linedocsfile=/home/jenkins/jenkins-slave/workspace/Solr/Solr-NightlyTests-main/test-data/enwiki.random.lines.txt
- org.apache.solr.cloud.UnloadDistributedZkTest.test (:solr:core)
Test history: https://ge.apache.org/scans/tests?search.rootProjectNames=solr-root&tests.container=org.apache.solr.cloud.UnloadDistributedZkTest&tests.test=test http://fucit.org/solr-jenkins-reports/history-trend-of-recent-failures.html#series/org.apache.solr.cloud.UnloadDistributedZkTest.test
Test output: /home/jenkins/jenkins-slave/workspace/Solr/Solr-NightlyTests-main/solr/core/build/test-results/test/outputs/OUTPUT-org.apache.solr.cloud.UnloadDistributedZkTest.txt
Reproduce with: ./gradlew :solr:core:test --tests "org.apache.solr.cloud.UnloadDistributedZkTest.test" -Ptests.jvms=4 -Ptests.haltonfailure=false "-Ptests.jvmargs=-XX:TieredStopAtLevel=1 -XX:+UseParallelGC -XX:ActiveProcessorCount=1 -XX:ReservedCodeCacheSize=120m" -Ptests.seed=B08CAB6CDDEC9EC8 -Ptests.multiplier=2 -Ptests.nightly=true -Ptests.badapples=false -Ptests.file.encoding=UTF-8 -Ptests.linedocsfile=/home/jenkins/jenkins-slave/workspace/Solr/Solr-NightlyTests-main/test-data/enwiki.random.lines.txt
- org.apache.solr.search.TestFiltering.testRandomFiltering (:solr:core)
Test history: https://ge.apache.org/scans/tests?search.rootProjectNames=solr-root&tests.container=org.apache.solr.search.TestFiltering&tests.test=testRandomFiltering http://fucit.org/solr-jenkins-reports/history-trend-of-recent-failures.html#series/org.apache.solr.search.TestFiltering.testRandomFiltering
Test output: /home/jenkins/jenkins-slave/workspace/Solr/Solr-NightlyTests-main/solr/core/build/test-results/test/outputs/OUTPUT-org.apache.solr.search.TestFiltering.txt
Reproduce with: ./gradlew :solr:core:test --tests "org.apache.solr.search.TestFiltering.testRandomFiltering" -Ptests.jvms=4 -Ptests.haltonfailure=false "-Ptests.jvmargs=-XX:TieredStopAtLevel=1 -XX:+UseParallelGC -XX:ActiveProcessorCount=1 -XX:ReservedCodeCacheSize=120m" -Ptests.seed=B08CAB6CDDEC9EC8 -Ptests.multiplier=2 -Ptests.nightly=true -Ptests.badapples=false -Ptests.file.encoding=UTF-8 -Ptests.linedocsfile=/home/jenkins/jenkins-slave/workspace/Solr/Solr-NightlyTests-main/test-data/enwiki.random.lines.txt
Deprecated Gradle features were used in this build, making it incompatible with Gradle 9.0.
You can use '--warning-mode all' to show the individual deprecation warnings and determine if they come from your own scripts or plugins.
For more on this, please refer to https://docs.gradle.org/8.10/userguide/command_line_interface.html#sec:command_line_warnings in the Gradle documentation.
BUILD SUCCESSFUL in 1h 55m 43s
154 actionable tasks: 154 executed
Publishing build scan...
The Develocity server (ge.apache.org) rejected the access key with prefix 'eyJraWQiOiJhdXRoLWtleS1pZC01M2E4OGFlZS0yZTU4LTQ2YjItYWFmNS01MjljYmYzOWNkNjUiLCJhbGciOiJSUzI1NiIsInR5cCI6IkpXVCJ9.eyJpc19hbm9ueW1vdXMiOmZhbHNlLCJwZXJtaXNzaW9ucyI6WyJWSUVXX1NDQU4iLCJQVUJMSVNIX1NDQU4iLCJQUkVESUNUSVZFX1RFU1RfU0VMRUNUSU9OIiwiUkVBRF9DQUNIRSIsIkFDQ0VTU19BTExfREFUQSIsIkFDQ0VTU19EQVRBX1dJVEhPVVRfQVNTT0NJQVRFRF9QUk9KRUNUIiwiTVlfU0VUVElOR1MiLCJSRUFEX1ZFUlNJT04iXSwiYWxsRGF0YVBlcm1pc3Npb25zIjpbIlZJRVdfU0NBTiIsIlBSRURJQ1RJVkVfVEVTVF9TRUxFQ1RJT04iLCJSRUFEX0NBQ0hFIiwiQUNDRVNTX0FMTF9EQVRBIiwiQUNDRVNTX0RBVEFfV0lUSE9VVF9BU1NPQ0lBVEVEX1BST0pFQ1QiLCJQVUJMSVNIX1NDQU4iLCJNWV9TRVRUSU5HUyIsIlJFQURfVkVSU0lPTiJdLCJwcm9qZWN0cyI6e30sInVzZXJfaW'.
Your access key has expired - please visit https://ge.apache.org/settings/access-keys to refresh it.
Build step 'Invoke Gradle script' changed build result to SUCCESS
Archiving artifacts
‘**/*.events’ doesn’t match anything: ‘**’ exists but not ‘**/*.events’
No artifacts found that match the file pattern "**/*.events,heapdumps/**,**/hs_err_pid*". Configuration error?
Recording test results
[Checks API] No suitable checks publisher found.
Build step 'Publish JUnit test result report' changed build result to UNSTABLE
Email was triggered for: Unstable (Test Failures)
Sending email for trigger: Unstable (Test Failures)
[JENKINS] Solr » Solr-NightlyTests-main - Build # 1306 - Still Unstable!
Posted by Apache Jenkins Server <je...@builds.apache.org>.
Build: https://ci-builds.apache.org/job/Solr/job/Solr-NightlyTests-main/1306/
9 tests failed.
FAILED: org.apache.solr.cli.TestSolrCLIRunExample.testFilmsExample
Error Message:
java.lang.AssertionError: it should be ok org.apache.solr.cli.RunExampleTool@19d219 [-e, films, --server-dir, /home/jenkins/jenkins-slave/workspace/Solr/Solr-NightlyTests-main/solr/server, --example-dir, /home/jenkins/jenkins-slave/workspace/Solr/Solr-NightlyTests-main/solr/core/build/tmp/tests-tmp/org.apache.solr.cli.TestSolrCLIRunExample_B45BFE396F5997BB-001/tempDir-010, -p, 44319, --user-managed] expected:<0> but was:<1>
Stack Trace:
java.lang.AssertionError: it should be ok org.apache.solr.cli.RunExampleTool@19d219 [-e, films, --server-dir, /home/jenkins/jenkins-slave/workspace/Solr/Solr-NightlyTests-main/solr/server, --example-dir, /home/jenkins/jenkins-slave/workspace/Solr/Solr-NightlyTests-main/solr/core/build/tmp/tests-tmp/org.apache.solr.cli.TestSolrCLIRunExample_B45BFE396F5997BB-001/tempDir-010, -p, 44319, --user-managed] expected:<0> but was:<1>
at __randomizedtesting.SeedInfo.seed([B45BFE396F5997BB:5FE30AD6B0B51684]:0)
at org.junit.Assert.fail(Assert.java:89)
at org.junit.Assert.failNotEquals(Assert.java:835)
at org.junit.Assert.assertEquals(Assert.java:647)
at org.apache.solr.cli.TestSolrCLIRunExample.testExample(TestSolrCLIRunExample.java:392)
at org.apache.solr.cli.TestSolrCLIRunExample.testFilmsExample(TestSolrCLIRunExample.java:335)
at java.base/jdk.internal.reflect.DirectMethodHandleAccessor.invoke(DirectMethodHandleAccessor.java:103)
at java.base/java.lang.reflect.Method.invoke(Method.java:580)
at com.carrotsearch.randomizedtesting.RandomizedRunner.invoke(RandomizedRunner.java:1758)
at com.carrotsearch.randomizedtesting.RandomizedRunner$8.evaluate(RandomizedRunner.java:946)
at com.carrotsearch.randomizedtesting.RandomizedRunner$9.evaluate(RandomizedRunner.java:982)
at com.carrotsearch.randomizedtesting.RandomizedRunner$10.evaluate(RandomizedRunner.java:996)
at com.carrotsearch.randomizedtesting.rules.SystemPropertiesRestoreRule$1.evaluate(SystemPropertiesRestoreRule.java:80)
at org.junit.rules.RunRules.evaluate(RunRules.java:20)
at org.apache.lucene.tests.util.TestRuleSetupTeardownChained$1.evaluate(TestRuleSetupTeardownChained.java:48)
at org.apache.lucene.tests.util.AbstractBeforeAfterRule$1.evaluate(AbstractBeforeAfterRule.java:43)
at org.apache.lucene.tests.util.TestRuleThreadAndTestName$1.evaluate(TestRuleThreadAndTestName.java:45)
at org.apache.lucene.tests.util.TestRuleIgnoreAfterMaxFailures$1.evaluate(TestRuleIgnoreAfterMaxFailures.java:60)
at org.apache.lucene.tests.util.TestRuleMarkFailure$1.evaluate(TestRuleMarkFailure.java:44)
at org.junit.rules.RunRules.evaluate(RunRules.java:20)
at com.carrotsearch.randomizedtesting.rules.StatementAdapter.evaluate(StatementAdapter.java:36)
at com.carrotsearch.randomizedtesting.ThreadLeakControl$StatementRunner.run(ThreadLeakControl.java:390)
at com.carrotsearch.randomizedtesting.ThreadLeakControl.forkTimeoutingTask(ThreadLeakControl.java:843)
at com.carrotsearch.randomizedtesting.ThreadLeakControl$3.evaluate(ThreadLeakControl.java:490)
at com.carrotsearch.randomizedtesting.RandomizedRunner.runSingleTest(RandomizedRunner.java:955)
at com.carrotsearch.randomizedtesting.RandomizedRunner$5.evaluate(RandomizedRunner.java:840)
at com.carrotsearch.randomizedtesting.RandomizedRunner$6.evaluate(RandomizedRunner.java:891)
at com.carrotsearch.randomizedtesting.RandomizedRunner$7.evaluate(RandomizedRunner.java:902)
at com.carrotsearch.randomizedtesting.rules.StatementAdapter.evaluate(StatementAdapter.java:36)
at com.carrotsearch.randomizedtesting.rules.StatementAdapter.evaluate(StatementAdapter.java:36)
at org.apache.lucene.tests.util.AbstractBeforeAfterRule$1.evaluate(AbstractBeforeAfterRule.java:43)
at com.carrotsearch.randomizedtesting.rules.SystemPropertiesRestoreRule$1.evaluate(SystemPropertiesRestoreRule.java:80)
at org.junit.rules.RunRules.evaluate(RunRules.java:20)
at org.apache.lucene.tests.util.AbstractBeforeAfterRule$1.evaluate(AbstractBeforeAfterRule.java:43)
at com.carrotsearch.randomizedtesting.rules.StatementAdapter.evaluate(StatementAdapter.java:36)
at org.apache.lucene.tests.util.TestRuleStoreClassName$1.evaluate(TestRuleStoreClassName.java:38)
at com.carrotsearch.randomizedtesting.rules.NoShadowingOrOverridesOnMethodsRule$1.evaluate(NoShadowingOrOverridesOnMethodsRule.java:40)
at com.carrotsearch.randomizedtesting.rules.NoShadowingOrOverridesOnMethodsRule$1.evaluate(NoShadowingOrOverridesOnMethodsRule.java:40)
at com.carrotsearch.randomizedtesting.rules.StatementAdapter.evaluate(StatementAdapter.java:36)
at com.carrotsearch.randomizedtesting.rules.StatementAdapter.evaluate(StatementAdapter.java:36)
at org.apache.lucene.tests.util.TestRuleAssertionsRequired$1.evaluate(TestRuleAssertionsRequired.java:53)
at org.apache.lucene.tests.util.AbstractBeforeAfterRule$1.evaluate(AbstractBeforeAfterRule.java:43)
at org.apache.lucene.tests.util.TestRuleMarkFailure$1.evaluate(TestRuleMarkFailure.java:44)
at org.apache.lucene.tests.util.TestRuleIgnoreAfterMaxFailures$1.evaluate(TestRuleIgnoreAfterMaxFailures.java:60)
at org.apache.lucene.tests.util.TestRuleIgnoreTestSuites$1.evaluate(TestRuleIgnoreTestSuites.java:47)
at org.junit.rules.RunRules.evaluate(RunRules.java:20)
at com.carrotsearch.randomizedtesting.rules.StatementAdapter.evaluate(StatementAdapter.java:36)
at com.carrotsearch.randomizedtesting.ThreadLeakControl$StatementRunner.run(ThreadLeakControl.java:390)
at com.carrotsearch.randomizedtesting.ThreadLeakControl.lambda$forkTimeoutingTask$0(ThreadLeakControl.java:850)
at java.base/java.lang.Thread.run(Thread.java:1583)
FAILED: org.apache.solr.cli.TestSolrCLIRunExample.testFilmsExample
Error Message:
java.lang.AssertionError: it should be ok org.apache.solr.cli.RunExampleTool@4c909ed7 [-e, films, --server-dir, /home/jenkins/jenkins-slave/workspace/Solr/Solr-NightlyTests-main/solr/server, --example-dir, /home/jenkins/jenkins-slave/workspace/Solr/Solr-NightlyTests-main/solr/core/build/tmp/tests-tmp/org.apache.solr.cli.TestSolrCLIRunExample_B45BFE396F5997BB-002/tempDir-001, -p, 38485, --user-managed] expected:<0> but was:<1>
Stack Trace:
java.lang.AssertionError: it should be ok org.apache.solr.cli.RunExampleTool@4c909ed7 [-e, films, --server-dir, /home/jenkins/jenkins-slave/workspace/Solr/Solr-NightlyTests-main/solr/server, --example-dir, /home/jenkins/jenkins-slave/workspace/Solr/Solr-NightlyTests-main/solr/core/build/tmp/tests-tmp/org.apache.solr.cli.TestSolrCLIRunExample_B45BFE396F5997BB-002/tempDir-001, -p, 38485, --user-managed] expected:<0> but was:<1>
at __randomizedtesting.SeedInfo.seed([B45BFE396F5997BB:5FE30AD6B0B51684]:0)
at org.junit.Assert.fail(Assert.java:89)
at org.junit.Assert.failNotEquals(Assert.java:835)
at org.junit.Assert.assertEquals(Assert.java:647)
at org.apache.solr.cli.TestSolrCLIRunExample.testExample(TestSolrCLIRunExample.java:392)
at org.apache.solr.cli.TestSolrCLIRunExample.testFilmsExample(TestSolrCLIRunExample.java:335)
at java.base/jdk.internal.reflect.DirectMethodHandleAccessor.invoke(DirectMethodHandleAccessor.java:103)
at java.base/java.lang.reflect.Method.invoke(Method.java:580)
at com.carrotsearch.randomizedtesting.RandomizedRunner.invoke(RandomizedRunner.java:1758)
at com.carrotsearch.randomizedtesting.RandomizedRunner$8.evaluate(RandomizedRunner.java:946)
at com.carrotsearch.randomizedtesting.RandomizedRunner$9.evaluate(RandomizedRunner.java:982)
at com.carrotsearch.randomizedtesting.RandomizedRunner$10.evaluate(RandomizedRunner.java:996)
at com.carrotsearch.randomizedtesting.rules.SystemPropertiesRestoreRule$1.evaluate(SystemPropertiesRestoreRule.java:80)
at org.junit.rules.RunRules.evaluate(RunRules.java:20)
at org.apache.lucene.tests.util.TestRuleSetupTeardownChained$1.evaluate(TestRuleSetupTeardownChained.java:48)
at org.apache.lucene.tests.util.AbstractBeforeAfterRule$1.evaluate(AbstractBeforeAfterRule.java:43)
at org.apache.lucene.tests.util.TestRuleThreadAndTestName$1.evaluate(TestRuleThreadAndTestName.java:45)
at org.apache.lucene.tests.util.TestRuleIgnoreAfterMaxFailures$1.evaluate(TestRuleIgnoreAfterMaxFailures.java:60)
at org.apache.lucene.tests.util.TestRuleMarkFailure$1.evaluate(TestRuleMarkFailure.java:44)
at org.junit.rules.RunRules.evaluate(RunRules.java:20)
at com.carrotsearch.randomizedtesting.rules.StatementAdapter.evaluate(StatementAdapter.java:36)
at com.carrotsearch.randomizedtesting.ThreadLeakControl$StatementRunner.run(ThreadLeakControl.java:390)
at com.carrotsearch.randomizedtesting.ThreadLeakControl.forkTimeoutingTask(ThreadLeakControl.java:843)
at com.carrotsearch.randomizedtesting.ThreadLeakControl$3.evaluate(ThreadLeakControl.java:490)
at com.carrotsearch.randomizedtesting.RandomizedRunner.runSingleTest(RandomizedRunner.java:955)
at com.carrotsearch.randomizedtesting.RandomizedRunner$5.evaluate(RandomizedRunner.java:840)
at com.carrotsearch.randomizedtesting.RandomizedRunner$6.evaluate(RandomizedRunner.java:891)
at com.carrotsearch.randomizedtesting.RandomizedRunner$7.evaluate(RandomizedRunner.java:902)
at com.carrotsearch.randomizedtesting.rules.StatementAdapter.evaluate(StatementAdapter.java:36)
at com.carrotsearch.randomizedtesting.rules.StatementAdapter.evaluate(StatementAdapter.java:36)
at org.apache.lucene.tests.util.AbstractBeforeAfterRule$1.evaluate(AbstractBeforeAfterRule.java:43)
at com.carrotsearch.randomizedtesting.rules.SystemPropertiesRestoreRule$1.evaluate(SystemPropertiesRestoreRule.java:80)
at org.junit.rules.RunRules.evaluate(RunRules.java:20)
at org.apache.lucene.tests.util.AbstractBeforeAfterRule$1.evaluate(AbstractBeforeAfterRule.java:43)
at com.carrotsearch.randomizedtesting.rules.StatementAdapter.evaluate(StatementAdapter.java:36)
at org.apache.lucene.tests.util.TestRuleStoreClassName$1.evaluate(TestRuleStoreClassName.java:38)
at com.carrotsearch.randomizedtesting.rules.NoShadowingOrOverridesOnMethodsRule$1.evaluate(NoShadowingOrOverridesOnMethodsRule.java:40)
at com.carrotsearch.randomizedtesting.rules.NoShadowingOrOverridesOnMethodsRule$1.evaluate(NoShadowingOrOverridesOnMethodsRule.java:40)
at com.carrotsearch.randomizedtesting.rules.StatementAdapter.evaluate(StatementAdapter.java:36)
at com.carrotsearch.randomizedtesting.rules.StatementAdapter.evaluate(StatementAdapter.java:36)
at org.apache.lucene.tests.util.TestRuleAssertionsRequired$1.evaluate(TestRuleAssertionsRequired.java:53)
at org.apache.lucene.tests.util.AbstractBeforeAfterRule$1.evaluate(AbstractBeforeAfterRule.java:43)
at org.apache.lucene.tests.util.TestRuleMarkFailure$1.evaluate(TestRuleMarkFailure.java:44)
at org.apache.lucene.tests.util.TestRuleIgnoreAfterMaxFailures$1.evaluate(TestRuleIgnoreAfterMaxFailures.java:60)
at org.apache.lucene.tests.util.TestRuleIgnoreTestSuites$1.evaluate(TestRuleIgnoreTestSuites.java:47)
at org.junit.rules.RunRules.evaluate(RunRules.java:20)
at com.carrotsearch.randomizedtesting.rules.StatementAdapter.evaluate(StatementAdapter.java:36)
at com.carrotsearch.randomizedtesting.ThreadLeakControl$StatementRunner.run(ThreadLeakControl.java:390)
at com.carrotsearch.randomizedtesting.ThreadLeakControl.lambda$forkTimeoutingTask$0(ThreadLeakControl.java:850)
at java.base/java.lang.Thread.run(Thread.java:1583)
FAILED: org.apache.solr.cli.TestSolrCLIRunExample.testFilmsExample
Error Message:
java.lang.AssertionError: it should be ok org.apache.solr.cli.RunExampleTool@4c909ed7 [-e, films, --server-dir, /home/jenkins/jenkins-slave/workspace/Solr/Solr-NightlyTests-main/solr/server, --example-dir, /home/jenkins/jenkins-slave/workspace/Solr/Solr-NightlyTests-main/solr/core/build/tmp/tests-tmp/org.apache.solr.cli.TestSolrCLIRunExample_B45BFE396F5997BB-003/tempDir-001, -p, 42219, --user-managed] expected:<0> but was:<1>
Stack Trace:
java.lang.AssertionError: it should be ok org.apache.solr.cli.RunExampleTool@4c909ed7 [-e, films, --server-dir, /home/jenkins/jenkins-slave/workspace/Solr/Solr-NightlyTests-main/solr/server, --example-dir, /home/jenkins/jenkins-slave/workspace/Solr/Solr-NightlyTests-main/solr/core/build/tmp/tests-tmp/org.apache.solr.cli.TestSolrCLIRunExample_B45BFE396F5997BB-003/tempDir-001, -p, 42219, --user-managed] expected:<0> but was:<1>
at __randomizedtesting.SeedInfo.seed([B45BFE396F5997BB:5FE30AD6B0B51684]:0)
at org.junit.Assert.fail(Assert.java:89)
at org.junit.Assert.failNotEquals(Assert.java:835)
at org.junit.Assert.assertEquals(Assert.java:647)
at org.apache.solr.cli.TestSolrCLIRunExample.testExample(TestSolrCLIRunExample.java:392)
at org.apache.solr.cli.TestSolrCLIRunExample.testFilmsExample(TestSolrCLIRunExample.java:335)
at java.base/jdk.internal.reflect.DirectMethodHandleAccessor.invoke(DirectMethodHandleAccessor.java:103)
at java.base/java.lang.reflect.Method.invoke(Method.java:580)
at com.carrotsearch.randomizedtesting.RandomizedRunner.invoke(RandomizedRunner.java:1758)
at com.carrotsearch.randomizedtesting.RandomizedRunner$8.evaluate(RandomizedRunner.java:946)
at com.carrotsearch.randomizedtesting.RandomizedRunner$9.evaluate(RandomizedRunner.java:982)
at com.carrotsearch.randomizedtesting.RandomizedRunner$10.evaluate(RandomizedRunner.java:996)
at com.carrotsearch.randomizedtesting.rules.SystemPropertiesRestoreRule$1.evaluate(SystemPropertiesRestoreRule.java:80)
at org.junit.rules.RunRules.evaluate(RunRules.java:20)
at org.apache.lucene.tests.util.TestRuleSetupTeardownChained$1.evaluate(TestRuleSetupTeardownChained.java:48)
at org.apache.lucene.tests.util.AbstractBeforeAfterRule$1.evaluate(AbstractBeforeAfterRule.java:43)
at org.apache.lucene.tests.util.TestRuleThreadAndTestName$1.evaluate(TestRuleThreadAndTestName.java:45)
at org.apache.lucene.tests.util.TestRuleIgnoreAfterMaxFailures$1.evaluate(TestRuleIgnoreAfterMaxFailures.java:60)
at org.apache.lucene.tests.util.TestRuleMarkFailure$1.evaluate(TestRuleMarkFailure.java:44)
at org.junit.rules.RunRules.evaluate(RunRules.java:20)
at com.carrotsearch.randomizedtesting.rules.StatementAdapter.evaluate(StatementAdapter.java:36)
at com.carrotsearch.randomizedtesting.ThreadLeakControl$StatementRunner.run(ThreadLeakControl.java:390)
at com.carrotsearch.randomizedtesting.ThreadLeakControl.forkTimeoutingTask(ThreadLeakControl.java:843)
at com.carrotsearch.randomizedtesting.ThreadLeakControl$3.evaluate(ThreadLeakControl.java:490)
at com.carrotsearch.randomizedtesting.RandomizedRunner.runSingleTest(RandomizedRunner.java:955)
at com.carrotsearch.randomizedtesting.RandomizedRunner$5.evaluate(RandomizedRunner.java:840)
at com.carrotsearch.randomizedtesting.RandomizedRunner$6.evaluate(RandomizedRunner.java:891)
at com.carrotsearch.randomizedtesting.RandomizedRunner$7.evaluate(RandomizedRunner.java:902)
at com.carrotsearch.randomizedtesting.rules.StatementAdapter.evaluate(StatementAdapter.java:36)
at com.carrotsearch.randomizedtesting.rules.StatementAdapter.evaluate(StatementAdapter.java:36)
at org.apache.lucene.tests.util.AbstractBeforeAfterRule$1.evaluate(AbstractBeforeAfterRule.java:43)
at com.carrotsearch.randomizedtesting.rules.SystemPropertiesRestoreRule$1.evaluate(SystemPropertiesRestoreRule.java:80)
at org.junit.rules.RunRules.evaluate(RunRules.java:20)
at org.apache.lucene.tests.util.AbstractBeforeAfterRule$1.evaluate(AbstractBeforeAfterRule.java:43)
at com.carrotsearch.randomizedtesting.rules.StatementAdapter.evaluate(StatementAdapter.java:36)
at org.apache.lucene.tests.util.TestRuleStoreClassName$1.evaluate(TestRuleStoreClassName.java:38)
at com.carrotsearch.randomizedtesting.rules.NoShadowingOrOverridesOnMethodsRule$1.evaluate(NoShadowingOrOverridesOnMethodsRule.java:40)
at com.carrotsearch.randomizedtesting.rules.NoShadowingOrOverridesOnMethodsRule$1.evaluate(NoShadowingOrOverridesOnMethodsRule.java:40)
at com.carrotsearch.randomizedtesting.rules.StatementAdapter.evaluate(StatementAdapter.java:36)
at com.carrotsearch.randomizedtesting.rules.StatementAdapter.evaluate(StatementAdapter.java:36)
at org.apache.lucene.tests.util.TestRuleAssertionsRequired$1.evaluate(TestRuleAssertionsRequired.java:53)
at org.apache.lucene.tests.util.AbstractBeforeAfterRule$1.evaluate(AbstractBeforeAfterRule.java:43)
at org.apache.lucene.tests.util.TestRuleMarkFailure$1.evaluate(TestRuleMarkFailure.java:44)
at org.apache.lucene.tests.util.TestRuleIgnoreAfterMaxFailures$1.evaluate(TestRuleIgnoreAfterMaxFailures.java:60)
at org.apache.lucene.tests.util.TestRuleIgnoreTestSuites$1.evaluate(TestRuleIgnoreTestSuites.java:47)
at org.junit.rules.RunRules.evaluate(RunRules.java:20)
at com.carrotsearch.randomizedtesting.rules.StatementAdapter.evaluate(StatementAdapter.java:36)
at com.carrotsearch.randomizedtesting.ThreadLeakControl$StatementRunner.run(ThreadLeakControl.java:390)
at com.carrotsearch.randomizedtesting.ThreadLeakControl.lambda$forkTimeoutingTask$0(ThreadLeakControl.java:850)
at java.base/java.lang.Thread.run(Thread.java:1583)
FAILED: org.apache.solr.cli.TestSolrCLIRunExample.testFilmsExample
Error Message:
java.lang.AssertionError: it should be ok org.apache.solr.cli.RunExampleTool@24f0e1d5 [-e, films, --server-dir, /home/jenkins/jenkins-slave/workspace/Solr/Solr-NightlyTests-main/solr/server, --example-dir, /home/jenkins/jenkins-slave/workspace/Solr/Solr-NightlyTests-main/solr/core/build/tmp/tests-tmp/org.apache.solr.cli.TestSolrCLIRunExample_B45BFE396F5997BB-004/tempDir-001, -p, 37285, --user-managed] expected:<0> but was:<1>
Stack Trace:
java.lang.AssertionError: it should be ok org.apache.solr.cli.RunExampleTool@24f0e1d5 [-e, films, --server-dir, /home/jenkins/jenkins-slave/workspace/Solr/Solr-NightlyTests-main/solr/server, --example-dir, /home/jenkins/jenkins-slave/workspace/Solr/Solr-NightlyTests-main/solr/core/build/tmp/tests-tmp/org.apache.solr.cli.TestSolrCLIRunExample_B45BFE396F5997BB-004/tempDir-001, -p, 37285, --user-managed] expected:<0> but was:<1>
at __randomizedtesting.SeedInfo.seed([B45BFE396F5997BB:5FE30AD6B0B51684]:0)
at org.junit.Assert.fail(Assert.java:89)
at org.junit.Assert.failNotEquals(Assert.java:835)
at org.junit.Assert.assertEquals(Assert.java:647)
at org.apache.solr.cli.TestSolrCLIRunExample.testExample(TestSolrCLIRunExample.java:392)
at org.apache.solr.cli.TestSolrCLIRunExample.testFilmsExample(TestSolrCLIRunExample.java:335)
at java.base/jdk.internal.reflect.DirectMethodHandleAccessor.invoke(DirectMethodHandleAccessor.java:103)
at java.base/java.lang.reflect.Method.invoke(Method.java:580)
at com.carrotsearch.randomizedtesting.RandomizedRunner.invoke(RandomizedRunner.java:1758)
at com.carrotsearch.randomizedtesting.RandomizedRunner$8.evaluate(RandomizedRunner.java:946)
at com.carrotsearch.randomizedtesting.RandomizedRunner$9.evaluate(RandomizedRunner.java:982)
at com.carrotsearch.randomizedtesting.RandomizedRunner$10.evaluate(RandomizedRunner.java:996)
at com.carrotsearch.randomizedtesting.rules.SystemPropertiesRestoreRule$1.evaluate(SystemPropertiesRestoreRule.java:80)
at org.junit.rules.RunRules.evaluate(RunRules.java:20)
at org.apache.lucene.tests.util.TestRuleSetupTeardownChained$1.evaluate(TestRuleSetupTeardownChained.java:48)
at org.apache.lucene.tests.util.AbstractBeforeAfterRule$1.evaluate(AbstractBeforeAfterRule.java:43)
at org.apache.lucene.tests.util.TestRuleThreadAndTestName$1.evaluate(TestRuleThreadAndTestName.java:45)
at org.apache.lucene.tests.util.TestRuleIgnoreAfterMaxFailures$1.evaluate(TestRuleIgnoreAfterMaxFailures.java:60)
at org.apache.lucene.tests.util.TestRuleMarkFailure$1.evaluate(TestRuleMarkFailure.java:44)
at org.junit.rules.RunRules.evaluate(RunRules.java:20)
at com.carrotsearch.randomizedtesting.rules.StatementAdapter.evaluate(StatementAdapter.java:36)
at com.carrotsearch.randomizedtesting.ThreadLeakControl$StatementRunner.run(ThreadLeakControl.java:390)
at com.carrotsearch.randomizedtesting.ThreadLeakControl.forkTimeoutingTask(ThreadLeakControl.java:843)
at com.carrotsearch.randomizedtesting.ThreadLeakControl$3.evaluate(ThreadLeakControl.java:490)
at com.carrotsearch.randomizedtesting.RandomizedRunner.runSingleTest(RandomizedRunner.java:955)
at com.carrotsearch.randomizedtesting.RandomizedRunner$5.evaluate(RandomizedRunner.java:840)
at com.carrotsearch.randomizedtesting.RandomizedRunner$6.evaluate(RandomizedRunner.java:891)
at com.carrotsearch.randomizedtesting.RandomizedRunner$7.evaluate(RandomizedRunner.java:902)
at com.carrotsearch.randomizedtesting.rules.StatementAdapter.evaluate(StatementAdapter.java:36)
at com.carrotsearch.randomizedtesting.rules.StatementAdapter.evaluate(StatementAdapter.java:36)
at org.apache.lucene.tests.util.AbstractBeforeAfterRule$1.evaluate(AbstractBeforeAfterRule.java:43)
at com.carrotsearch.randomizedtesting.rules.SystemPropertiesRestoreRule$1.evaluate(SystemPropertiesRestoreRule.java:80)
at org.junit.rules.RunRules.evaluate(RunRules.java:20)
at org.apache.lucene.tests.util.AbstractBeforeAfterRule$1.evaluate(AbstractBeforeAfterRule.java:43)
at com.carrotsearch.randomizedtesting.rules.StatementAdapter.evaluate(StatementAdapter.java:36)
at org.apache.lucene.tests.util.TestRuleStoreClassName$1.evaluate(TestRuleStoreClassName.java:38)
at com.carrotsearch.randomizedtesting.rules.NoShadowingOrOverridesOnMethodsRule$1.evaluate(NoShadowingOrOverridesOnMethodsRule.java:40)
at com.carrotsearch.randomizedtesting.rules.NoShadowingOrOverridesOnMethodsRule$1.evaluate(NoShadowingOrOverridesOnMethodsRule.java:40)
at com.carrotsearch.randomizedtesting.rules.StatementAdapter.evaluate(StatementAdapter.java:36)
at com.carrotsearch.randomizedtesting.rules.StatementAdapter.evaluate(StatementAdapter.java:36)
at org.apache.lucene.tests.util.TestRuleAssertionsRequired$1.evaluate(TestRuleAssertionsRequired.java:53)
at org.apache.lucene.tests.util.AbstractBeforeAfterRule$1.evaluate(AbstractBeforeAfterRule.java:43)
at org.apache.lucene.tests.util.TestRuleMarkFailure$1.evaluate(TestRuleMarkFailure.java:44)
at org.apache.lucene.tests.util.TestRuleIgnoreAfterMaxFailures$1.evaluate(TestRuleIgnoreAfterMaxFailures.java:60)
at org.apache.lucene.tests.util.TestRuleIgnoreTestSuites$1.evaluate(TestRuleIgnoreTestSuites.java:47)
at org.junit.rules.RunRules.evaluate(RunRules.java:20)
at com.carrotsearch.randomizedtesting.rules.StatementAdapter.evaluate(StatementAdapter.java:36)
at com.carrotsearch.randomizedtesting.ThreadLeakControl$StatementRunner.run(ThreadLeakControl.java:390)
at com.carrotsearch.randomizedtesting.ThreadLeakControl.lambda$forkTimeoutingTask$0(ThreadLeakControl.java:850)
at java.base/java.lang.Thread.run(Thread.java:1583)
FAILED: org.apache.solr.cloud.ChaosMonkeySafeLeaderTest.test
Error Message:
java.lang.AssertionError: expected:<0> but was:<6>
Stack Trace:
java.lang.AssertionError: expected:<0> but was:<6>
at __randomizedtesting.SeedInfo.seed([B45BFE396F5997BB:3C0FC1E3C1A5FA43]:0)
at org.junit.Assert.fail(Assert.java:89)
at org.junit.Assert.failNotEquals(Assert.java:835)
at org.junit.Assert.assertEquals(Assert.java:647)
at org.junit.Assert.assertEquals(Assert.java:633)
at org.apache.solr.cloud.AbstractChaosMonkeySafeLeaderTestBase.test(AbstractChaosMonkeySafeLeaderTestBase.java:166)
at java.base/jdk.internal.reflect.DirectMethodHandleAccessor.invoke(DirectMethodHandleAccessor.java:103)
at java.base/java.lang.reflect.Method.invoke(Method.java:580)
at com.carrotsearch.randomizedtesting.RandomizedRunner.invoke(RandomizedRunner.java:1758)
at com.carrotsearch.randomizedtesting.RandomizedRunner$8.evaluate(RandomizedRunner.java:946)
at com.carrotsearch.randomizedtesting.RandomizedRunner$9.evaluate(RandomizedRunner.java:982)
at com.carrotsearch.randomizedtesting.RandomizedRunner$10.evaluate(RandomizedRunner.java:996)
at org.apache.solr.BaseDistributedSearchTestCase$ShardsRepeatRule$ShardsFixedStatement.callStatement(BaseDistributedSearchTestCase.java:1070)
at org.apache.solr.BaseDistributedSearchTestCase$ShardsRepeatRule$ShardsStatement.evaluate(BaseDistributedSearchTestCase.java:1041)
at com.carrotsearch.randomizedtesting.rules.SystemPropertiesRestoreRule$1.evaluate(SystemPropertiesRestoreRule.java:80)
at org.junit.rules.RunRules.evaluate(RunRules.java:20)
at org.apache.lucene.tests.util.TestRuleSetupTeardownChained$1.evaluate(TestRuleSetupTeardownChained.java:48)
at org.apache.lucene.tests.util.AbstractBeforeAfterRule$1.evaluate(AbstractBeforeAfterRule.java:43)
at org.apache.lucene.tests.util.TestRuleThreadAndTestName$1.evaluate(TestRuleThreadAndTestName.java:45)
at org.apache.lucene.tests.util.TestRuleIgnoreAfterMaxFailures$1.evaluate(TestRuleIgnoreAfterMaxFailures.java:60)
at org.apache.lucene.tests.util.TestRuleMarkFailure$1.evaluate(TestRuleMarkFailure.java:44)
at org.junit.rules.RunRules.evaluate(RunRules.java:20)
at com.carrotsearch.randomizedtesting.rules.StatementAdapter.evaluate(StatementAdapter.java:36)
at com.carrotsearch.randomizedtesting.ThreadLeakControl$StatementRunner.run(ThreadLeakControl.java:390)
at com.carrotsearch.randomizedtesting.ThreadLeakControl.forkTimeoutingTask(ThreadLeakControl.java:843)
at com.carrotsearch.randomizedtesting.ThreadLeakControl$3.evaluate(ThreadLeakControl.java:490)
at com.carrotsearch.randomizedtesting.RandomizedRunner.runSingleTest(RandomizedRunner.java:955)
at com.carrotsearch.randomizedtesting.RandomizedRunner$5.evaluate(RandomizedRunner.java:840)
at com.carrotsearch.randomizedtesting.RandomizedRunner$6.evaluate(RandomizedRunner.java:891)
at com.carrotsearch.randomizedtesting.RandomizedRunner$7.evaluate(RandomizedRunner.java:902)
at com.carrotsearch.randomizedtesting.rules.StatementAdapter.evaluate(StatementAdapter.java:36)
at com.carrotsearch.randomizedtesting.rules.StatementAdapter.evaluate(StatementAdapter.java:36)
at org.apache.lucene.tests.util.AbstractBeforeAfterRule$1.evaluate(AbstractBeforeAfterRule.java:43)
at com.carrotsearch.randomizedtesting.rules.SystemPropertiesRestoreRule$1.evaluate(SystemPropertiesRestoreRule.java:80)
at org.junit.rules.RunRules.evaluate(RunRules.java:20)
at org.apache.lucene.tests.util.AbstractBeforeAfterRule$1.evaluate(AbstractBeforeAfterRule.java:43)
at com.carrotsearch.randomizedtesting.rules.StatementAdapter.evaluate(StatementAdapter.java:36)
at org.apache.lucene.tests.util.TestRuleStoreClassName$1.evaluate(TestRuleStoreClassName.java:38)
at com.carrotsearch.randomizedtesting.rules.NoShadowingOrOverridesOnMethodsRule$1.evaluate(NoShadowingOrOverridesOnMethodsRule.java:40)
at com.carrotsearch.randomizedtesting.rules.NoShadowingOrOverridesOnMethodsRule$1.evaluate(NoShadowingOrOverridesOnMethodsRule.java:40)
at com.carrotsearch.randomizedtesting.rules.StatementAdapter.evaluate(StatementAdapter.java:36)
at com.carrotsearch.randomizedtesting.rules.StatementAdapter.evaluate(StatementAdapter.java:36)
at org.apache.lucene.tests.util.TestRuleAssertionsRequired$1.evaluate(TestRuleAssertionsRequired.java:53)
at org.apache.lucene.tests.util.AbstractBeforeAfterRule$1.evaluate(AbstractBeforeAfterRule.java:43)
at org.apache.lucene.tests.util.TestRuleMarkFailure$1.evaluate(TestRuleMarkFailure.java:44)
at org.apache.lucene.tests.util.TestRuleIgnoreAfterMaxFailures$1.evaluate(TestRuleIgnoreAfterMaxFailures.java:60)
at org.apache.lucene.tests.util.TestRuleIgnoreTestSuites$1.evaluate(TestRuleIgnoreTestSuites.java:47)
at org.junit.rules.RunRules.evaluate(RunRules.java:20)
at com.carrotsearch.randomizedtesting.rules.StatementAdapter.evaluate(StatementAdapter.java:36)
at com.carrotsearch.randomizedtesting.ThreadLeakControl$StatementRunner.run(ThreadLeakControl.java:390)
at com.carrotsearch.randomizedtesting.ThreadLeakControl.lambda$forkTimeoutingTask$0(ThreadLeakControl.java:850)
at java.base/java.lang.Thread.run(Thread.java:1583)
FAILED: org.apache.solr.hdfs.cloud.MoveReplicaHdfsFailoverTest.testDataDirAndUlogAreMaintained
Error Message:
java.lang.AssertionError: expected:<1> but was:<0>
Stack Trace:
java.lang.AssertionError: expected:<1> but was:<0>
at __randomizedtesting.SeedInfo.seed([B45BFE396F5997BB:9B686BEAD3292599]:0)
at org.junit.Assert.fail(Assert.java:89)
at org.junit.Assert.failNotEquals(Assert.java:835)
at org.junit.Assert.assertEquals(Assert.java:647)
at org.junit.Assert.assertEquals(Assert.java:633)
at org.apache.solr.hdfs.cloud.MoveReplicaHdfsFailoverTest.testDataDirAndUlogAreMaintained(MoveReplicaHdfsFailoverTest.java:113)
at java.base/jdk.internal.reflect.DirectMethodHandleAccessor.invoke(DirectMethodHandleAccessor.java:103)
at java.base/java.lang.reflect.Method.invoke(Method.java:580)
at com.carrotsearch.randomizedtesting.RandomizedRunner.invoke(RandomizedRunner.java:1758)
at com.carrotsearch.randomizedtesting.RandomizedRunner$8.evaluate(RandomizedRunner.java:946)
at com.carrotsearch.randomizedtesting.RandomizedRunner$9.evaluate(RandomizedRunner.java:982)
at com.carrotsearch.randomizedtesting.RandomizedRunner$10.evaluate(RandomizedRunner.java:996)
at com.carrotsearch.randomizedtesting.rules.SystemPropertiesRestoreRule$1.evaluate(SystemPropertiesRestoreRule.java:80)
at org.junit.rules.RunRules.evaluate(RunRules.java:20)
at org.apache.lucene.tests.util.TestRuleSetupTeardownChained$1.evaluate(TestRuleSetupTeardownChained.java:48)
at org.apache.lucene.tests.util.AbstractBeforeAfterRule$1.evaluate(AbstractBeforeAfterRule.java:43)
at org.apache.lucene.tests.util.TestRuleThreadAndTestName$1.evaluate(TestRuleThreadAndTestName.java:45)
at org.apache.lucene.tests.util.TestRuleIgnoreAfterMaxFailures$1.evaluate(TestRuleIgnoreAfterMaxFailures.java:60)
at org.apache.lucene.tests.util.TestRuleMarkFailure$1.evaluate(TestRuleMarkFailure.java:44)
at org.junit.rules.RunRules.evaluate(RunRules.java:20)
at com.carrotsearch.randomizedtesting.rules.StatementAdapter.evaluate(StatementAdapter.java:36)
at com.carrotsearch.randomizedtesting.ThreadLeakControl$StatementRunner.run(ThreadLeakControl.java:390)
at com.carrotsearch.randomizedtesting.ThreadLeakControl.forkTimeoutingTask(ThreadLeakControl.java:843)
at com.carrotsearch.randomizedtesting.ThreadLeakControl$3.evaluate(ThreadLeakControl.java:490)
at com.carrotsearch.randomizedtesting.RandomizedRunner.runSingleTest(RandomizedRunner.java:955)
at com.carrotsearch.randomizedtesting.RandomizedRunner$5.evaluate(RandomizedRunner.java:840)
at com.carrotsearch.randomizedtesting.RandomizedRunner$6.evaluate(RandomizedRunner.java:891)
at com.carrotsearch.randomizedtesting.RandomizedRunner$7.evaluate(RandomizedRunner.java:902)
at com.carrotsearch.randomizedtesting.rules.StatementAdapter.evaluate(StatementAdapter.java:36)
at com.carrotsearch.randomizedtesting.rules.StatementAdapter.evaluate(StatementAdapter.java:36)
at org.apache.lucene.tests.util.AbstractBeforeAfterRule$1.evaluate(AbstractBeforeAfterRule.java:43)
at com.carrotsearch.randomizedtesting.rules.SystemPropertiesRestoreRule$1.evaluate(SystemPropertiesRestoreRule.java:80)
at org.junit.rules.RunRules.evaluate(RunRules.java:20)
at org.apache.lucene.tests.util.AbstractBeforeAfterRule$1.evaluate(AbstractBeforeAfterRule.java:43)
at com.carrotsearch.randomizedtesting.rules.StatementAdapter.evaluate(StatementAdapter.java:36)
at org.apache.lucene.tests.util.TestRuleStoreClassName$1.evaluate(TestRuleStoreClassName.java:38)
at com.carrotsearch.randomizedtesting.rules.NoShadowingOrOverridesOnMethodsRule$1.evaluate(NoShadowingOrOverridesOnMethodsRule.java:40)
at com.carrotsearch.randomizedtesting.rules.NoShadowingOrOverridesOnMethodsRule$1.evaluate(NoShadowingOrOverridesOnMethodsRule.java:40)
at com.carrotsearch.randomizedtesting.rules.StatementAdapter.evaluate(StatementAdapter.java:36)
at com.carrotsearch.randomizedtesting.rules.StatementAdapter.evaluate(StatementAdapter.java:36)
at org.apache.lucene.tests.util.TestRuleAssertionsRequired$1.evaluate(TestRuleAssertionsRequired.java:53)
at org.apache.lucene.tests.util.AbstractBeforeAfterRule$1.evaluate(AbstractBeforeAfterRule.java:43)
at org.apache.lucene.tests.util.TestRuleMarkFailure$1.evaluate(TestRuleMarkFailure.java:44)
at org.apache.lucene.tests.util.TestRuleIgnoreAfterMaxFailures$1.evaluate(TestRuleIgnoreAfterMaxFailures.java:60)
at org.apache.lucene.tests.util.TestRuleIgnoreTestSuites$1.evaluate(TestRuleIgnoreTestSuites.java:47)
at org.junit.rules.RunRules.evaluate(RunRules.java:20)
at com.carrotsearch.randomizedtesting.rules.StatementAdapter.evaluate(StatementAdapter.java:36)
at com.carrotsearch.randomizedtesting.ThreadLeakControl$StatementRunner.run(ThreadLeakControl.java:390)
at com.carrotsearch.randomizedtesting.ThreadLeakControl.lambda$forkTimeoutingTask$0(ThreadLeakControl.java:850)
at java.base/java.lang.Thread.run(Thread.java:1583)
FAILED: org.apache.solr.hdfs.cloud.MoveReplicaHdfsFailoverTest.testDataDirAndUlogAreMaintained
Error Message:
java.lang.AssertionError: expected:<1> but was:<0>
Stack Trace:
java.lang.AssertionError: expected:<1> but was:<0>
at __randomizedtesting.SeedInfo.seed([B45BFE396F5997BB:9B686BEAD3292599]:0)
at org.junit.Assert.fail(Assert.java:89)
at org.junit.Assert.failNotEquals(Assert.java:835)
at org.junit.Assert.assertEquals(Assert.java:647)
at org.junit.Assert.assertEquals(Assert.java:633)
at org.apache.solr.hdfs.cloud.MoveReplicaHdfsFailoverTest.testDataDirAndUlogAreMaintained(MoveReplicaHdfsFailoverTest.java:113)
at java.base/jdk.internal.reflect.DirectMethodHandleAccessor.invoke(DirectMethodHandleAccessor.java:103)
at java.base/java.lang.reflect.Method.invoke(Method.java:580)
at com.carrotsearch.randomizedtesting.RandomizedRunner.invoke(RandomizedRunner.java:1758)
at com.carrotsearch.randomizedtesting.RandomizedRunner$8.evaluate(RandomizedRunner.java:946)
at com.carrotsearch.randomizedtesting.RandomizedRunner$9.evaluate(RandomizedRunner.java:982)
at com.carrotsearch.randomizedtesting.RandomizedRunner$10.evaluate(RandomizedRunner.java:996)
at com.carrotsearch.randomizedtesting.rules.SystemPropertiesRestoreRule$1.evaluate(SystemPropertiesRestoreRule.java:80)
at org.junit.rules.RunRules.evaluate(RunRules.java:20)
at org.apache.lucene.tests.util.TestRuleSetupTeardownChained$1.evaluate(TestRuleSetupTeardownChained.java:48)
at org.apache.lucene.tests.util.AbstractBeforeAfterRule$1.evaluate(AbstractBeforeAfterRule.java:43)
at org.apache.lucene.tests.util.TestRuleThreadAndTestName$1.evaluate(TestRuleThreadAndTestName.java:45)
at org.apache.lucene.tests.util.TestRuleIgnoreAfterMaxFailures$1.evaluate(TestRuleIgnoreAfterMaxFailures.java:60)
at org.apache.lucene.tests.util.TestRuleMarkFailure$1.evaluate(TestRuleMarkFailure.java:44)
at org.junit.rules.RunRules.evaluate(RunRules.java:20)
at com.carrotsearch.randomizedtesting.rules.StatementAdapter.evaluate(StatementAdapter.java:36)
at com.carrotsearch.randomizedtesting.ThreadLeakControl$StatementRunner.run(ThreadLeakControl.java:390)
at com.carrotsearch.randomizedtesting.ThreadLeakControl.forkTimeoutingTask(ThreadLeakControl.java:843)
at com.carrotsearch.randomizedtesting.ThreadLeakControl$3.evaluate(ThreadLeakControl.java:490)
at com.carrotsearch.randomizedtesting.RandomizedRunner.runSingleTest(RandomizedRunner.java:955)
at com.carrotsearch.randomizedtesting.RandomizedRunner$5.evaluate(RandomizedRunner.java:840)
at com.carrotsearch.randomizedtesting.RandomizedRunner$6.evaluate(RandomizedRunner.java:891)
at com.carrotsearch.randomizedtesting.RandomizedRunner$7.evaluate(RandomizedRunner.java:902)
at com.carrotsearch.randomizedtesting.rules.StatementAdapter.evaluate(StatementAdapter.java:36)
at com.carrotsearch.randomizedtesting.rules.StatementAdapter.evaluate(StatementAdapter.java:36)
at org.apache.lucene.tests.util.AbstractBeforeAfterRule$1.evaluate(AbstractBeforeAfterRule.java:43)
at com.carrotsearch.randomizedtesting.rules.SystemPropertiesRestoreRule$1.evaluate(SystemPropertiesRestoreRule.java:80)
at org.junit.rules.RunRules.evaluate(RunRules.java:20)
at org.apache.lucene.tests.util.AbstractBeforeAfterRule$1.evaluate(AbstractBeforeAfterRule.java:43)
at com.carrotsearch.randomizedtesting.rules.StatementAdapter.evaluate(StatementAdapter.java:36)
at org.apache.lucene.tests.util.TestRuleStoreClassName$1.evaluate(TestRuleStoreClassName.java:38)
at com.carrotsearch.randomizedtesting.rules.NoShadowingOrOverridesOnMethodsRule$1.evaluate(NoShadowingOrOverridesOnMethodsRule.java:40)
at com.carrotsearch.randomizedtesting.rules.NoShadowingOrOverridesOnMethodsRule$1.evaluate(NoShadowingOrOverridesOnMethodsRule.java:40)
at com.carrotsearch.randomizedtesting.rules.StatementAdapter.evaluate(StatementAdapter.java:36)
at com.carrotsearch.randomizedtesting.rules.StatementAdapter.evaluate(StatementAdapter.java:36)
at org.apache.lucene.tests.util.TestRuleAssertionsRequired$1.evaluate(TestRuleAssertionsRequired.java:53)
at org.apache.lucene.tests.util.AbstractBeforeAfterRule$1.evaluate(AbstractBeforeAfterRule.java:43)
at org.apache.lucene.tests.util.TestRuleMarkFailure$1.evaluate(TestRuleMarkFailure.java:44)
at org.apache.lucene.tests.util.TestRuleIgnoreAfterMaxFailures$1.evaluate(TestRuleIgnoreAfterMaxFailures.java:60)
at org.apache.lucene.tests.util.TestRuleIgnoreTestSuites$1.evaluate(TestRuleIgnoreTestSuites.java:47)
at org.junit.rules.RunRules.evaluate(RunRules.java:20)
at com.carrotsearch.randomizedtesting.rules.StatementAdapter.evaluate(StatementAdapter.java:36)
at com.carrotsearch.randomizedtesting.ThreadLeakControl$StatementRunner.run(ThreadLeakControl.java:390)
at com.carrotsearch.randomizedtesting.ThreadLeakControl.lambda$forkTimeoutingTask$0(ThreadLeakControl.java:850)
at java.base/java.lang.Thread.run(Thread.java:1583)
FAILED: org.apache.solr.hdfs.cloud.MoveReplicaHdfsFailoverTest.testDataDirAndUlogAreMaintained
Error Message:
java.lang.AssertionError: expected:<1> but was:<0>
Stack Trace:
java.lang.AssertionError: expected:<1> but was:<0>
at __randomizedtesting.SeedInfo.seed([B45BFE396F5997BB:9B686BEAD3292599]:0)
at org.junit.Assert.fail(Assert.java:89)
at org.junit.Assert.failNotEquals(Assert.java:835)
at org.junit.Assert.assertEquals(Assert.java:647)
at org.junit.Assert.assertEquals(Assert.java:633)
at org.apache.solr.hdfs.cloud.MoveReplicaHdfsFailoverTest.testDataDirAndUlogAreMaintained(MoveReplicaHdfsFailoverTest.java:113)
at java.base/jdk.internal.reflect.DirectMethodHandleAccessor.invoke(DirectMethodHandleAccessor.java:103)
at java.base/java.lang.reflect.Method.invoke(Method.java:580)
at com.carrotsearch.randomizedtesting.RandomizedRunner.invoke(RandomizedRunner.java:1758)
at com.carrotsearch.randomizedtesting.RandomizedRunner$8.evaluate(RandomizedRunner.java:946)
at com.carrotsearch.randomizedtesting.RandomizedRunner$9.evaluate(RandomizedRunner.java:982)
at com.carrotsearch.randomizedtesting.RandomizedRunner$10.evaluate(RandomizedRunner.java:996)
at com.carrotsearch.randomizedtesting.rules.SystemPropertiesRestoreRule$1.evaluate(SystemPropertiesRestoreRule.java:80)
at org.junit.rules.RunRules.evaluate(RunRules.java:20)
at org.apache.lucene.tests.util.TestRuleSetupTeardownChained$1.evaluate(TestRuleSetupTeardownChained.java:48)
at org.apache.lucene.tests.util.AbstractBeforeAfterRule$1.evaluate(AbstractBeforeAfterRule.java:43)
at org.apache.lucene.tests.util.TestRuleThreadAndTestName$1.evaluate(TestRuleThreadAndTestName.java:45)
at org.apache.lucene.tests.util.TestRuleIgnoreAfterMaxFailures$1.evaluate(TestRuleIgnoreAfterMaxFailures.java:60)
at org.apache.lucene.tests.util.TestRuleMarkFailure$1.evaluate(TestRuleMarkFailure.java:44)
at org.junit.rules.RunRules.evaluate(RunRules.java:20)
at com.carrotsearch.randomizedtesting.rules.StatementAdapter.evaluate(StatementAdapter.java:36)
at com.carrotsearch.randomizedtesting.ThreadLeakControl$StatementRunner.run(ThreadLeakControl.java:390)
at com.carrotsearch.randomizedtesting.ThreadLeakControl.forkTimeoutingTask(ThreadLeakControl.java:843)
at com.carrotsearch.randomizedtesting.ThreadLeakControl$3.evaluate(ThreadLeakControl.java:490)
at com.carrotsearch.randomizedtesting.RandomizedRunner.runSingleTest(RandomizedRunner.java:955)
at com.carrotsearch.randomizedtesting.RandomizedRunner$5.evaluate(RandomizedRunner.java:840)
at com.carrotsearch.randomizedtesting.RandomizedRunner$6.evaluate(RandomizedRunner.java:891)
at com.carrotsearch.randomizedtesting.RandomizedRunner$7.evaluate(RandomizedRunner.java:902)
at com.carrotsearch.randomizedtesting.rules.StatementAdapter.evaluate(StatementAdapter.java:36)
at com.carrotsearch.randomizedtesting.rules.StatementAdapter.evaluate(StatementAdapter.java:36)
at org.apache.lucene.tests.util.AbstractBeforeAfterRule$1.evaluate(AbstractBeforeAfterRule.java:43)
at com.carrotsearch.randomizedtesting.rules.SystemPropertiesRestoreRule$1.evaluate(SystemPropertiesRestoreRule.java:80)
at org.junit.rules.RunRules.evaluate(RunRules.java:20)
at org.apache.lucene.tests.util.AbstractBeforeAfterRule$1.evaluate(AbstractBeforeAfterRule.java:43)
at com.carrotsearch.randomizedtesting.rules.StatementAdapter.evaluate(StatementAdapter.java:36)
at org.apache.lucene.tests.util.TestRuleStoreClassName$1.evaluate(TestRuleStoreClassName.java:38)
at com.carrotsearch.randomizedtesting.rules.NoShadowingOrOverridesOnMethodsRule$1.evaluate(NoShadowingOrOverridesOnMethodsRule.java:40)
at com.carrotsearch.randomizedtesting.rules.NoShadowingOrOverridesOnMethodsRule$1.evaluate(NoShadowingOrOverridesOnMethodsRule.java:40)
at com.carrotsearch.randomizedtesting.rules.StatementAdapter.evaluate(StatementAdapter.java:36)
at com.carrotsearch.randomizedtesting.rules.StatementAdapter.evaluate(StatementAdapter.java:36)
at org.apache.lucene.tests.util.TestRuleAssertionsRequired$1.evaluate(TestRuleAssertionsRequired.java:53)
at org.apache.lucene.tests.util.AbstractBeforeAfterRule$1.evaluate(AbstractBeforeAfterRule.java:43)
at org.apache.lucene.tests.util.TestRuleMarkFailure$1.evaluate(TestRuleMarkFailure.java:44)
at org.apache.lucene.tests.util.TestRuleIgnoreAfterMaxFailures$1.evaluate(TestRuleIgnoreAfterMaxFailures.java:60)
at org.apache.lucene.tests.util.TestRuleIgnoreTestSuites$1.evaluate(TestRuleIgnoreTestSuites.java:47)
at org.junit.rules.RunRules.evaluate(RunRules.java:20)
at com.carrotsearch.randomizedtesting.rules.StatementAdapter.evaluate(StatementAdapter.java:36)
at com.carrotsearch.randomizedtesting.ThreadLeakControl$StatementRunner.run(ThreadLeakControl.java:390)
at com.carrotsearch.randomizedtesting.ThreadLeakControl.lambda$forkTimeoutingTask$0(ThreadLeakControl.java:850)
at java.base/java.lang.Thread.run(Thread.java:1583)
FAILED: org.apache.solr.hdfs.cloud.MoveReplicaHdfsFailoverTest.testDataDirAndUlogAreMaintained
Error Message:
java.lang.AssertionError: expected:<1> but was:<0>
Stack Trace:
java.lang.AssertionError: expected:<1> but was:<0>
at __randomizedtesting.SeedInfo.seed([B45BFE396F5997BB:9B686BEAD3292599]:0)
at org.junit.Assert.fail(Assert.java:89)
at org.junit.Assert.failNotEquals(Assert.java:835)
at org.junit.Assert.assertEquals(Assert.java:647)
at org.junit.Assert.assertEquals(Assert.java:633)
at org.apache.solr.hdfs.cloud.MoveReplicaHdfsFailoverTest.testDataDirAndUlogAreMaintained(MoveReplicaHdfsFailoverTest.java:113)
at java.base/jdk.internal.reflect.DirectMethodHandleAccessor.invoke(DirectMethodHandleAccessor.java:103)
at java.base/java.lang.reflect.Method.invoke(Method.java:580)
at com.carrotsearch.randomizedtesting.RandomizedRunner.invoke(RandomizedRunner.java:1758)
at com.carrotsearch.randomizedtesting.RandomizedRunner$8.evaluate(RandomizedRunner.java:946)
at com.carrotsearch.randomizedtesting.RandomizedRunner$9.evaluate(RandomizedRunner.java:982)
at com.carrotsearch.randomizedtesting.RandomizedRunner$10.evaluate(RandomizedRunner.java:996)
at com.carrotsearch.randomizedtesting.rules.SystemPropertiesRestoreRule$1.evaluate(SystemPropertiesRestoreRule.java:80)
at org.junit.rules.RunRules.evaluate(RunRules.java:20)
at org.apache.lucene.tests.util.TestRuleSetupTeardownChained$1.evaluate(TestRuleSetupTeardownChained.java:48)
at org.apache.lucene.tests.util.AbstractBeforeAfterRule$1.evaluate(AbstractBeforeAfterRule.java:43)
at org.apache.lucene.tests.util.TestRuleThreadAndTestName$1.evaluate(TestRuleThreadAndTestName.java:45)
at org.apache.lucene.tests.util.TestRuleIgnoreAfterMaxFailures$1.evaluate(TestRuleIgnoreAfterMaxFailures.java:60)
at org.apache.lucene.tests.util.TestRuleMarkFailure$1.evaluate(TestRuleMarkFailure.java:44)
at org.junit.rules.RunRules.evaluate(RunRules.java:20)
at com.carrotsearch.randomizedtesting.rules.StatementAdapter.evaluate(StatementAdapter.java:36)
at com.carrotsearch.randomizedtesting.ThreadLeakControl$StatementRunner.run(ThreadLeakControl.java:390)
at com.carrotsearch.randomizedtesting.ThreadLeakControl.forkTimeoutingTask(ThreadLeakControl.java:843)
at com.carrotsearch.randomizedtesting.ThreadLeakControl$3.evaluate(ThreadLeakControl.java:490)
at com.carrotsearch.randomizedtesting.RandomizedRunner.runSingleTest(RandomizedRunner.java:955)
at com.carrotsearch.randomizedtesting.RandomizedRunner$5.evaluate(RandomizedRunner.java:840)
at com.carrotsearch.randomizedtesting.RandomizedRunner$6.evaluate(RandomizedRunner.java:891)
at com.carrotsearch.randomizedtesting.RandomizedRunner$7.evaluate(RandomizedRunner.java:902)
at com.carrotsearch.randomizedtesting.rules.StatementAdapter.evaluate(StatementAdapter.java:36)
at com.carrotsearch.randomizedtesting.rules.StatementAdapter.evaluate(StatementAdapter.java:36)
at org.apache.lucene.tests.util.AbstractBeforeAfterRule$1.evaluate(AbstractBeforeAfterRule.java:43)
at com.carrotsearch.randomizedtesting.rules.SystemPropertiesRestoreRule$1.evaluate(SystemPropertiesRestoreRule.java:80)
at org.junit.rules.RunRules.evaluate(RunRules.java:20)
at org.apache.lucene.tests.util.AbstractBeforeAfterRule$1.evaluate(AbstractBeforeAfterRule.java:43)
at com.carrotsearch.randomizedtesting.rules.StatementAdapter.evaluate(StatementAdapter.java:36)
at org.apache.lucene.tests.util.TestRuleStoreClassName$1.evaluate(TestRuleStoreClassName.java:38)
at com.carrotsearch.randomizedtesting.rules.NoShadowingOrOverridesOnMethodsRule$1.evaluate(NoShadowingOrOverridesOnMethodsRule.java:40)
at com.carrotsearch.randomizedtesting.rules.NoShadowingOrOverridesOnMethodsRule$1.evaluate(NoShadowingOrOverridesOnMethodsRule.java:40)
at com.carrotsearch.randomizedtesting.rules.StatementAdapter.evaluate(StatementAdapter.java:36)
at com.carrotsearch.randomizedtesting.rules.StatementAdapter.evaluate(StatementAdapter.java:36)
at org.apache.lucene.tests.util.TestRuleAssertionsRequired$1.evaluate(TestRuleAssertionsRequired.java:53)
at org.apache.lucene.tests.util.AbstractBeforeAfterRule$1.evaluate(AbstractBeforeAfterRule.java:43)
at org.apache.lucene.tests.util.TestRuleMarkFailure$1.evaluate(TestRuleMarkFailure.java:44)
at org.apache.lucene.tests.util.TestRuleIgnoreAfterMaxFailures$1.evaluate(TestRuleIgnoreAfterMaxFailures.java:60)
at org.apache.lucene.tests.util.TestRuleIgnoreTestSuites$1.evaluate(TestRuleIgnoreTestSuites.java:47)
at org.junit.rules.RunRules.evaluate(RunRules.java:20)
at com.carrotsearch.randomizedtesting.rules.StatementAdapter.evaluate(StatementAdapter.java:36)
at com.carrotsearch.randomizedtesting.ThreadLeakControl$StatementRunner.run(ThreadLeakControl.java:390)
at com.carrotsearch.randomizedtesting.ThreadLeakControl.lambda$forkTimeoutingTask$0(ThreadLeakControl.java:850)
at java.base/java.lang.Thread.run(Thread.java:1583)
Build Log:
[...truncated 211 lines...]
2> ERROR: Cannot run program "/home/jenkins/jenkins-slave/workspace/Solr/Solr-NightlyTests-main/solr/core/build/tmp/tests-tmp/org.apache.solr.cli.TestSolrCLIRunExample_B45BFE396F5997BB-001/tempDir-001/failExecuteScript" (in directory "."): error=13, Permission denied
2>
2> 129528 WARN (ZkTestServer Run Thread) [n: c: s: r: x: t:] o.a.z.s.ServerCnxnFactory maxCnxns is not configured, using default value 0.
2> 129922 WARN (TEST-TestSolrCLIRunExample.testInteractiveSolrCloudExample-seed#[B45BFE396F5997BB]) [n: c: s: r: x: t:] o.a.s.c.c.SolrZkClient Using default ZkCredentialsInjector. ZkCredentialsInjector is not secure, it creates an empty list of credentials which leads to 'OPEN_ACL_UNSAFE' ACLs to Zookeeper nodes
2> 129922 WARN (TEST-TestSolrCLIRunExample.testInteractiveSolrCloudExample-seed#[B45BFE396F5997BB]) [n: c: s: r: x: t:] o.a.s.c.c.SolrZkClient Using default ZkACLProvider. DefaultZkACLProvider is not secure, it creates 'OPEN_ACL_UNSAFE' ACLs to Zookeeper nodes
2> 129927 WARN (TEST-TestSolrCLIRunExample.testInteractiveSolrCloudExample-seed#[B45BFE396F5997BB]) [n: c: s: r: x: t:] o.a.s.c.c.SolrZkClient Using default ZkCredentialsInjector. ZkCredentialsInjector is not secure, it creates an empty list of credentials which leads to 'OPEN_ACL_UNSAFE' ACLs to Zookeeper nodes
2> 129927 WARN (TEST-TestSolrCLIRunExample.testInteractiveSolrCloudExample-seed#[B45BFE396F5997BB]) [n: c: s: r: x: t:] o.a.s.c.c.SolrZkClient Using default ZkACLProvider. DefaultZkACLProvider is not secure, it creates 'OPEN_ACL_UNSAFE' ACLs to Zookeeper nodes
2> 129932 WARN (TEST-TestSolrCLIRunExample.testInteractiveSolrCloudExample-seed#[B45BFE396F5997BB]) [n: c: s: r: x: t:] o.a.s.c.c.SolrZkClient Using default ZkCredentialsInjector. ZkCredentialsInjector is not secure, it creates an empty list of credentials which leads to 'OPEN_ACL_UNSAFE' ACLs to Zookeeper nodes
2> 129932 WARN (TEST-TestSolrCLIRunExample.testInteractiveSolrCloudExample-seed#[B45BFE396F5997BB]) [n: c: s: r: x: t:] o.a.s.c.c.SolrZkClient Using default ZkACLProvider. DefaultZkACLProvider is not secure, it creates 'OPEN_ACL_UNSAFE' ACLs to Zookeeper nodes
2> 130138 INFO (jetty-launcher-709-thread-1) [n: c: s: r: x: t:] o.e.j.s.Server jetty-10.0.22; built: 2024-06-27T16:03:51.502Z; git: 5c8471e852d377fd726ad9b1692c35ffc5febb09; jvm 21.0.3+9-LTS
2> 130145 INFO (jetty-launcher-709-thread-1) [n: c: s: r: x: t:] o.e.j.s.s.DefaultSessionIdManager Session workerName=node0
2> 130146 WARN (jetty-launcher-709-thread-1) [n: c: s: r: x: t:] o.a.s.c.c.SolrZkClient Using default ZkCredentialsInjector. ZkCredentialsInjector is not secure, it creates an empty list of credentials which leads to 'OPEN_ACL_UNSAFE' ACLs to Zookeeper nodes
2> 130146 WARN (jetty-launcher-709-thread-1) [n: c: s: r: x: t:] o.a.s.c.c.SolrZkClient Using default ZkACLProvider. DefaultZkACLProvider is not secure, it creates 'OPEN_ACL_UNSAFE' ACLs to Zookeeper nodes
2> 131695 WARN (jetty-launcher-709-thread-1) [n: c: s: r: x: t:] o.a.s.c.c.SolrZkClient Using default ZkCredentialsInjector. ZkCredentialsInjector is not secure, it creates an empty list of credentials which leads to 'OPEN_ACL_UNSAFE' ACLs to Zookeeper nodes
2> 131695 WARN (jetty-launcher-709-thread-1) [n: c: s: r: x: t:] o.a.s.c.c.SolrZkClient Using default ZkACLProvider. DefaultZkACLProvider is not secure, it creates 'OPEN_ACL_UNSAFE' ACLs to Zookeeper nodes
2> 131894 WARN (jetty-launcher-709-thread-1) [n:localhost:46169_solr c: s: r: x: t:] o.a.s.c.c.SolrZkClient Using default ZkCredentialsInjector. ZkCredentialsInjector is not secure, it creates an empty list of credentials which leads to 'OPEN_ACL_UNSAFE' ACLs to Zookeeper nodes
2> 131983 WARN (jetty-launcher-709-thread-1) [n:localhost:46169_solr c: s: r: x: t:] o.a.s.c.ZkController Contents of zookeeper /security.json are world-readable; consider setting up ACLs as described in https://solr.apache.org/guide/solr/latest/deployment-guide/zookeeper-access-control.html
2> 132071 WARN (jetty-launcher-709-thread-1) [n:localhost:46169_solr c: s: r: x: t:] o.a.s.c.CoreContainer Not all security plugins configured! authentication=disabled authorization=disabled. Solr is only as secure as you make it. Consider configuring authentication/authorization before exposing Solr to users internal or external. See https://s.apache.org/solrsecurity for more info
2> 132300 INFO (jetty-launcher-709-thread-1) [n:localhost:46169_solr c: s: r: x: t:] o.e.j.s.h.ContextHandler Started o.e.j.s.ServletContextHandler@5c4bb7c2{/solr,file:///home/jenkins/jenkins-slave/workspace/Solr/Solr-NightlyTests-main/solr/core/build/tmp/tests-cwd/,AVAILABLE}
2> 132300 INFO (jetty-launcher-709-thread-1) [n:localhost:46169_solr c: s: r: x: t:] o.e.j.s.AbstractConnector Started ServerConnector@7a5d9308{HTTP/1.1, (http/1.1, h2c)}{127.0.0.1:46169}
2> 132300 INFO (jetty-launcher-709-thread-1) [n:localhost:46169_solr c: s: r: x: t:] o.e.j.s.Server Started Server@57838adb{STARTING}[10.0.22,sto=0] @132335ms
2> 132302 WARN (TEST-TestSolrCLIRunExample.testInteractiveSolrCloudExample-seed#[B45BFE396F5997BB]) [n: c: s: r: x: t:] o.a.s.c.c.SolrZkClient Using default ZkCredentialsInjector. ZkCredentialsInjector is not secure, it creates an empty list of credentials which leads to 'OPEN_ACL_UNSAFE' ACLs to Zookeeper nodes
2> 132302 WARN (TEST-TestSolrCLIRunExample.testInteractiveSolrCloudExample-seed#[B45BFE396F5997BB]) [n: c: s: r: x: t:] o.a.s.c.c.SolrZkClient Using default ZkACLProvider. DefaultZkACLProvider is not secure, it creates 'OPEN_ACL_UNSAFE' ACLs to Zookeeper nodes
2> 132365 WARN (TEST-TestSolrCLIRunExample.testInteractiveSolrCloudExample-seed#[B45BFE396F5997BB]) [n: c: s: r: x: t:] o.a.s.c.c.SolrZkClient Using default ZkCredentialsInjector. ZkCredentialsInjector is not secure, it creates an empty list of credentials which leads to 'OPEN_ACL_UNSAFE' ACLs to Zookeeper nodes
2> 132366 WARN (TEST-TestSolrCLIRunExample.testInteractiveSolrCloudExample-seed#[B45BFE396F5997BB]) [n: c: s: r: x: t:] o.a.s.c.c.SolrZkClient Using default ZkACLProvider. DefaultZkACLProvider is not secure, it creates 'OPEN_ACL_UNSAFE' ACLs to Zookeeper nodes
2> 132545 WARN (TEST-TestSolrCLIRunExample.testInteractiveSolrCloudExample-seed#[B45BFE396F5997BB]) [n: c: s: r: x: t:] o.a.s.c.c.SolrZkClient Using default ZkCredentialsInjector. ZkCredentialsInjector is not secure, it creates an empty list of credentials which leads to 'OPEN_ACL_UNSAFE' ACLs to Zookeeper nodes
2> 132545 WARN (TEST-TestSolrCLIRunExample.testInteractiveSolrCloudExample-seed#[B45BFE396F5997BB]) [n: c: s: r: x: t:] o.a.s.c.c.SolrZkClient Using default ZkACLProvider. DefaultZkACLProvider is not secure, it creates 'OPEN_ACL_UNSAFE' ACLs to Zookeeper nodes
2> 132744 WARN (OverseerThreadFactory-734-thread-1) [n: c:testCloudExamplePrompt s: r: x: t:null-128] o.a.s.c.a.c.CreateCollectionCmd Specified number of replicas of 2 on collection testCloudExamplePrompt is higher than the number of Solr instances currently live or live and part of your createNodeSet(1). It's unusual to run two replica of the same slice on the same Solr-instance.
2> 134822 WARN (TEST-TestSolrCLIRunExample.testInteractiveSolrCloudExample-seed#[B45BFE396F5997BB]) [n: c: s: r: x: t:] o.a.s.c.c.SolrZkClient Using default ZkCredentialsInjector. ZkCredentialsInjector is not secure, it creates an empty list of credentials which leads to 'OPEN_ACL_UNSAFE' ACLs to Zookeeper nodes
2> 134822 WARN (TEST-TestSolrCLIRunExample.testInteractiveSolrCloudExample-seed#[B45BFE396F5997BB]) [n: c: s: r: x: t:] o.a.s.c.c.SolrZkClient Using default ZkACLProvider. DefaultZkACLProvider is not secure, it creates 'OPEN_ACL_UNSAFE' ACLs to Zookeeper nodes
2> WARNING: URLs provided to this tool needn't include Solr's context-root (e.g. "/solr"). Such URLs are deprecated and support for them will be removed in a future release. Correcting from [http://localhost:46169/solr] to [http://localhost:46169/].
2> WARNING: URLs provided to this tool needn't include Solr's context-root (e.g. "/solr"). Such URLs are deprecated and support for them will be removed in a future release. Correcting from [http://localhost:46169/solr] to [http://localhost:46169/].
2> 135532 WARN (TEST-TestSolrCLIRunExample.testInteractiveSolrCloudExample-seed#[B45BFE396F5997BB]) [n: c: s: r: x: t:] o.a.s.c.c.SolrZkClient Using default ZkCredentialsInjector. ZkCredentialsInjector is not secure, it creates an empty list of credentials which leads to 'OPEN_ACL_UNSAFE' ACLs to Zookeeper nodes
2> 135532 WARN (TEST-TestSolrCLIRunExample.testInteractiveSolrCloudExample-seed#[B45BFE396F5997BB]) [n: c: s: r: x: t:] o.a.s.c.c.SolrZkClient Using default ZkACLProvider. DefaultZkACLProvider is not secure, it creates 'OPEN_ACL_UNSAFE' ACLs to Zookeeper nodes
2> 135654 WARN (zkCallback-727-thread-1) [n: c: s: r: x: t:] o.a.s.c.LeaderElector Our node is no longer in line to be leader
2> 136132 INFO (jetty-closer-802-thread-1) [n: c: s: r: x: t:] o.e.j.s.Server Stopped Server@57838adb{STOPPING}[10.0.22,sto=0]
2> 136133 INFO (jetty-closer-802-thread-1) [n: c: s: r: x: t:] o.e.j.s.AbstractConnector Stopped ServerConnector@7a5d9308{HTTP/1.1, (http/1.1, h2c)}{127.0.0.1:46169}
2> 136291 INFO (jetty-closer-802-thread-1) [n: c: s: r: x: t:] o.e.j.s.h.ContextHandler Stopped o.e.j.s.ServletContextHandler@5c4bb7c2{/solr,file:///home/jenkins/jenkins-slave/workspace/Solr/Solr-NightlyTests-main/solr/core/build/tmp/tests-cwd/,STOPPED}
2> 136497 WARN (ZkTestServer Run Thread) [n: c: s: r: x: t:] o.a.s.c.ZkTestServer Watch limit violations:
2> Maximum concurrent create/delete watches above limit:
2>
2> 6 /solr/collections/testCloudExamplePrompt/terms/shard1
2> 6 /solr/clusterprops.json
2> 6 /solr/collections/testCloudExamplePrompt/terms/shard2
2> 6 /solr/aliases.json
2> 4 /solr/configs/testCloudExamplePrompt/managed-schema.xml
2>
2> Maximum concurrent data watches above limit:
2>
2> 21 /zookeeper/config
2> 9 /solr/collections/testCloudExamplePrompt/state.json
2>
2> Maximum concurrent children watches above limit:
2>
2> 27 /solr/overseer/queue
2> 12 /solr/collections
2> 9 /solr/overseer/collection-queue-work
2> 8 /solr/live_nodes
2> 4 /solr/collections/testCloudExamplePrompt/state.json
2>
2> 136519 WARN (ZkTestServer Run Thread) [n: c: s: r: x: t:] o.a.z.s.ServerCnxnFactory maxCnxns is not configured, using default value 0.
2> 136619 WARN (TEST-TestSolrCLIRunExample.testSchemalessExample-seed#[B45BFE396F5997BB]) [n: c: s: r: x: t:] o.a.s.c.c.SolrZkClient Using default ZkCredentialsInjector. ZkCredentialsInjector is not secure, it creates an empty list of credentials which leads to 'OPEN_ACL_UNSAFE' ACLs to Zookeeper nodes
2> 136619 WARN (TEST-TestSolrCLIRunExample.testSchemalessExample-seed#[B45BFE396F5997BB]) [n: c: s: r: x: t:] o.a.s.c.c.SolrZkClient Using default ZkACLProvider. DefaultZkACLProvider is not secure, it creates 'OPEN_ACL_UNSAFE' ACLs to Zookeeper nodes
2> 136623 WARN (TEST-TestSolrCLIRunExample.testSchemalessExample-seed#[B45BFE396F5997BB]) [n: c: s: r: x: t:] o.a.s.c.c.SolrZkClient Using default ZkCredentialsInjector. ZkCredentialsInjector is not secure, it creates an empty list of credentials which leads to 'OPEN_ACL_UNSAFE' ACLs to Zookeeper nodes
2> 136623 WARN (TEST-TestSolrCLIRunExample.testSchemalessExample-seed#[B45BFE396F5997BB]) [n: c: s: r: x: t:] o.a.s.c.c.SolrZkClient Using default ZkACLProvider. DefaultZkACLProvider is not secure, it creates 'OPEN_ACL_UNSAFE' ACLs to Zookeeper nodes
2> 136626 WARN (TEST-TestSolrCLIRunExample.testSchemalessExample-seed#[B45BFE396F5997BB]) [n: c: s: r: x: t:] o.a.s.c.c.SolrZkClient Using default ZkCredentialsInjector. ZkCredentialsInjector is not secure, it creates an empty list of credentials which leads to 'OPEN_ACL_UNSAFE' ACLs to Zookeeper nodes
2> 136626 WARN (TEST-TestSolrCLIRunExample.testSchemalessExample-seed#[B45BFE396F5997BB]) [n: c: s: r: x: t:] o.a.s.c.c.SolrZkClient Using default ZkACLProvider. DefaultZkACLProvider is not secure, it creates 'OPEN_ACL_UNSAFE' ACLs to Zookeeper nodes
2> 136804 INFO (jetty-launcher-816-thread-1) [n: c: s: r: x: t:] o.e.j.s.Server jetty-10.0.22; built: 2024-06-27T16:03:51.502Z; git: 5c8471e852d377fd726ad9b1692c35ffc5febb09; jvm 21.0.3+9-LTS
2> 136831 INFO (jetty-launcher-816-thread-1) [n: c: s: r: x: t:] o.e.j.s.s.DefaultSessionIdManager Session workerName=node0
2> 136832 WARN (jetty-launcher-816-thread-1) [n: c: s: r: x: t:] o.a.s.c.c.SolrZkClient Using default ZkCredentialsInjector. ZkCredentialsInjector is not secure, it creates an empty list of credentials which leads to 'OPEN_ACL_UNSAFE' ACLs to Zookeeper nodes
2> 136832 WARN (jetty-launcher-816-thread-1) [n: c: s: r: x: t:] o.a.s.c.c.SolrZkClient Using default ZkACLProvider. DefaultZkACLProvider is not secure, it creates 'OPEN_ACL_UNSAFE' ACLs to Zookeeper nodes
2> 139496 WARN (jetty-launcher-816-thread-1) [n: c: s: r: x: t:] o.a.s.c.c.SolrZkClient Using default ZkCredentialsInjector. ZkCredentialsInjector is not secure, it creates an empty list of credentials which leads to 'OPEN_ACL_UNSAFE' ACLs to Zookeeper nodes
2> 139496 WARN (jetty-launcher-816-thread-1) [n: c: s: r: x: t:] o.a.s.c.c.SolrZkClient Using default ZkACLProvider. DefaultZkACLProvider is not secure, it creates 'OPEN_ACL_UNSAFE' ACLs to Zookeeper nodes
2> 139601 WARN (jetty-launcher-816-thread-1) [n:localhost:45565_solr c: s: r: x: t:] o.a.s.c.c.SolrZkClient Using default ZkCredentialsInjector. ZkCredentialsInjector is not secure, it creates an empty list of credentials which leads to 'OPEN_ACL_UNSAFE' ACLs to Zookeeper nodes
2> 139630 WARN (jetty-launcher-816-thread-1) [n:localhost:45565_solr c: s: r: x: t:] o.a.s.c.ZkController Contents of zookeeper /security.json are world-readable; consider setting up ACLs as described in https://solr.apache.org/guide/solr/latest/deployment-guide/zookeeper-access-control.html
2> 139659 WARN (jetty-launcher-816-thread-1) [n:localhost:45565_solr c: s: r: x: t:] o.a.s.c.CoreContainer Not all security plugins configured! authentication=disabled authorization=disabled. Solr is only as secure as you make it. Consider configuring authentication/authorization before exposing Solr to users internal or external. See https://s.apache.org/solrsecurity for more info
2> 140024 INFO (jetty-launcher-816-thread-1) [n:localhost:45565_solr c: s: r: x: t:] o.e.j.s.h.ContextHandler Started o.e.j.s.ServletContextHandler@2bd8e0c1{/solr,file:///home/jenkins/jenkins-slave/workspace/Solr/Solr-NightlyTests-main/solr/core/build/tmp/tests-cwd/,AVAILABLE}
2> 140025 INFO (jetty-launcher-816-thread-1) [n:localhost:45565_solr c: s: r: x: t:] o.e.j.s.AbstractConnector Started ServerConnector@7925743d{HTTP/1.1, (http/1.1, h2c)}{127.0.0.1:45565}
2> 140025 INFO (jetty-launcher-816-thread-1) [n:localhost:45565_solr c: s: r: x: t:] o.e.j.s.Server Started Server@27e27f7d{STARTING}[10.0.22,sto=0] @140059ms
2> 140027 WARN (TEST-TestSolrCLIRunExample.testSchemalessExample-seed#[B45BFE396F5997BB]) [n: c: s: r: x: t:] o.a.s.c.c.SolrZkClient Using default ZkCredentialsInjector. ZkCredentialsInjector is not secure, it creates an empty list of credentials which leads to 'OPEN_ACL_UNSAFE' ACLs to Zookeeper nodes
2> 140027 WARN (TEST-TestSolrCLIRunExample.testSchemalessExample-seed#[B45BFE396F5997BB]) [n: c: s: r: x: t:] o.a.s.c.c.SolrZkClient Using default ZkACLProvider. DefaultZkACLProvider is not secure, it creates 'OPEN_ACL_UNSAFE' ACLs to Zookeeper nodes
2> WARNING: URLs provided to this tool needn't include Solr's context-root (e.g. "/solr"). Such URLs are deprecated and support for them will be removed in a future release. Correcting from [http://localhost:45565/solr] to [http://localhost:45565/].
2> 140354 WARN (TEST-TestSolrCLIRunExample.testSchemalessExample-seed#[B45BFE396F5997BB]) [n: c: s: r: x: t:] o.a.s.c.c.SolrZkClient Using default ZkCredentialsInjector. ZkCredentialsInjector is not secure, it creates an empty list of credentials which leads to 'OPEN_ACL_UNSAFE' ACLs to Zookeeper nodes
2> 140354 WARN (TEST-TestSolrCLIRunExample.testSchemalessExample-seed#[B45BFE396F5997BB]) [n: c: s: r: x: t:] o.a.s.c.c.SolrZkClient Using default ZkACLProvider. DefaultZkACLProvider is not secure, it creates 'OPEN_ACL_UNSAFE' ACLs to Zookeeper nodes
2> 141441 INFO (jetty-closer-869-thread-1) [n: c: s: r: x: t:] o.e.j.s.Server Stopped Server@27e27f7d{STOPPING}[10.0.22,sto=0]
2> 141442 INFO (jetty-closer-869-thread-1) [n: c: s: r: x: t:] o.e.j.s.AbstractConnector Stopped ServerConnector@7925743d{HTTP/1.1, (http/1.1, h2c)}{127.0.0.1:45565}
2> 141737 INFO (jetty-closer-869-thread-1) [n: c: s: r: x: t:] o.e.j.s.h.ContextHandler Stopped o.e.j.s.ServletContextHandler@2bd8e0c1{/solr,file:///home/jenkins/jenkins-slave/workspace/Solr/Solr-NightlyTests-main/solr/core/build/tmp/tests-cwd/,STOPPED}
2> 141944 WARN (ZkTestServer Run Thread) [n: c: s: r: x: t:] o.a.s.c.ZkTestServer Watch limit violations:
2> Maximum concurrent create/delete watches above limit:
2>
2> 3 /solr/aliases.json
2> 3 /solr/clusterprops.json
2> 2 /solr/collections/gettingstarted/terms/shard1
2>
2> Maximum concurrent data watches above limit:
2>
2> 14 /zookeeper/config
2> 7 /solr/collections/gettingstarted/state.json
2>
2> Maximum concurrent children watches above limit:
2>
2> 12 /solr/overseer/queue
2> 6 /solr/collections
2> 5 /solr/live_nodes
2> 5 /solr/overseer/collection-queue-work
2> 3 /solr/collections/gettingstarted/state.json
2>
2> 141957 WARN (ZkTestServer Run Thread) [n: c: s: r: x: t:] o.a.z.s.ServerCnxnFactory maxCnxns is not configured, using default value 0.
2> 142064 WARN (TEST-TestSolrCLIRunExample.testSchemalessExample-seed#[B45BFE396F5997BB]) [n: c: s: r: x: t:] o.a.s.c.c.SolrZkClient Using default ZkCredentialsInjector. ZkCredentialsInjector is not secure, it creates an empty list of credentials which leads to 'OPEN_ACL_UNSAFE' ACLs to Zookeeper nodes
2> 142064 WARN (TEST-TestSolrCLIRunExample.testSchemalessExample-seed#[B45BFE396F5997BB]) [n: c: s: r: x: t:] o.a.s.c.c.SolrZkClient Using default ZkACLProvider. DefaultZkACLProvider is not secure, it creates 'OPEN_ACL_UNSAFE' ACLs to Zookeeper nodes
2> 142090 WARN (TEST-TestSolrCLIRunExample.testSchemalessExample-seed#[B45BFE396F5997BB]) [n: c: s: r: x: t:] o.a.s.c.c.SolrZkClient Using default ZkCredentialsInjector. ZkCredentialsInjector is not secure, it creates an empty list of credentials which leads to 'OPEN_ACL_UNSAFE' ACLs to Zookeeper nodes
2> 142090 WARN (TEST-TestSolrCLIRunExample.testSchemalessExample-seed#[B45BFE396F5997BB]) [n: c: s: r: x: t:] o.a.s.c.c.SolrZkClient Using default ZkACLProvider. DefaultZkACLProvider is not secure, it creates 'OPEN_ACL_UNSAFE' ACLs to Zookeeper nodes
2> 142119 WARN (TEST-TestSolrCLIRunExample.testSchemalessExample-seed#[B45BFE396F5997BB]) [n: c: s: r: x: t:] o.a.s.c.c.SolrZkClient Using default ZkCredentialsInjector. ZkCredentialsInjector is not secure, it creates an empty list of credentials which leads to 'OPEN_ACL_UNSAFE' ACLs to Zookeeper nodes
2> 142119 WARN (TEST-TestSolrCLIRunExample.testSchemalessExample-seed#[B45BFE396F5997BB]) [n: c: s: r: x: t:] o.a.s.c.c.SolrZkClient Using default ZkACLProvider. DefaultZkACLProvider is not secure, it creates 'OPEN_ACL_UNSAFE' ACLs to Zookeeper nodes
2> 142260 INFO (jetty-launcher-883-thread-1) [n: c: s: r: x: t:] o.e.j.s.Server jetty-10.0.22; built: 2024-06-27T16:03:51.502Z; git: 5c8471e852d377fd726ad9b1692c35ffc5febb09; jvm 21.0.3+9-LTS
2> 142300 INFO (jetty-launcher-883-thread-1) [n: c: s: r: x: t:] o.e.j.s.s.DefaultSessionIdManager Session workerName=node0
2> 142305 WARN (jetty-launcher-883-thread-1) [n: c: s: r: x: t:] o.a.s.c.c.SolrZkClient Using default ZkCredentialsInjector. ZkCredentialsInjector is not secure, it creates an empty list of credentials which leads to 'OPEN_ACL_UNSAFE' ACLs to Zookeeper nodes
2> 142305 WARN (jetty-launcher-883-thread-1) [n: c: s: r: x: t:] o.a.s.c.c.SolrZkClient Using default ZkACLProvider. DefaultZkACLProvider is not secure, it creates 'OPEN_ACL_UNSAFE' ACLs to Zookeeper nodes
2> 143876 WARN (jetty-launcher-883-thread-1) [n: c: s: r: x: t:] o.a.s.c.c.SolrZkClient Using default ZkCredentialsInjector. ZkCredentialsInjector is not secure, it creates an empty list of credentials which leads to 'OPEN_ACL_UNSAFE' ACLs to Zookeeper nodes
2> 143876 WARN (jetty-launcher-883-thread-1) [n: c: s: r: x: t:] o.a.s.c.c.SolrZkClient Using default ZkACLProvider. DefaultZkACLProvider is not secure, it creates 'OPEN_ACL_UNSAFE' ACLs to Zookeeper nodes
2> 144018 WARN (jetty-launcher-883-thread-1) [n:localhost:40851_solr c: s: r: x: t:] o.a.s.c.c.SolrZkClient Using default ZkCredentialsInjector. ZkCredentialsInjector is not secure, it creates an empty list of credentials which leads to 'OPEN_ACL_UNSAFE' ACLs to Zookeeper nodes
2> 144272 WARN (jetty-launcher-883-thread-1) [n:localhost:40851_solr c: s: r: x: t:] o.a.s.c.ZkController Contents of zookeeper /security.json are world-readable; consider setting up ACLs as described in https://solr.apache.org/guide/solr/latest/deployment-guide/zookeeper-access-control.html
2> 144295 WARN (jetty-launcher-883-thread-1) [n:localhost:40851_solr c: s: r: x: t:] o.a.s.c.CoreContainer Not all security plugins configured! authentication=disabled authorization=disabled. Solr is only as secure as you make it. Consider configuring authentication/authorization before exposing Solr to users internal or external. See https://s.apache.org/solrsecurity for more info
2> 144727 INFO (jetty-launcher-883-thread-1) [n:localhost:40851_solr c: s: r: x: t:] o.e.j.s.h.ContextHandler Started o.e.j.s.ServletContextHandler@335ec914{/solr,file:///home/jenkins/jenkins-slave/workspace/Solr/Solr-NightlyTests-main/solr/core/build/tmp/tests-cwd/,AVAILABLE}
2> 144728 INFO (jetty-launcher-883-thread-1) [n:localhost:40851_solr c: s: r: x: t:] o.e.j.s.AbstractConnector Started ServerConnector@28d87a79{HTTP/1.1, (http/1.1, h2c)}{127.0.0.1:40851}
2> 144728 INFO (jetty-launcher-883-thread-1) [n:localhost:40851_solr c: s: r: x: t:] o.e.j.s.Server Started Server@73001877{STARTING}[10.0.22,sto=0] @144762ms
2> 144729 WARN (TEST-TestSolrCLIRunExample.testSchemalessExample-seed#[B45BFE396F5997BB]) [n: c: s: r: x: t:] o.a.s.c.c.SolrZkClient Using default ZkCredentialsInjector. ZkCredentialsInjector is not secure, it creates an empty list of credentials which leads to 'OPEN_ACL_UNSAFE' ACLs to Zookeeper nodes
2> 144729 WARN (TEST-TestSolrCLIRunExample.testSchemalessExample-seed#[B45BFE396F5997BB]) [n: c: s: r: x: t:] o.a.s.c.c.SolrZkClient Using default ZkACLProvider. DefaultZkACLProvider is not secure, it creates 'OPEN_ACL_UNSAFE' ACLs to Zookeeper nodes
2> WARNING: URLs provided to this tool needn't include Solr's context-root (e.g. "/solr"). Such URLs are deprecated and support for them will be removed in a future release. Correcting from [http://localhost:40851/solr] to [http://localhost:40851/].
2> 144983 WARN (TEST-TestSolrCLIRunExample.testSchemalessExample-seed#[B45BFE396F5997BB]) [n: c: s: r: x: t:] o.a.s.c.c.SolrZkClient Using default ZkCredentialsInjector. ZkCredentialsInjector is not secure, it creates an empty list of credentials which leads to 'OPEN_ACL_UNSAFE' ACLs to Zookeeper nodes
2> 144983 WARN (TEST-TestSolrCLIRunExample.testSchemalessExample-seed#[B45BFE396F5997BB]) [n: c: s: r: x: t:] o.a.s.c.c.SolrZkClient Using default ZkACLProvider. DefaultZkACLProvider is not secure, it creates 'OPEN_ACL_UNSAFE' ACLs to Zookeeper nodes
2> 146304 INFO (jetty-closer-936-thread-1) [n: c: s: r: x: t:] o.e.j.s.Server Stopped Server@73001877{STOPPING}[10.0.22,sto=0]
2> 146313 INFO (jetty-closer-936-thread-1) [n: c: s: r: x: t:] o.e.j.s.AbstractConnector Stopped ServerConnector@28d87a79{HTTP/1.1, (http/1.1, h2c)}{127.0.0.1:40851}
2> 146474 INFO (jetty-closer-936-thread-1) [n: c: s: r: x: t:] o.e.j.s.h.ContextHandler Stopped o.e.j.s.ServletContextHandler@335ec914{/solr,file:///home/jenkins/jenkins-slave/workspace/Solr/Solr-NightlyTests-main/solr/core/build/tmp/tests-cwd/,STOPPED}
2> 146902 WARN (ZkTestServer Run Thread) [n: c: s: r: x: t:] o.a.s.c.ZkTestServer Watch limit violations:
2> Maximum concurrent create/delete watches above limit:
2>
2> 3 /solr/aliases.json
2> 3 /solr/clusterprops.json
2> 2 /solr/collections/gettingstarted/terms/shard1
2>
2> Maximum concurrent data watches above limit:
2>
2> 10 /zookeeper/config
2> 7 /solr/collections/gettingstarted/state.json
2>
2> Maximum concurrent children watches above limit:
2>
2> 12 /solr/overseer/queue
2> 6 /solr/collections
2> 5 /solr/live_nodes
2> 4 /solr/overseer/collection-queue-work
2> 3 /solr/collections/gettingstarted/state.json
2>
2> 146915 WARN (ZkTestServer Run Thread) [n: c: s: r: x: t:] o.a.z.s.ServerCnxnFactory maxCnxns is not configured, using default value 0.
2> 147015 WARN (TEST-TestSolrCLIRunExample.testTechproductsExample-seed#[B45BFE396F5997BB]) [n: c: s: r: x: t:] o.a.s.c.c.SolrZkClient Using default ZkCredentialsInjector. ZkCredentialsInjector is not secure, it creates an empty list of credentials which leads to 'OPEN_ACL_UNSAFE' ACLs to Zookeeper nodes
2> 147015 WARN (TEST-TestSolrCLIRunExample.testTechproductsExample-seed#[B45BFE396F5997BB]) [n: c: s: r: x: t:] o.a.s.c.c.SolrZkClient Using default ZkACLProvider. DefaultZkACLProvider is not secure, it creates 'OPEN_ACL_UNSAFE' ACLs to Zookeeper nodes
2> 147033 WARN (TEST-TestSolrCLIRunExample.testTechproductsExample-seed#[B45BFE396F5997BB]) [n: c: s: r: x: t:] o.a.s.c.c.SolrZkClient Using default ZkCredentialsInjector. ZkCredentialsInjector is not secure, it creates an empty list of credentials which leads to 'OPEN_ACL_UNSAFE' ACLs to Zookeeper nodes
2> 147033 WARN (TEST-TestSolrCLIRunExample.testTechproductsExample-seed#[B45BFE396F5997BB]) [n: c: s: r: x: t:] o.a.s.c.c.SolrZkClient Using default ZkACLProvider. DefaultZkACLProvider is not secure, it creates 'OPEN_ACL_UNSAFE' ACLs to Zookeeper nodes
2> 147044 WARN (TEST-TestSolrCLIRunExample.testTechproductsExample-seed#[B45BFE396F5997BB]) [n: c: s: r: x: t:] o.a.s.c.c.SolrZkClient Using default ZkCredentialsInjector. ZkCredentialsInjector is not secure, it creates an empty list of credentials which leads to 'OPEN_ACL_UNSAFE' ACLs to Zookeeper nodes
2> 147044 WARN (TEST-TestSolrCLIRunExample.testTechproductsExample-seed#[B45BFE396F5997BB]) [n: c: s: r: x: t:] o.a.s.c.c.SolrZkClient Using default ZkACLProvider. DefaultZkACLProvider is not secure, it creates 'OPEN_ACL_UNSAFE' ACLs to Zookeeper nodes
2> 147173 INFO (jetty-launcher-952-thread-1) [n: c: s: r: x: t:] o.e.j.s.Server jetty-10.0.22; built: 2024-06-27T16:03:51.502Z; git: 5c8471e852d377fd726ad9b1692c35ffc5febb09; jvm 21.0.3+9-LTS
2> 147221 INFO (jetty-launcher-952-thread-1) [n: c: s: r: x: t:] o.e.j.s.s.DefaultSessionIdManager Session workerName=node0
2> 147222 WARN (jetty-launcher-952-thread-1) [n: c: s: r: x: t:] o.a.s.c.c.SolrZkClient Using default ZkCredentialsInjector. ZkCredentialsInjector is not secure, it creates an empty list of credentials which leads to 'OPEN_ACL_UNSAFE' ACLs to Zookeeper nodes
2> 147222 WARN (jetty-launcher-952-thread-1) [n: c: s: r: x: t:] o.a.s.c.c.SolrZkClient Using default ZkACLProvider. DefaultZkACLProvider is not secure, it creates 'OPEN_ACL_UNSAFE' ACLs to Zookeeper nodes
2> 149395 WARN (jetty-launcher-952-thread-1) [n: c: s: r: x: t:] o.a.s.c.c.SolrZkClient Using default ZkCredentialsInjector. ZkCredentialsInjector is not secure, it creates an empty list of credentials which leads to 'OPEN_ACL_UNSAFE' ACLs to Zookeeper nodes
2> 149395 WARN (jetty-launcher-952-thread-1) [n: c: s: r: x: t:] o.a.s.c.c.SolrZkClient Using default ZkACLProvider. DefaultZkACLProvider is not secure, it creates 'OPEN_ACL_UNSAFE' ACLs to Zookeeper nodes
2> 149502 WARN (jetty-launcher-952-thread-1) [n:localhost:37923_solr c: s: r: x: t:] o.a.s.c.c.SolrZkClient Using default ZkCredentialsInjector. ZkCredentialsInjector is not secure, it creates an empty list of credentials which leads to 'OPEN_ACL_UNSAFE' ACLs to Zookeeper nodes
2> 149554 WARN (jetty-launcher-952-thread-1) [n:localhost:37923_solr c: s: r: x: t:] o.a.s.c.ZkController Contents of zookeeper /security.json are world-readable; consider setting up ACLs as described in https://solr.apache.org/guide/solr/latest/deployment-guide/zookeeper-access-control.html
2> 149571 WARN (jetty-launcher-952-thread-1) [n:localhost:37923_solr c: s: r: x: t:] o.a.s.c.CoreContainer Not all security plugins configured! authentication=disabled authorization=disabled. Solr is only as secure as you make it. Consider configuring authentication/authorization before exposing Solr to users internal or external. See https://s.apache.org/solrsecurity for more info
2> 149926 INFO (jetty-launcher-952-thread-1) [n:localhost:37923_solr c: s: r: x: t:] o.e.j.s.h.ContextHandler Started o.e.j.s.ServletContextHandler@cf17211{/solr,file:///home/jenkins/jenkins-slave/workspace/Solr/Solr-NightlyTests-main/solr/core/build/tmp/tests-cwd/,AVAILABLE}
2> 149927 INFO (jetty-launcher-952-thread-1) [n:localhost:37923_solr c: s: r: x: t:] o.e.j.s.AbstractConnector Started ServerConnector@71934561{HTTP/1.1, (http/1.1, h2c)}{127.0.0.1:37923}
2> 149927 INFO (jetty-launcher-952-thread-1) [n:localhost:37923_solr c: s: r: x: t:] o.e.j.s.Server Started Server@7c1af5e6{STARTING}[10.0.22,sto=0] @149961ms
2> 149928 WARN (TEST-TestSolrCLIRunExample.testTechproductsExample-seed#[B45BFE396F5997BB]) [n: c: s: r: x: t:] o.a.s.c.c.SolrZkClient Using default ZkCredentialsInjector. ZkCredentialsInjector is not secure, it creates an empty list of credentials which leads to 'OPEN_ACL_UNSAFE' ACLs to Zookeeper nodes
2> 149928 WARN (TEST-TestSolrCLIRunExample.testTechproductsExample-seed#[B45BFE396F5997BB]) [n: c: s: r: x: t:] o.a.s.c.c.SolrZkClient Using default ZkACLProvider. DefaultZkACLProvider is not secure, it creates 'OPEN_ACL_UNSAFE' ACLs to Zookeeper nodes
2> WARNING: URLs provided to this tool needn't include Solr's context-root (e.g. "/solr"). Such URLs are deprecated and support for them will be removed in a future release. Correcting from [http://localhost:37923/solr] to [http://localhost:37923/].
2> 150292 WARN (TEST-TestSolrCLIRunExample.testTechproductsExample-seed#[B45BFE396F5997BB]) [n: c: s: r: x: t:] o.a.s.c.c.SolrZkClient Using default ZkCredentialsInjector. ZkCredentialsInjector is not secure, it creates an empty list of credentials which leads to 'OPEN_ACL_UNSAFE' ACLs to Zookeeper nodes
2> 150292 WARN (TEST-TestSolrCLIRunExample.testTechproductsExample-seed#[B45BFE396F5997BB]) [n: c: s: r: x: t:] o.a.s.c.c.SolrZkClient Using default ZkACLProvider. DefaultZkACLProvider is not secure, it creates 'OPEN_ACL_UNSAFE' ACLs to Zookeeper nodes
1> Posting files to [base] url http://localhost:37923/solr/techproducts/update using content-type application/xml...
1> POSTing file mp500.xml to [base]
1> POSTing file ipod_video.xml to [base]
1> POSTing file monitor2.xml to [base]
1> POSTing file gb18030-example.xml to [base]
1> POSTing file vidcard.xml to [base]
1> POSTing file money.xml to [base]
1> POSTing file hd.xml to [base]
1> POSTing file ipod_other.xml to [base]
1> POSTing file sd500.xml to [base]
1> POSTing file solr.xml to [base]
1> POSTing file utf8-example.xml to [base]
1> POSTing file monitor.xml to [base]
1> POSTing file manufacturers.xml to [base]
1> POSTing file mem.xml to [base]
1> 14 files indexed.
1> COMMITting Solr index changes to http://localhost:37923/solr/techproducts/update...
1> Time spent: 0:00:00.766
2> 152874 INFO (jetty-closer-1006-thread-1) [n: c: s: r: x: t:] o.e.j.s.Server Stopped Server@7c1af5e6{STOPPING}[10.0.22,sto=0]
2> 152875 INFO (jetty-closer-1006-thread-1) [n: c: s: r: x: t:] o.e.j.s.AbstractConnector Stopped ServerConnector@71934561{HTTP/1.1, (http/1.1, h2c)}{127.0.0.1:37923}
2> 153111 INFO (jetty-closer-1006-thread-1) [n: c: s: r: x: t:] o.e.j.s.h.ContextHandler Stopped o.e.j.s.ServletContextHandler@cf17211{/solr,file:///home/jenkins/jenkins-slave/workspace/Solr/Solr-NightlyTests-main/solr/core/build/tmp/tests-cwd/,STOPPED}
2> 153403 WARN (ZkTestServer Run Thread) [n: c: s: r: x: t:] o.a.s.c.ZkTestServer Watch limit violations:
2> Maximum concurrent create/delete watches above limit:
2>
2> 3 /solr/aliases.json
2> 3 /solr/collections/techproducts/terms/shard1
2> 3 /solr/clusterprops.json
2>
2> Maximum concurrent data watches above limit:
2>
2> 12 /zookeeper/config
2> 8 /solr/collections/techproducts/state.json
2>
2> Maximum concurrent children watches above limit:
2>
2> 13 /solr/overseer/queue
2> 6 /solr/collections
2> 5 /solr/live_nodes
2> 4 /solr/overseer/collection-queue-work
2> 3 /solr/collections/techproducts/state.json
2>
2> 153414 WARN (ZkTestServer Run Thread) [n: c: s: r: x: t:] o.a.z.s.ServerCnxnFactory maxCnxns is not configured, using default value 0.
2> 153515 WARN (TEST-TestSolrCLIRunExample.testTechproductsExample-seed#[B45BFE396F5997BB]) [n: c: s: r: x: t:] o.a.s.c.c.SolrZkClient Using default ZkCredentialsInjector. ZkCredentialsInjector is not secure, it creates an empty list of credentials which leads to 'OPEN_ACL_UNSAFE' ACLs to Zookeeper nodes
2> 153515 WARN (TEST-TestSolrCLIRunExample.testTechproductsExample-seed#[B45BFE396F5997BB]) [n: c: s: r: x: t:] o.a.s.c.c.SolrZkClient Using default ZkACLProvider. DefaultZkACLProvider is not secure, it creates 'OPEN_ACL_UNSAFE' ACLs to Zookeeper nodes
2> 153521 WARN (TEST-TestSolrCLIRunExample.testTechproductsExample-seed#[B45BFE396F5997BB]) [n: c: s: r: x: t:] o.a.s.c.c.SolrZkClient Using default ZkCredentialsInjector. ZkCredentialsInjector is not secure, it creates an empty list of credentials which leads to 'OPEN_ACL_UNSAFE' ACLs to Zookeeper nodes
2> 153521 WARN (TEST-TestSolrCLIRunExample.testTechproductsExample-seed#[B45BFE396F5997BB]) [n: c: s: r: x: t:] o.a.s.c.c.SolrZkClient Using default ZkACLProvider. DefaultZkACLProvider is not secure, it creates 'OPEN_ACL_UNSAFE' ACLs to Zookeeper nodes
2> 153536 WARN (TEST-TestSolrCLIRunExample.testTechproductsExample-seed#[B45BFE396F5997BB]) [n: c: s: r: x: t:] o.a.s.c.c.SolrZkClient Using default ZkCredentialsInjector. ZkCredentialsInjector is not secure, it creates an empty list of credentials which leads to 'OPEN_ACL_UNSAFE' ACLs to Zookeeper nodes
2> 153536 WARN (TEST-TestSolrCLIRunExample.testTechproductsExample-seed#[B45BFE396F5997BB]) [n: c: s: r: x: t:] o.a.s.c.c.SolrZkClient Using default ZkACLProvider. DefaultZkACLProvider is not secure, it creates 'OPEN_ACL_UNSAFE' ACLs to Zookeeper nodes
2> 153711 INFO (jetty-launcher-1020-thread-1) [n: c: s: r: x: t:] o.e.j.s.Server jetty-10.0.22; built: 2024-06-27T16:03:51.502Z; git: 5c8471e852d377fd726ad9b1692c35ffc5febb09; jvm 21.0.3+9-LTS
2> 153716 INFO (jetty-launcher-1020-thread-1) [n: c: s: r: x: t:] o.e.j.s.s.DefaultSessionIdManager Session workerName=node0
2> 153717 WARN (jetty-launcher-1020-thread-1) [n: c: s: r: x: t:] o.a.s.c.c.SolrZkClient Using default ZkCredentialsInjector. ZkCredentialsInjector is not secure, it creates an empty list of credentials which leads to 'OPEN_ACL_UNSAFE' ACLs to Zookeeper nodes
2> 153717 WARN (jetty-launcher-1020-thread-1) [n: c: s: r: x: t:] o.a.s.c.c.SolrZkClient Using default ZkACLProvider. DefaultZkACLProvider is not secure, it creates 'OPEN_ACL_UNSAFE' ACLs to Zookeeper nodes
2> 155859 WARN (jetty-launcher-1020-thread-1) [n: c: s: r: x: t:] o.a.s.c.c.SolrZkClient Using default ZkCredentialsInjector. ZkCredentialsInjector is not secure, it creates an empty list of credentials which leads to 'OPEN_ACL_UNSAFE' ACLs to Zookeeper nodes
2> 155859 WARN (jetty-launcher-1020-thread-1) [n: c: s: r: x: t:] o.a.s.c.c.SolrZkClient Using default ZkACLProvider. DefaultZkACLProvider is not secure, it creates 'OPEN_ACL_UNSAFE' ACLs to Zookeeper nodes
2> 155964 WARN (jetty-launcher-1020-thread-1) [n:localhost:39479_solr c: s: r: x: t:] o.a.s.c.c.SolrZkClient Using default ZkCredentialsInjector. ZkCredentialsInjector is not secure, it creates an empty list of credentials which leads to 'OPEN_ACL_UNSAFE' ACLs to Zookeeper nodes
2> 155989 WARN (jetty-launcher-1020-thread-1) [n:localhost:39479_solr c: s: r: x: t:] o.a.s.c.ZkController Contents of zookeeper /security.json are world-readable; consider setting up ACLs as described in https://solr.apache.org/guide/solr/latest/deployment-guide/zookeeper-access-control.html
2> 156068 WARN (jetty-launcher-1020-thread-1) [n:localhost:39479_solr c: s: r: x: t:] o.a.s.c.CoreContainer Not all security plugins configured! authentication=disabled authorization=disabled. Solr is only as secure as you make it. Consider configuring authentication/authorization before exposing Solr to users internal or external. See https://s.apache.org/solrsecurity for more info
2> 156339 INFO (jetty-launcher-1020-thread-1) [n:localhost:39479_solr c: s: r: x: t:] o.e.j.s.h.ContextHandler Started o.e.j.s.ServletContextHandler@2ac32943{/solr,file:///home/jenkins/jenkins-slave/workspace/Solr/Solr-NightlyTests-main/solr/core/build/tmp/tests-cwd/,AVAILABLE}
2> 156340 INFO (jetty-launcher-1020-thread-1) [n:localhost:39479_solr c: s: r: x: t:] o.e.j.s.AbstractConnector Started ServerConnector@19ab2a84{HTTP/1.1, (http/1.1, h2c)}{127.0.0.1:39479}
2> 156340 INFO (jetty-launcher-1020-thread-1) [n:localhost:39479_solr c: s: r: x: t:] o.e.j.s.Server Started Server@1d0025e2{STARTING}[10.0.22,sto=0] @156374ms
2> 156342 WARN (TEST-TestSolrCLIRunExample.testTechproductsExample-seed#[B45BFE396F5997BB]) [n: c: s: r: x: t:] o.a.s.c.c.SolrZkClient Using default ZkCredentialsInjector. ZkCredentialsInjector is not secure, it creates an empty list of credentials which leads to 'OPEN_ACL_UNSAFE' ACLs to Zookeeper nodes
2> 156342 WARN (TEST-TestSolrCLIRunExample.testTechproductsExample-seed#[B45BFE396F5997BB]) [n: c: s: r: x: t:] o.a.s.c.c.SolrZkClient Using default ZkACLProvider. DefaultZkACLProvider is not secure, it creates 'OPEN_ACL_UNSAFE' ACLs to Zookeeper nodes
2> WARNING: URLs provided to this tool needn't include Solr's context-root (e.g. "/solr"). Such URLs are deprecated and support for them will be removed in a future release. Correcting from [http://localhost:39479/solr] to [http://localhost:39479/].
2> 156662 WARN (TEST-TestSolrCLIRunExample.testTechproductsExample-seed#[B45BFE396F5997BB]) [n: c: s: r: x: t:] o.a.s.c.c.SolrZkClient Using default ZkCredentialsInjector. ZkCredentialsInjector is not secure, it creates an empty list of credentials which leads to 'OPEN_ACL_UNSAFE' ACLs to Zookeeper nodes
2> 156662 WARN (TEST-TestSolrCLIRunExample.testTechproductsExample-seed#[B45BFE396F5997BB]) [n: c: s: r: x: t:] o.a.s.c.c.SolrZkClient Using default ZkACLProvider. DefaultZkACLProvider is not secure, it creates 'OPEN_ACL_UNSAFE' ACLs to Zookeeper nodes
1> Posting files to [base] url http://localhost:39479/solr/techproducts/update using content-type application/xml...
1> POSTing file mp500.xml to [base]
1> POSTing file ipod_video.xml to [base]
1> POSTing file monitor2.xml to [base]
1> POSTing file gb18030-example.xml to [base]
1> POSTing file vidcard.xml to [base]
1> POSTing file money.xml to [base]
1> POSTing file hd.xml to [base]
1> POSTing file ipod_other.xml to [base]
1> POSTing file sd500.xml to [base]
1> POSTing file solr.xml to [base]
1> POSTing file utf8-example.xml to [base]
1> POSTing file monitor.xml to [base]
1> POSTing file manufacturers.xml to [base]
1> POSTing file mem.xml to [base]
1> 14 files indexed.
1> COMMITting Solr index changes to http://localhost:39479/solr/techproducts/update...
1> Time spent: 0:00:00.366
2> 158533 INFO (jetty-closer-1074-thread-1) [n: c: s: r: x: t:] o.e.j.s.Server Stopped Server@1d0025e2{STOPPING}[10.0.22,sto=0]
2> 158536 INFO (jetty-closer-1074-thread-1) [n: c: s: r: x: t:] o.e.j.s.AbstractConnector Stopped ServerConnector@19ab2a84{HTTP/1.1, (http/1.1, h2c)}{127.0.0.1:39479}
2> 158696 INFO (jetty-closer-1074-thread-1) [n: c: s: r: x: t:] o.e.j.s.h.ContextHandler Stopped o.e.j.s.ServletContextHandler@2ac32943{/solr,file:///home/jenkins/jenkins-slave/workspace/Solr/Solr-NightlyTests-main/solr/core/build/tmp/tests-cwd/,STOPPED}
2> 159004 WARN (ZkTestServer Run Thread) [n: c: s: r: x: t:] o.a.s.c.ZkTestServer Watch limit violations:
2> Maximum concurrent create/delete watches above limit:
2>
2> 3 /solr/aliases.json
2> 3 /solr/collections/techproducts/terms/shard1
2> 3 /solr/clusterprops.json
2>
2> Maximum concurrent data watches above limit:
2>
2> 13 /zookeeper/config
2> 7 /solr/collections/techproducts/state.json
2>
2> Maximum concurrent children watches above limit:
2>
2> 12 /solr/overseer/queue
2> 6 /solr/collections
2> 5 /solr/live_nodes
2> 4 /solr/overseer/collection-queue-work
2> 3 /solr/collections/techproducts/state.json
2>
2> 159021 INFO (Thread-191) [n: c: s: r: x: t:] o.e.j.s.Server jetty-10.0.22; built: 2024-06-27T16:03:51.502Z; git: 5c8471e852d377fd726ad9b1692c35ffc5febb09; jvm 21.0.3+9-LTS
2> 159040 INFO (Thread-191) [n: c: s: r: x: t:] o.e.j.s.s.DefaultSessionIdManager Session workerName=node0
2> 159816 WARN (Thread-191) [n: c: s: r: x: t:] o.a.s.c.CoreContainer Not all security plugins configured! authentication=disabled authorization=disabled. Solr is only as secure as you make it. Consider configuring authentication/authorization before exposing Solr to users internal or external. See https://s.apache.org/solrsecurity for more info
2> 160005 INFO (Thread-191) [n: c: s: r: x: t:] o.e.j.s.h.ContextHandler Started o.e.j.s.ServletContextHandler@62a9588{/solr,file:///home/jenkins/jenkins-slave/workspace/Solr/Solr-NightlyTests-main/solr/core/build/tmp/tests-cwd/,AVAILABLE}
2> 160005 INFO (Thread-191) [n: c: s: r: x: t:] o.e.j.s.AbstractConnector Started ServerConnector@370fb6dc{HTTP/1.1, (http/1.1, h2c)}{127.0.0.1:44319}
2> 160005 INFO (Thread-191) [n: c: s: r: x: t:] o.e.j.s.Server Started Server@45d31645{STARTING}[10.0.22,sto=0] @160040ms
2> WARNING: URLs provided to this tool needn't include Solr's context-root (e.g. "/solr"). Such URLs are deprecated and support for them will be removed in a future release. Correcting from [http://localhost:44319/solr] to [http://localhost:44319/]
[...truncated too long message...]
rces
> Task :solr:modules:opentelemetry:testClasses
> Task :solr:modules:opentelemetry:test
WARNING: A command line option has enabled the Security Manager
WARNING: The Security Manager is deprecated and will be removed in a future release
WARNING: A command line option has enabled the Security Manager
WARNING: The Security Manager is deprecated and will be removed in a future release
WARNING: A command line option has enabled the Security Manager
WARNING: The Security Manager is deprecated and will be removed in a future release
:solr:modules:opentelemetry:test (SUCCESS): 12 test(s)
> Task :solr:modules:opentelemetry:wipeTaskTemp
> Task :solr:modules:s3-repository:compileJava
Note: /home/jenkins/jenkins-slave/workspace/Solr/Solr-NightlyTests-main/solr/modules/s3-repository/src/java/org/apache/solr/s3/S3StorageClient.java uses or overrides a deprecated API.
Note: Recompile with -Xlint:deprecation for details.
> Task :solr:modules:s3-repository:processResources NO-SOURCE
> Task :solr:modules:s3-repository:classes
> Task :solr:modules:s3-repository:compileTestJava
> Task :solr:modules:s3-repository:processTestResources
> Task :solr:modules:s3-repository:testClasses
> Task :solr:modules:s3-repository:test
WARNING: A command line option has enabled the Security Manager
WARNING: The Security Manager is deprecated and will be removed in a future release
WARNING: A command line option has enabled the Security Manager
WARNING: The Security Manager is deprecated and will be removed in a future release
WARNING: A command line option has enabled the Security Manager
WARNING: The Security Manager is deprecated and will be removed in a future release
WARNING: A command line option has enabled the Security Manager
WARNING: The Security Manager is deprecated and will be removed in a future release
:solr:modules:s3-repository:test (SUCCESS): 52 test(s)
> Task :solr:modules:s3-repository:wipeTaskTemp
> Task :solr:modules:scripting:compileJava
Note: /home/jenkins/jenkins-slave/workspace/Solr/Solr-NightlyTests-main/solr/modules/scripting/src/java/org/apache/solr/scripting/xslt/XSLTUpdateRequestHandler.java uses or overrides a deprecated API.
Note: Recompile with -Xlint:deprecation for details.
> Task :solr:modules:scripting:processResources NO-SOURCE
> Task :solr:modules:scripting:classes
> Task :solr:modules:scripting:compileTestJava
Note: Some input files use or override a deprecated API.
Note: Recompile with -Xlint:deprecation for details.
> Task :solr:modules:scripting:processTestResources
> Task :solr:modules:scripting:testClasses
> Task :solr:modules:scripting:test
WARNING: A command line option has enabled the Security Manager
WARNING: The Security Manager is deprecated and will be removed in a future release
WARNING: A command line option has enabled the Security Manager
WARNING: The Security Manager is deprecated and will be removed in a future release
WARNING: A command line option has enabled the Security Manager
WARNING: The Security Manager is deprecated and will be removed in a future release
WARNING: A command line option has enabled the Security Manager
WARNING: The Security Manager is deprecated and will be removed in a future release
:solr:modules:scripting:test (SUCCESS): 22 test(s), 17 skipped
> Task :solr:modules:scripting:wipeTaskTemp
> Task :solr:modules:sql:compileTestJava
Note: /home/jenkins/jenkins-slave/workspace/Solr/Solr-NightlyTests-main/solr/modules/sql/src/test/org/apache/solr/handler/sql/TestSQLHandlerNonCloud.java uses or overrides a deprecated API.
Note: Recompile with -Xlint:deprecation for details.
> Task :solr:modules:sql:copySolrCoreTestResources
> Task :solr:modules:sql:processTestResources
> Task :solr:modules:sql:testClasses
> Task :solr:modules:sql:test
WARNING: A command line option has enabled the Security Manager
WARNING: The Security Manager is deprecated and will be removed in a future release
WARNING: A command line option has enabled the Security Manager
WARNING: The Security Manager is deprecated and will be removed in a future release
WARNING: A command line option has enabled the Security Manager
WARNING: The Security Manager is deprecated and will be removed in a future release
:solr:modules:sql:test (SUCCESS): 33 test(s)
> Task :solr:modules:sql:wipeTaskTemp
The slowest tests (exceeding 500 ms) during this run:
1338.02s TestStressLiveNodes.testStress (:solr:core)
1193.16s RollingRestartTest.test (:solr:core)
637.84s HdfsBasicDistributedZkTest.test (:solr:modules:hdfs)
406.58s HdfsTlogReplayBufferedWhileIndexingTest.test (:solr:modules:hdfs)
361.76s TestDistributedSearch.test (:solr:core)
347.01s AffinityPlacementFactoryTest.testScalability (:solr:core)
264.80s TestDocTermOrdsUninvertLimit.testTriggerUnInvertLimit (:solr:core)
149.90s TestSizeLimitedDistributedMap.testConcurrentCleanup (:solr:core)
148.31s HdfsBasicDistributedZk2Test.test (:solr:modules:hdfs)
129.59s TestIntervalFaceting.testRandom (:solr:core)
The slowest suites (exceeding 1s) during this run:
1339.34s TestStressLiveNodes (:solr:core)
1193.77s RollingRestartTest (:solr:core)
641.08s HdfsBasicDistributedZkTest (:solr:modules:hdfs)
408.72s HdfsTlogReplayBufferedWhileIndexingTest (:solr:modules:hdfs)
361.99s TestDistributedSearch (:solr:core)
355.82s TestReplicationHandler (:solr:core)
347.22s AffinityPlacementFactoryTest (:solr:core)
332.39s ShardSplitTest (:solr:core)
264.82s TestDocTermOrdsUninvertLimit (:solr:core)
243.76s TestJsonFacets (:solr:core)
ERROR: The following test(s) have failed:
- org.apache.solr.hdfs.cloud.MoveReplicaHdfsFailoverTest.testDataDirAndUlogAreMaintained (:solr:modules:hdfs)
Test history: https://ge.apache.org/scans/tests?search.rootProjectNames=solr-root&tests.container=org.apache.solr.hdfs.cloud.MoveReplicaHdfsFailoverTest&tests.test=testDataDirAndUlogAreMaintained http://fucit.org/solr-jenkins-reports/history-trend-of-recent-failures.html#series/org.apache.solr.hdfs.cloud.MoveReplicaHdfsFailoverTest.testDataDirAndUlogAreMaintained
Test output: /home/jenkins/jenkins-slave/workspace/Solr/Solr-NightlyTests-main/solr/modules/hdfs/build/test-results/test/outputs/OUTPUT-org.apache.solr.hdfs.cloud.MoveReplicaHdfsFailoverTest.txt
Reproduce with: ./gradlew :solr:modules:hdfs:test --tests "org.apache.solr.hdfs.cloud.MoveReplicaHdfsFailoverTest.testDataDirAndUlogAreMaintained" -Ptests.jvms=4 -Ptests.haltonfailure=false "-Ptests.jvmargs=-XX:TieredStopAtLevel=1 -XX:+UseParallelGC -XX:ActiveProcessorCount=1 -XX:ReservedCodeCacheSize=120m" -Ptests.seed=B45BFE396F5997BB -Ptests.multiplier=2 -Ptests.nightly=true -Ptests.badapples=false -Ptests.file.encoding=UTF-8 -Ptests.linedocsfile=/home/jenkins/jenkins-slave/workspace/Solr/Solr-NightlyTests-main/test-data/enwiki.random.lines.txt
- org.apache.solr.cli.TestSolrCLIRunExample.testFilmsExample (:solr:core)
Test history: https://ge.apache.org/scans/tests?search.rootProjectNames=solr-root&tests.container=org.apache.solr.cli.TestSolrCLIRunExample&tests.test=testFilmsExample http://fucit.org/solr-jenkins-reports/history-trend-of-recent-failures.html#series/org.apache.solr.cli.TestSolrCLIRunExample.testFilmsExample
Test output: /home/jenkins/jenkins-slave/workspace/Solr/Solr-NightlyTests-main/solr/core/build/test-results/test/outputs/OUTPUT-org.apache.solr.cli.TestSolrCLIRunExample.txt
Reproduce with: ./gradlew :solr:core:test --tests "org.apache.solr.cli.TestSolrCLIRunExample.testFilmsExample" -Ptests.jvms=4 -Ptests.haltonfailure=false "-Ptests.jvmargs=-XX:TieredStopAtLevel=1 -XX:+UseParallelGC -XX:ActiveProcessorCount=1 -XX:ReservedCodeCacheSize=120m" -Ptests.seed=B45BFE396F5997BB -Ptests.multiplier=2 -Ptests.nightly=true -Ptests.badapples=false -Ptests.file.encoding=UTF-8 -Ptests.linedocsfile=/home/jenkins/jenkins-slave/workspace/Solr/Solr-NightlyTests-main/test-data/enwiki.random.lines.txt
- org.apache.solr.cloud.ChaosMonkeySafeLeaderTest.test (:solr:core)
Test history: https://ge.apache.org/scans/tests?search.rootProjectNames=solr-root&tests.container=org.apache.solr.cloud.ChaosMonkeySafeLeaderTest&tests.test=test http://fucit.org/solr-jenkins-reports/history-trend-of-recent-failures.html#series/org.apache.solr.cloud.ChaosMonkeySafeLeaderTest.test
Test output: /home/jenkins/jenkins-slave/workspace/Solr/Solr-NightlyTests-main/solr/core/build/test-results/test/outputs/OUTPUT-org.apache.solr.cloud.ChaosMonkeySafeLeaderTest.txt
Reproduce with: ./gradlew :solr:core:test --tests "org.apache.solr.cloud.ChaosMonkeySafeLeaderTest.test" -Ptests.jvms=4 -Ptests.haltonfailure=false "-Ptests.jvmargs=-XX:TieredStopAtLevel=1 -XX:+UseParallelGC -XX:ActiveProcessorCount=1 -XX:ReservedCodeCacheSize=120m" -Ptests.seed=B45BFE396F5997BB -Ptests.multiplier=2 -Ptests.nightly=true -Ptests.badapples=false -Ptests.file.encoding=UTF-8 -Ptests.linedocsfile=/home/jenkins/jenkins-slave/workspace/Solr/Solr-NightlyTests-main/test-data/enwiki.random.lines.txt
Deprecated Gradle features were used in this build, making it incompatible with Gradle 9.0.
You can use '--warning-mode all' to show the individual deprecation warnings and determine if they come from your own scripts or plugins.
For more on this, please refer to https://docs.gradle.org/8.10/userguide/command_line_interface.html#sec:command_line_warnings in the Gradle documentation.
BUILD SUCCESSFUL in 1h 45m 43s
148 actionable tasks: 148 executed
Publishing build scan...
https://ge.apache.org/s/m7nd7qvpa5l6k
Build step 'Invoke Gradle script' changed build result to SUCCESS
Archiving artifacts
‘**/*.events’ doesn’t match anything: ‘**’ exists but not ‘**/*.events’
No artifacts found that match the file pattern "**/*.events,heapdumps/**,**/hs_err_pid*". Configuration error?
Recording test results
[Checks API] No suitable checks publisher found.
Build step 'Publish JUnit test result report' changed build result to UNSTABLE
Email was triggered for: Unstable (Test Failures)
Sending email for trigger: Unstable (Test Failures)