You are viewing a plain text version of this content. The canonical link for it is here.
Posted to dev@kafka.apache.org by Apache Jenkins Server <je...@builds.apache.org> on 2020/10/22 18:13:28 UTC
Build failed in Jenkins: Kafka » kafka-trunk-jdk11 #172
See <https://ci-builds.apache.org/job/Kafka/job/kafka-trunk-jdk11/172/display/redirect?page=changes>
Changes:
[github] MINOR: Add some class javadoc to Admin client (#9459)
[github] MINOR: TopologyTestDriver should not require dummy parameters (#9477)
------------------------------------------
[...truncated 6.89 MB...]
org.apache.kafka.streams.test.MockProcessorContextStateStoreTest > shouldEitherInitOrThrow[builder = org.apache.kafka.streams.state.internals.TimestampedWindowStoreBuilder@28de98a4, timestamped = true, caching = true, logging = true] STARTED
org.apache.kafka.streams.test.MockProcessorContextStateStoreTest > shouldEitherInitOrThrow[builder = org.apache.kafka.streams.state.internals.TimestampedWindowStoreBuilder@28de98a4, timestamped = true, caching = true, logging = true] PASSED
org.apache.kafka.streams.test.MockProcessorContextStateStoreTest > shouldEitherInitOrThrow[builder = org.apache.kafka.streams.state.internals.TimestampedWindowStoreBuilder@60ee2f6, timestamped = true, caching = true, logging = true] STARTED
org.apache.kafka.streams.test.MockProcessorContextStateStoreTest > shouldEitherInitOrThrow[builder = org.apache.kafka.streams.state.internals.TimestampedWindowStoreBuilder@60ee2f6, timestamped = true, caching = true, logging = true] PASSED
org.apache.kafka.streams.test.MockProcessorContextStateStoreTest > shouldEitherInitOrThrow[builder = org.apache.kafka.streams.state.internals.TimestampedWindowStoreBuilder@4c552274, timestamped = true, caching = true, logging = false] STARTED
org.apache.kafka.streams.test.MockProcessorContextStateStoreTest > shouldEitherInitOrThrow[builder = org.apache.kafka.streams.state.internals.TimestampedWindowStoreBuilder@4c552274, timestamped = true, caching = true, logging = false] PASSED
org.apache.kafka.streams.test.MockProcessorContextStateStoreTest > shouldEitherInitOrThrow[builder = org.apache.kafka.streams.state.internals.TimestampedWindowStoreBuilder@2402673e, timestamped = true, caching = true, logging = false] STARTED
org.apache.kafka.streams.test.MockProcessorContextStateStoreTest > shouldEitherInitOrThrow[builder = org.apache.kafka.streams.state.internals.TimestampedWindowStoreBuilder@2402673e, timestamped = true, caching = true, logging = false] PASSED
org.apache.kafka.streams.test.MockProcessorContextStateStoreTest > shouldEitherInitOrThrow[builder = org.apache.kafka.streams.state.internals.TimestampedWindowStoreBuilder@78c5c0a2, timestamped = true, caching = true, logging = false] STARTED
org.apache.kafka.streams.test.MockProcessorContextStateStoreTest > shouldEitherInitOrThrow[builder = org.apache.kafka.streams.state.internals.TimestampedWindowStoreBuilder@78c5c0a2, timestamped = true, caching = true, logging = false] PASSED
org.apache.kafka.streams.test.MockProcessorContextStateStoreTest > shouldEitherInitOrThrow[builder = org.apache.kafka.streams.state.internals.TimestampedWindowStoreBuilder@9ad941e, timestamped = true, caching = false, logging = true] STARTED
org.apache.kafka.streams.test.MockProcessorContextStateStoreTest > shouldEitherInitOrThrow[builder = org.apache.kafka.streams.state.internals.TimestampedWindowStoreBuilder@9ad941e, timestamped = true, caching = false, logging = true] PASSED
org.apache.kafka.streams.test.MockProcessorContextStateStoreTest > shouldEitherInitOrThrow[builder = org.apache.kafka.streams.state.internals.TimestampedWindowStoreBuilder@6c0e41dd, timestamped = true, caching = false, logging = true] STARTED
org.apache.kafka.streams.test.MockProcessorContextStateStoreTest > shouldEitherInitOrThrow[builder = org.apache.kafka.streams.state.internals.TimestampedWindowStoreBuilder@6c0e41dd, timestamped = true, caching = false, logging = true] PASSED
org.apache.kafka.streams.test.MockProcessorContextStateStoreTest > shouldEitherInitOrThrow[builder = org.apache.kafka.streams.state.internals.TimestampedWindowStoreBuilder@5b02e0f5, timestamped = true, caching = false, logging = true] STARTED
org.apache.kafka.streams.test.MockProcessorContextStateStoreTest > shouldEitherInitOrThrow[builder = org.apache.kafka.streams.state.internals.TimestampedWindowStoreBuilder@5b02e0f5, timestamped = true, caching = false, logging = true] PASSED
org.apache.kafka.streams.test.MockProcessorContextStateStoreTest > shouldEitherInitOrThrow[builder = org.apache.kafka.streams.state.internals.TimestampedWindowStoreBuilder@d14fbe7, timestamped = true, caching = false, logging = false] STARTED
org.apache.kafka.streams.test.MockProcessorContextStateStoreTest > shouldEitherInitOrThrow[builder = org.apache.kafka.streams.state.internals.TimestampedWindowStoreBuilder@d14fbe7, timestamped = true, caching = false, logging = false] PASSED
org.apache.kafka.streams.test.MockProcessorContextStateStoreTest > shouldEitherInitOrThrow[builder = org.apache.kafka.streams.state.internals.TimestampedWindowStoreBuilder@68fc833f, timestamped = true, caching = false, logging = false] STARTED
org.apache.kafka.streams.test.MockProcessorContextStateStoreTest > shouldEitherInitOrThrow[builder = org.apache.kafka.streams.state.internals.TimestampedWindowStoreBuilder@68fc833f, timestamped = true, caching = false, logging = false] PASSED
org.apache.kafka.streams.test.MockProcessorContextStateStoreTest > shouldEitherInitOrThrow[builder = org.apache.kafka.streams.state.internals.TimestampedWindowStoreBuilder@76e22754, timestamped = true, caching = false, logging = false] STARTED
org.apache.kafka.streams.test.MockProcessorContextStateStoreTest > shouldEitherInitOrThrow[builder = org.apache.kafka.streams.state.internals.TimestampedWindowStoreBuilder@76e22754, timestamped = true, caching = false, logging = false] PASSED
org.apache.kafka.streams.test.MockProcessorContextStateStoreTest > shouldEitherInitOrThrow[builder = org.apache.kafka.streams.state.internals.WindowStoreBuilder@3aab6435, timestamped = false, caching = true, logging = true] STARTED
org.apache.kafka.streams.test.MockProcessorContextStateStoreTest > shouldEitherInitOrThrow[builder = org.apache.kafka.streams.state.internals.WindowStoreBuilder@3aab6435, timestamped = false, caching = true, logging = true] PASSED
org.apache.kafka.streams.test.MockProcessorContextStateStoreTest > shouldEitherInitOrThrow[builder = org.apache.kafka.streams.state.internals.WindowStoreBuilder@104a6b44, timestamped = false, caching = true, logging = true] STARTED
org.apache.kafka.streams.test.MockProcessorContextStateStoreTest > shouldEitherInitOrThrow[builder = org.apache.kafka.streams.state.internals.WindowStoreBuilder@104a6b44, timestamped = false, caching = true, logging = true] PASSED
org.apache.kafka.streams.test.MockProcessorContextStateStoreTest > shouldEitherInitOrThrow[builder = org.apache.kafka.streams.state.internals.WindowStoreBuilder@1c23f709, timestamped = false, caching = true, logging = true] STARTED
org.apache.kafka.streams.test.MockProcessorContextStateStoreTest > shouldEitherInitOrThrow[builder = org.apache.kafka.streams.state.internals.WindowStoreBuilder@1c23f709, timestamped = false, caching = true, logging = true] PASSED
org.apache.kafka.streams.test.MockProcessorContextStateStoreTest > shouldEitherInitOrThrow[builder = org.apache.kafka.streams.state.internals.WindowStoreBuilder@7b9cbb5e, timestamped = false, caching = true, logging = false] STARTED
org.apache.kafka.streams.test.MockProcessorContextStateStoreTest > shouldEitherInitOrThrow[builder = org.apache.kafka.streams.state.internals.WindowStoreBuilder@7b9cbb5e, timestamped = false, caching = true, logging = false] PASSED
org.apache.kafka.streams.test.MockProcessorContextStateStoreTest > shouldEitherInitOrThrow[builder = org.apache.kafka.streams.state.internals.WindowStoreBuilder@1a77e2d4, timestamped = false, caching = true, logging = false] STARTED
org.apache.kafka.streams.test.MockProcessorContextStateStoreTest > shouldEitherInitOrThrow[builder = org.apache.kafka.streams.state.internals.WindowStoreBuilder@1a77e2d4, timestamped = false, caching = true, logging = false] PASSED
org.apache.kafka.streams.test.MockProcessorContextStateStoreTest > shouldEitherInitOrThrow[builder = org.apache.kafka.streams.state.internals.WindowStoreBuilder@5924aa95, timestamped = false, caching = true, logging = false] STARTED
org.apache.kafka.streams.test.MockProcessorContextStateStoreTest > shouldEitherInitOrThrow[builder = org.apache.kafka.streams.state.internals.WindowStoreBuilder@5924aa95, timestamped = false, caching = true, logging = false] PASSED
org.apache.kafka.streams.test.MockProcessorContextStateStoreTest > shouldEitherInitOrThrow[builder = org.apache.kafka.streams.state.internals.WindowStoreBuilder@5a3c9507, timestamped = false, caching = false, logging = true] STARTED
org.apache.kafka.streams.test.MockProcessorContextStateStoreTest > shouldEitherInitOrThrow[builder = org.apache.kafka.streams.state.internals.WindowStoreBuilder@5a3c9507, timestamped = false, caching = false, logging = true] PASSED
org.apache.kafka.streams.test.MockProcessorContextStateStoreTest > shouldEitherInitOrThrow[builder = org.apache.kafka.streams.state.internals.WindowStoreBuilder@44649355, timestamped = false, caching = false, logging = true] STARTED
org.apache.kafka.streams.test.MockProcessorContextStateStoreTest > shouldEitherInitOrThrow[builder = org.apache.kafka.streams.state.internals.WindowStoreBuilder@44649355, timestamped = false, caching = false, logging = true] PASSED
org.apache.kafka.streams.test.MockProcessorContextStateStoreTest > shouldEitherInitOrThrow[builder = org.apache.kafka.streams.state.internals.WindowStoreBuilder@6120b84f, timestamped = false, caching = false, logging = true] STARTED
org.apache.kafka.streams.test.MockProcessorContextStateStoreTest > shouldEitherInitOrThrow[builder = org.apache.kafka.streams.state.internals.WindowStoreBuilder@6120b84f, timestamped = false, caching = false, logging = true] PASSED
org.apache.kafka.streams.test.MockProcessorContextStateStoreTest > shouldEitherInitOrThrow[builder = org.apache.kafka.streams.state.internals.WindowStoreBuilder@1dacc6fc, timestamped = false, caching = false, logging = false] STARTED
org.apache.kafka.streams.test.MockProcessorContextStateStoreTest > shouldEitherInitOrThrow[builder = org.apache.kafka.streams.state.internals.WindowStoreBuilder@1dacc6fc, timestamped = false, caching = false, logging = false] PASSED
org.apache.kafka.streams.test.MockProcessorContextStateStoreTest > shouldEitherInitOrThrow[builder = org.apache.kafka.streams.state.internals.WindowStoreBuilder@2386ece3, timestamped = false, caching = false, logging = false] STARTED
org.apache.kafka.streams.test.MockProcessorContextStateStoreTest > shouldEitherInitOrThrow[builder = org.apache.kafka.streams.state.internals.WindowStoreBuilder@2386ece3, timestamped = false, caching = false, logging = false] PASSED
org.apache.kafka.streams.test.MockProcessorContextStateStoreTest > shouldEitherInitOrThrow[builder = org.apache.kafka.streams.state.internals.WindowStoreBuilder@43182dfd, timestamped = false, caching = false, logging = false] STARTED
org.apache.kafka.streams.test.MockProcessorContextStateStoreTest > shouldEitherInitOrThrow[builder = org.apache.kafka.streams.state.internals.WindowStoreBuilder@43182dfd, timestamped = false, caching = false, logging = false] PASSED
org.apache.kafka.streams.test.MockProcessorContextStateStoreTest > shouldEitherInitOrThrow[builder = org.apache.kafka.streams.state.internals.SessionStoreBuilder@279e0711, timestamped = false, caching = true, logging = true] STARTED
org.apache.kafka.streams.test.MockProcessorContextStateStoreTest > shouldEitherInitOrThrow[builder = org.apache.kafka.streams.state.internals.SessionStoreBuilder@279e0711, timestamped = false, caching = true, logging = true] PASSED
org.apache.kafka.streams.test.MockProcessorContextStateStoreTest > shouldEitherInitOrThrow[builder = org.apache.kafka.streams.state.internals.SessionStoreBuilder@5cfebe38, timestamped = false, caching = true, logging = true] STARTED
org.apache.kafka.streams.test.MockProcessorContextStateStoreTest > shouldEitherInitOrThrow[builder = org.apache.kafka.streams.state.internals.SessionStoreBuilder@5cfebe38, timestamped = false, caching = true, logging = true] PASSED
org.apache.kafka.streams.test.MockProcessorContextStateStoreTest > shouldEitherInitOrThrow[builder = org.apache.kafka.streams.state.internals.SessionStoreBuilder@480bb0b0, timestamped = false, caching = true, logging = false] STARTED
org.apache.kafka.streams.test.MockProcessorContextStateStoreTest > shouldEitherInitOrThrow[builder = org.apache.kafka.streams.state.internals.SessionStoreBuilder@480bb0b0, timestamped = false, caching = true, logging = false] PASSED
org.apache.kafka.streams.test.MockProcessorContextStateStoreTest > shouldEitherInitOrThrow[builder = org.apache.kafka.streams.state.internals.SessionStoreBuilder@4afe1b89, timestamped = false, caching = true, logging = false] STARTED
org.apache.kafka.streams.test.MockProcessorContextStateStoreTest > shouldEitherInitOrThrow[builder = org.apache.kafka.streams.state.internals.SessionStoreBuilder@4afe1b89, timestamped = false, caching = true, logging = false] PASSED
org.apache.kafka.streams.test.MockProcessorContextStateStoreTest > shouldEitherInitOrThrow[builder = org.apache.kafka.streams.state.internals.SessionStoreBuilder@1d8f3b48, timestamped = false, caching = false, logging = true] STARTED
org.apache.kafka.streams.test.MockProcessorContextStateStoreTest > shouldEitherInitOrThrow[builder = org.apache.kafka.streams.state.internals.SessionStoreBuilder@1d8f3b48, timestamped = false, caching = false, logging = true] PASSED
org.apache.kafka.streams.test.MockProcessorContextStateStoreTest > shouldEitherInitOrThrow[builder = org.apache.kafka.streams.state.internals.SessionStoreBuilder@34a959bf, timestamped = false, caching = false, logging = true] STARTED
org.apache.kafka.streams.test.MockProcessorContextStateStoreTest > shouldEitherInitOrThrow[builder = org.apache.kafka.streams.state.internals.SessionStoreBuilder@34a959bf, timestamped = false, caching = false, logging = true] PASSED
org.apache.kafka.streams.test.MockProcessorContextStateStoreTest > shouldEitherInitOrThrow[builder = org.apache.kafka.streams.state.internals.SessionStoreBuilder@21b2f1aa, timestamped = false, caching = false, logging = false] STARTED
org.apache.kafka.streams.test.MockProcessorContextStateStoreTest > shouldEitherInitOrThrow[builder = org.apache.kafka.streams.state.internals.SessionStoreBuilder@21b2f1aa, timestamped = false, caching = false, logging = false] PASSED
org.apache.kafka.streams.test.MockProcessorContextStateStoreTest > shouldEitherInitOrThrow[builder = org.apache.kafka.streams.state.internals.SessionStoreBuilder@1b2a8446, timestamped = false, caching = false, logging = false] STARTED
org.apache.kafka.streams.test.MockProcessorContextStateStoreTest > shouldEitherInitOrThrow[builder = org.apache.kafka.streams.state.internals.SessionStoreBuilder@1b2a8446, timestamped = false, caching = false, logging = false] PASSED
org.apache.kafka.streams.test.wordcount.WindowedWordCountProcessorTest > shouldWorkWithInMemoryStore STARTED
org.apache.kafka.streams.test.wordcount.WindowedWordCountProcessorTest > shouldWorkWithInMemoryStore PASSED
org.apache.kafka.streams.test.wordcount.WindowedWordCountProcessorTest > shouldWorkWithPersistentStore STARTED
org.apache.kafka.streams.test.wordcount.WindowedWordCountProcessorTest > shouldWorkWithPersistentStore PASSED
org.apache.kafka.streams.internals.KeyValueStoreFacadeTest > shouldReturnIsOpen STARTED
org.apache.kafka.streams.internals.KeyValueStoreFacadeTest > shouldReturnIsOpen PASSED
org.apache.kafka.streams.internals.KeyValueStoreFacadeTest > shouldDeleteAndReturnPlainValue STARTED
org.apache.kafka.streams.internals.KeyValueStoreFacadeTest > shouldDeleteAndReturnPlainValue PASSED
org.apache.kafka.streams.internals.KeyValueStoreFacadeTest > shouldReturnName STARTED
org.apache.kafka.streams.internals.KeyValueStoreFacadeTest > shouldReturnName PASSED
org.apache.kafka.streams.internals.KeyValueStoreFacadeTest > shouldPutWithUnknownTimestamp STARTED
org.apache.kafka.streams.internals.KeyValueStoreFacadeTest > shouldPutWithUnknownTimestamp PASSED
org.apache.kafka.streams.internals.KeyValueStoreFacadeTest > shouldPutAllWithUnknownTimestamp STARTED
org.apache.kafka.streams.internals.KeyValueStoreFacadeTest > shouldPutAllWithUnknownTimestamp PASSED
org.apache.kafka.streams.internals.KeyValueStoreFacadeTest > shouldReturnIsPersistent STARTED
org.apache.kafka.streams.internals.KeyValueStoreFacadeTest > shouldReturnIsPersistent PASSED
org.apache.kafka.streams.internals.KeyValueStoreFacadeTest > shouldForwardDeprecatedInit STARTED
org.apache.kafka.streams.internals.KeyValueStoreFacadeTest > shouldForwardDeprecatedInit PASSED
org.apache.kafka.streams.internals.KeyValueStoreFacadeTest > shouldPutIfAbsentWithUnknownTimestamp STARTED
org.apache.kafka.streams.internals.KeyValueStoreFacadeTest > shouldPutIfAbsentWithUnknownTimestamp PASSED
org.apache.kafka.streams.internals.KeyValueStoreFacadeTest > shouldForwardClose STARTED
org.apache.kafka.streams.internals.KeyValueStoreFacadeTest > shouldForwardClose PASSED
org.apache.kafka.streams.internals.KeyValueStoreFacadeTest > shouldForwardFlush STARTED
org.apache.kafka.streams.internals.KeyValueStoreFacadeTest > shouldForwardFlush PASSED
org.apache.kafka.streams.internals.KeyValueStoreFacadeTest > shouldForwardInit STARTED
org.apache.kafka.streams.internals.KeyValueStoreFacadeTest > shouldForwardInit PASSED
> Task :streams:upgrade-system-tests-21:spotbugsMain NO-SOURCE
> Task :streams:upgrade-system-tests-21:test
> Task :streams:upgrade-system-tests-22:compileJava NO-SOURCE
> Task :streams:upgrade-system-tests-22:processResources NO-SOURCE
> Task :streams:upgrade-system-tests-22:classes UP-TO-DATE
> Task :streams:upgrade-system-tests-22:checkstyleMain NO-SOURCE
> Task :streams:upgrade-system-tests-22:compileTestJava
> Task :streams:upgrade-system-tests-22:processTestResources NO-SOURCE
> Task :streams:upgrade-system-tests-22:testClasses
> Task :streams:upgrade-system-tests-22:checkstyleTest
> Task :streams:upgrade-system-tests-22:spotbugsMain NO-SOURCE
> Task :streams:upgrade-system-tests-22:test
> Task :streams:upgrade-system-tests-23:compileJava NO-SOURCE
> Task :streams:upgrade-system-tests-23:processResources NO-SOURCE
> Task :streams:upgrade-system-tests-23:classes UP-TO-DATE
> Task :streams:upgrade-system-tests-23:checkstyleMain NO-SOURCE
> Task :streams:upgrade-system-tests-23:compileTestJava
> Task :streams:upgrade-system-tests-23:processTestResources NO-SOURCE
> Task :streams:upgrade-system-tests-23:testClasses
> Task :streams:upgrade-system-tests-23:checkstyleTest
> Task :streams:upgrade-system-tests-23:spotbugsMain NO-SOURCE
> Task :streams:upgrade-system-tests-23:test
> Task :streams:upgrade-system-tests-24:compileJava NO-SOURCE
> Task :streams:upgrade-system-tests-24:processResources NO-SOURCE
> Task :streams:upgrade-system-tests-24:classes UP-TO-DATE
> Task :streams:upgrade-system-tests-24:checkstyleMain NO-SOURCE
> Task :streams:upgrade-system-tests-24:compileTestJava
> Task :streams:upgrade-system-tests-24:processTestResources NO-SOURCE
> Task :streams:upgrade-system-tests-24:testClasses
> Task :streams:upgrade-system-tests-24:checkstyleTest
> Task :streams:upgrade-system-tests-24:spotbugsMain NO-SOURCE
> Task :streams:upgrade-system-tests-24:test
> Task :streams:upgrade-system-tests-25:compileJava NO-SOURCE
> Task :streams:upgrade-system-tests-25:processResources NO-SOURCE
> Task :streams:upgrade-system-tests-25:classes UP-TO-DATE
> Task :streams:upgrade-system-tests-25:checkstyleMain NO-SOURCE
> Task :streams:upgrade-system-tests-25:compileTestJava
> Task :streams:upgrade-system-tests-25:processTestResources NO-SOURCE
> Task :streams:upgrade-system-tests-25:testClasses
> Task :streams:upgrade-system-tests-25:checkstyleTest
> Task :streams:upgrade-system-tests-25:spotbugsMain NO-SOURCE
> Task :streams:upgrade-system-tests-25:test
> Task :streams:upgrade-system-tests-26:compileJava NO-SOURCE
> Task :streams:upgrade-system-tests-26:processResources NO-SOURCE
> Task :streams:upgrade-system-tests-26:classes UP-TO-DATE
> Task :streams:upgrade-system-tests-26:checkstyleMain NO-SOURCE
> Task :streams:upgrade-system-tests-26:compileTestJava
> Task :streams:upgrade-system-tests-26:processTestResources NO-SOURCE
> Task :streams:upgrade-system-tests-26:testClasses
> Task :streams:upgrade-system-tests-26:checkstyleTest
> Task :streams:upgrade-system-tests-26:spotbugsMain NO-SOURCE
> Task :streams:upgrade-system-tests-26:test
FAILURE: Build failed with an exception.
* What went wrong:
Execution failed for task ':streams:test'.
> There were failing tests. See the report at: file://<https://ci-builds.apache.org/job/Kafka/job/kafka-trunk-jdk11/ws/streams/build/reports/tests/test/index.html>
* Try:
Run with --stacktrace option to get the stack trace. Run with --info or --debug option to get more log output. Run with --scan to get full insights.
* Get more help at https://help.gradle.org
Deprecated Gradle features were used in this build, making it incompatible with Gradle 7.0.
Use '--warning-mode all' to show the individual deprecation warnings.
See https://docs.gradle.org/6.7/userguide/command_line_interface.html#sec:command_line_warnings
BUILD FAILED in 2h 10m 12s
232 actionable tasks: 227 executed, 5 up-to-date
Build step 'Execute shell' marked build as failure
Recording test results
Not sending mail to unregistered user github@hugo-hirsch.de
Jenkins build is back to normal : Kafka » kafka-trunk-jdk11 #174
Posted by Apache Jenkins Server <je...@builds.apache.org>.
See <https://ci-builds.apache.org/job/Kafka/job/kafka-trunk-jdk11/174/display/redirect?page=changes>
Build failed in Jenkins: Kafka » kafka-trunk-jdk11 #173
Posted by Apache Jenkins Server <je...@builds.apache.org>.
See <https://ci-builds.apache.org/job/Kafka/job/kafka-trunk-jdk11/173/display/redirect?page=changes>
Changes:
[github] KAFKA-10284: Group membership update due to static member rejoin should be persisted (#9270)
------------------------------------------
[...truncated 3.44 MB...]
org.apache.kafka.streams.test.MockProcessorContextStateStoreTest > shouldEitherInitOrThrow[builder = org.apache.kafka.streams.state.internals.WindowStoreBuilder@3091449, timestamped = false, caching = true, logging = false] STARTED
org.apache.kafka.streams.test.MockProcessorContextStateStoreTest > shouldEitherInitOrThrow[builder = org.apache.kafka.streams.state.internals.WindowStoreBuilder@3091449, timestamped = false, caching = true, logging = false] PASSED
org.apache.kafka.streams.test.MockProcessorContextStateStoreTest > shouldEitherInitOrThrow[builder = org.apache.kafka.streams.state.internals.WindowStoreBuilder@58c6b7cf, timestamped = false, caching = true, logging = false] STARTED
org.apache.kafka.streams.test.MockProcessorContextStateStoreTest > shouldEitherInitOrThrow[builder = org.apache.kafka.streams.state.internals.WindowStoreBuilder@58c6b7cf, timestamped = false, caching = true, logging = false] PASSED
org.apache.kafka.streams.test.MockProcessorContextStateStoreTest > shouldEitherInitOrThrow[builder = org.apache.kafka.streams.state.internals.WindowStoreBuilder@15bfc151, timestamped = false, caching = false, logging = true] STARTED
org.apache.kafka.streams.test.MockProcessorContextStateStoreTest > shouldEitherInitOrThrow[builder = org.apache.kafka.streams.state.internals.WindowStoreBuilder@15bfc151, timestamped = false, caching = false, logging = true] PASSED
org.apache.kafka.streams.test.MockProcessorContextStateStoreTest > shouldEitherInitOrThrow[builder = org.apache.kafka.streams.state.internals.WindowStoreBuilder@300bf52, timestamped = false, caching = false, logging = true] STARTED
org.apache.kafka.streams.test.MockProcessorContextStateStoreTest > shouldEitherInitOrThrow[builder = org.apache.kafka.streams.state.internals.WindowStoreBuilder@300bf52, timestamped = false, caching = false, logging = true] PASSED
org.apache.kafka.streams.test.MockProcessorContextStateStoreTest > shouldEitherInitOrThrow[builder = org.apache.kafka.streams.state.internals.WindowStoreBuilder@48605827, timestamped = false, caching = false, logging = true] STARTED
org.apache.kafka.streams.test.MockProcessorContextStateStoreTest > shouldEitherInitOrThrow[builder = org.apache.kafka.streams.state.internals.WindowStoreBuilder@48605827, timestamped = false, caching = false, logging = true] PASSED
org.apache.kafka.streams.test.MockProcessorContextStateStoreTest > shouldEitherInitOrThrow[builder = org.apache.kafka.streams.state.internals.WindowStoreBuilder@25f5e62b, timestamped = false, caching = false, logging = false] STARTED
org.apache.kafka.streams.test.MockProcessorContextStateStoreTest > shouldEitherInitOrThrow[builder = org.apache.kafka.streams.state.internals.WindowStoreBuilder@25f5e62b, timestamped = false, caching = false, logging = false] PASSED
org.apache.kafka.streams.test.MockProcessorContextStateStoreTest > shouldEitherInitOrThrow[builder = org.apache.kafka.streams.state.internals.WindowStoreBuilder@4eab0e8d, timestamped = false, caching = false, logging = false] STARTED
org.apache.kafka.streams.test.MockProcessorContextStateStoreTest > shouldEitherInitOrThrow[builder = org.apache.kafka.streams.state.internals.WindowStoreBuilder@4eab0e8d, timestamped = false, caching = false, logging = false] PASSED
org.apache.kafka.streams.test.MockProcessorContextStateStoreTest > shouldEitherInitOrThrow[builder = org.apache.kafka.streams.state.internals.WindowStoreBuilder@48d7d225, timestamped = false, caching = false, logging = false] STARTED
org.apache.kafka.streams.test.MockProcessorContextStateStoreTest > shouldEitherInitOrThrow[builder = org.apache.kafka.streams.state.internals.WindowStoreBuilder@48d7d225, timestamped = false, caching = false, logging = false] PASSED
org.apache.kafka.streams.test.MockProcessorContextStateStoreTest > shouldEitherInitOrThrow[builder = org.apache.kafka.streams.state.internals.SessionStoreBuilder@23c0a78, timestamped = false, caching = true, logging = true] STARTED
org.apache.kafka.streams.test.MockProcessorContextStateStoreTest > shouldEitherInitOrThrow[builder = org.apache.kafka.streams.state.internals.SessionStoreBuilder@23c0a78, timestamped = false, caching = true, logging = true] PASSED
org.apache.kafka.streams.test.MockProcessorContextStateStoreTest > shouldEitherInitOrThrow[builder = org.apache.kafka.streams.state.internals.SessionStoreBuilder@8f260aa, timestamped = false, caching = true, logging = true] STARTED
org.apache.kafka.streams.test.MockProcessorContextStateStoreTest > shouldEitherInitOrThrow[builder = org.apache.kafka.streams.state.internals.SessionStoreBuilder@8f260aa, timestamped = false, caching = true, logging = true] PASSED
org.apache.kafka.streams.test.MockProcessorContextStateStoreTest > shouldEitherInitOrThrow[builder = org.apache.kafka.streams.state.internals.SessionStoreBuilder@1e3bc85f, timestamped = false, caching = true, logging = false] STARTED
org.apache.kafka.streams.test.MockProcessorContextStateStoreTest > shouldEitherInitOrThrow[builder = org.apache.kafka.streams.state.internals.SessionStoreBuilder@1e3bc85f, timestamped = false, caching = true, logging = false] PASSED
org.apache.kafka.streams.test.MockProcessorContextStateStoreTest > shouldEitherInitOrThrow[builder = org.apache.kafka.streams.state.internals.SessionStoreBuilder@680b6747, timestamped = false, caching = true, logging = false] STARTED
org.apache.kafka.streams.test.MockProcessorContextStateStoreTest > shouldEitherInitOrThrow[builder = org.apache.kafka.streams.state.internals.SessionStoreBuilder@680b6747, timestamped = false, caching = true, logging = false] PASSED
org.apache.kafka.streams.test.MockProcessorContextStateStoreTest > shouldEitherInitOrThrow[builder = org.apache.kafka.streams.state.internals.SessionStoreBuilder@a06dff4, timestamped = false, caching = false, logging = true] STARTED
org.apache.kafka.streams.test.MockProcessorContextStateStoreTest > shouldEitherInitOrThrow[builder = org.apache.kafka.streams.state.internals.SessionStoreBuilder@a06dff4, timestamped = false, caching = false, logging = true] PASSED
org.apache.kafka.streams.test.MockProcessorContextStateStoreTest > shouldEitherInitOrThrow[builder = org.apache.kafka.streams.state.internals.SessionStoreBuilder@11ea092e, timestamped = false, caching = false, logging = true] STARTED
org.apache.kafka.streams.test.MockProcessorContextStateStoreTest > shouldEitherInitOrThrow[builder = org.apache.kafka.streams.state.internals.SessionStoreBuilder@11ea092e, timestamped = false, caching = false, logging = true] PASSED
org.apache.kafka.streams.test.MockProcessorContextStateStoreTest > shouldEitherInitOrThrow[builder = org.apache.kafka.streams.state.internals.SessionStoreBuilder@51d3527c, timestamped = false, caching = false, logging = false] STARTED
org.apache.kafka.streams.test.MockProcessorContextStateStoreTest > shouldEitherInitOrThrow[builder = org.apache.kafka.streams.state.internals.SessionStoreBuilder@51d3527c, timestamped = false, caching = false, logging = false] PASSED
org.apache.kafka.streams.test.MockProcessorContextStateStoreTest > shouldEitherInitOrThrow[builder = org.apache.kafka.streams.state.internals.SessionStoreBuilder@6251265e, timestamped = false, caching = false, logging = false] STARTED
org.apache.kafka.streams.test.MockProcessorContextStateStoreTest > shouldEitherInitOrThrow[builder = org.apache.kafka.streams.state.internals.SessionStoreBuilder@6251265e, timestamped = false, caching = false, logging = false] PASSED
org.apache.kafka.streams.test.wordcount.WindowedWordCountProcessorTest > shouldWorkWithInMemoryStore STARTED
org.apache.kafka.streams.test.wordcount.WindowedWordCountProcessorTest > shouldWorkWithInMemoryStore PASSED
org.apache.kafka.streams.test.wordcount.WindowedWordCountProcessorTest > shouldWorkWithPersistentStore STARTED
org.apache.kafka.streams.test.wordcount.WindowedWordCountProcessorTest > shouldWorkWithPersistentStore PASSED
org.apache.kafka.streams.internals.KeyValueStoreFacadeTest > shouldReturnIsOpen STARTED
org.apache.kafka.streams.internals.KeyValueStoreFacadeTest > shouldReturnIsOpen PASSED
org.apache.kafka.streams.internals.KeyValueStoreFacadeTest > shouldDeleteAndReturnPlainValue STARTED
org.apache.kafka.streams.internals.KeyValueStoreFacadeTest > shouldDeleteAndReturnPlainValue PASSED
org.apache.kafka.streams.internals.KeyValueStoreFacadeTest > shouldReturnName STARTED
org.apache.kafka.streams.internals.KeyValueStoreFacadeTest > shouldReturnName PASSED
org.apache.kafka.streams.internals.KeyValueStoreFacadeTest > shouldPutWithUnknownTimestamp STARTED
org.apache.kafka.streams.internals.KeyValueStoreFacadeTest > shouldPutWithUnknownTimestamp PASSED
org.apache.kafka.streams.internals.KeyValueStoreFacadeTest > shouldPutAllWithUnknownTimestamp STARTED
org.apache.kafka.streams.internals.KeyValueStoreFacadeTest > shouldPutAllWithUnknownTimestamp PASSED
org.apache.kafka.streams.internals.KeyValueStoreFacadeTest > shouldReturnIsPersistent STARTED
org.apache.kafka.streams.internals.KeyValueStoreFacadeTest > shouldReturnIsPersistent PASSED
org.apache.kafka.streams.internals.KeyValueStoreFacadeTest > shouldForwardDeprecatedInit STARTED
org.apache.kafka.streams.internals.KeyValueStoreFacadeTest > shouldForwardDeprecatedInit PASSED
org.apache.kafka.streams.internals.KeyValueStoreFacadeTest > shouldPutIfAbsentWithUnknownTimestamp STARTED
org.apache.kafka.streams.internals.KeyValueStoreFacadeTest > shouldPutIfAbsentWithUnknownTimestamp PASSED
org.apache.kafka.streams.internals.KeyValueStoreFacadeTest > shouldForwardClose STARTED
org.apache.kafka.streams.internals.KeyValueStoreFacadeTest > shouldForwardClose PASSED
org.apache.kafka.streams.internals.KeyValueStoreFacadeTest > shouldForwardFlush STARTED
org.apache.kafka.streams.internals.KeyValueStoreFacadeTest > shouldForwardFlush PASSED
org.apache.kafka.streams.internals.KeyValueStoreFacadeTest > shouldForwardInit STARTED
org.apache.kafka.streams.internals.KeyValueStoreFacadeTest > shouldForwardInit PASSED
> Task :streams:upgrade-system-tests-0101:spotbugsMain NO-SOURCE
> Task :streams:upgrade-system-tests-0101:test
> Task :streams:upgrade-system-tests-0102:compileJava NO-SOURCE
> Task :streams:upgrade-system-tests-0102:processResources NO-SOURCE
> Task :streams:upgrade-system-tests-0102:classes UP-TO-DATE
> Task :streams:upgrade-system-tests-0102:checkstyleMain NO-SOURCE
> Task :streams:upgrade-system-tests-0102:compileTestJava
> Task :streams:upgrade-system-tests-0102:processTestResources NO-SOURCE
> Task :streams:upgrade-system-tests-0102:testClasses
> Task :streams:upgrade-system-tests-0102:checkstyleTest
> Task :streams:upgrade-system-tests-0102:spotbugsMain NO-SOURCE
> Task :streams:upgrade-system-tests-0102:test
> Task :streams:upgrade-system-tests-0110:compileJava NO-SOURCE
> Task :streams:upgrade-system-tests-0110:processResources NO-SOURCE
> Task :streams:upgrade-system-tests-0110:classes UP-TO-DATE
> Task :streams:upgrade-system-tests-0110:checkstyleMain NO-SOURCE
> Task :streams:upgrade-system-tests-0110:compileTestJava
> Task :streams:upgrade-system-tests-0110:processTestResources NO-SOURCE
> Task :streams:upgrade-system-tests-0110:testClasses
> Task :streams:upgrade-system-tests-0110:checkstyleTest
> Task :streams:upgrade-system-tests-0110:spotbugsMain NO-SOURCE
> Task :streams:upgrade-system-tests-0110:test
> Task :streams:upgrade-system-tests-10:compileJava NO-SOURCE
> Task :streams:upgrade-system-tests-10:processResources NO-SOURCE
> Task :streams:upgrade-system-tests-10:classes UP-TO-DATE
> Task :streams:upgrade-system-tests-10:checkstyleMain NO-SOURCE
> Task :streams:upgrade-system-tests-10:compileTestJava
> Task :streams:upgrade-system-tests-10:processTestResources NO-SOURCE
> Task :streams:upgrade-system-tests-10:testClasses
> Task :streams:upgrade-system-tests-10:checkstyleTest
> Task :streams:upgrade-system-tests-10:spotbugsMain NO-SOURCE
> Task :streams:upgrade-system-tests-10:test
> Task :streams:upgrade-system-tests-11:compileJava NO-SOURCE
> Task :streams:upgrade-system-tests-11:processResources NO-SOURCE
> Task :streams:upgrade-system-tests-11:classes UP-TO-DATE
> Task :streams:upgrade-system-tests-11:checkstyleMain NO-SOURCE
> Task :streams:upgrade-system-tests-11:compileTestJava
> Task :streams:upgrade-system-tests-11:processTestResources NO-SOURCE
> Task :streams:upgrade-system-tests-11:testClasses
> Task :streams:upgrade-system-tests-11:checkstyleTest
> Task :streams:upgrade-system-tests-11:spotbugsMain NO-SOURCE
> Task :streams:upgrade-system-tests-11:test
> Task :streams:upgrade-system-tests-20:compileJava NO-SOURCE
> Task :streams:upgrade-system-tests-20:processResources NO-SOURCE
> Task :streams:upgrade-system-tests-20:classes UP-TO-DATE
> Task :streams:upgrade-system-tests-20:checkstyleMain NO-SOURCE
> Task :streams:upgrade-system-tests-20:compileTestJava
> Task :streams:upgrade-system-tests-20:processTestResources NO-SOURCE
> Task :streams:upgrade-system-tests-20:testClasses
> Task :streams:upgrade-system-tests-20:checkstyleTest
> Task :streams:upgrade-system-tests-20:spotbugsMain NO-SOURCE
> Task :streams:upgrade-system-tests-20:test
> Task :streams:upgrade-system-tests-21:compileJava NO-SOURCE
> Task :streams:upgrade-system-tests-21:processResources NO-SOURCE
> Task :streams:upgrade-system-tests-21:classes UP-TO-DATE
> Task :streams:upgrade-system-tests-21:checkstyleMain NO-SOURCE
> Task :streams:upgrade-system-tests-21:compileTestJava
> Task :streams:upgrade-system-tests-21:processTestResources NO-SOURCE
> Task :streams:upgrade-system-tests-21:testClasses
> Task :streams:upgrade-system-tests-21:checkstyleTest
> Task :streams:upgrade-system-tests-21:spotbugsMain NO-SOURCE
> Task :streams:upgrade-system-tests-21:test
> Task :streams:upgrade-system-tests-22:compileJava NO-SOURCE
> Task :streams:upgrade-system-tests-22:processResources NO-SOURCE
> Task :streams:upgrade-system-tests-22:classes UP-TO-DATE
> Task :streams:upgrade-system-tests-22:checkstyleMain NO-SOURCE
> Task :streams:upgrade-system-tests-22:compileTestJava
> Task :streams:upgrade-system-tests-22:processTestResources NO-SOURCE
> Task :streams:upgrade-system-tests-22:testClasses
> Task :streams:upgrade-system-tests-22:checkstyleTest
> Task :streams:upgrade-system-tests-22:spotbugsMain NO-SOURCE
> Task :streams:upgrade-system-tests-22:test
> Task :streams:upgrade-system-tests-23:compileJava NO-SOURCE
> Task :streams:upgrade-system-tests-23:processResources NO-SOURCE
> Task :streams:upgrade-system-tests-23:classes UP-TO-DATE
> Task :streams:upgrade-system-tests-23:checkstyleMain NO-SOURCE
> Task :streams:upgrade-system-tests-23:compileTestJava
> Task :streams:upgrade-system-tests-23:processTestResources NO-SOURCE
> Task :streams:upgrade-system-tests-23:testClasses
> Task :streams:upgrade-system-tests-23:checkstyleTest
> Task :streams:upgrade-system-tests-23:spotbugsMain NO-SOURCE
> Task :streams:upgrade-system-tests-23:test
> Task :streams:upgrade-system-tests-24:compileJava NO-SOURCE
> Task :streams:upgrade-system-tests-24:processResources NO-SOURCE
> Task :streams:upgrade-system-tests-24:classes UP-TO-DATE
> Task :streams:upgrade-system-tests-24:checkstyleMain NO-SOURCE
> Task :streams:upgrade-system-tests-24:compileTestJava
> Task :streams:upgrade-system-tests-24:processTestResources NO-SOURCE
> Task :streams:upgrade-system-tests-24:testClasses
> Task :streams:upgrade-system-tests-24:checkstyleTest
> Task :streams:upgrade-system-tests-24:spotbugsMain NO-SOURCE
> Task :streams:upgrade-system-tests-24:test
> Task :streams:upgrade-system-tests-25:compileJava NO-SOURCE
> Task :streams:upgrade-system-tests-25:processResources NO-SOURCE
> Task :streams:upgrade-system-tests-25:classes UP-TO-DATE
> Task :streams:upgrade-system-tests-25:checkstyleMain NO-SOURCE
> Task :streams:upgrade-system-tests-25:compileTestJava
> Task :streams:upgrade-system-tests-25:processTestResources NO-SOURCE
> Task :streams:upgrade-system-tests-25:testClasses
> Task :streams:upgrade-system-tests-25:checkstyleTest
> Task :streams:upgrade-system-tests-25:spotbugsMain NO-SOURCE
> Task :streams:upgrade-system-tests-25:test
> Task :streams:upgrade-system-tests-26:compileJava NO-SOURCE
> Task :streams:upgrade-system-tests-26:processResources NO-SOURCE
> Task :streams:upgrade-system-tests-26:classes UP-TO-DATE
> Task :streams:upgrade-system-tests-26:checkstyleMain NO-SOURCE
> Task :streams:upgrade-system-tests-26:compileTestJava
> Task :streams:upgrade-system-tests-26:processTestResources NO-SOURCE
> Task :streams:upgrade-system-tests-26:testClasses
> Task :streams:upgrade-system-tests-26:checkstyleTest
> Task :streams:upgrade-system-tests-26:spotbugsMain NO-SOURCE
> Task :streams:upgrade-system-tests-26:test
FAILURE: Build failed with an exception.
* What went wrong:
Execution failed for task ':core:test'.
> There were failing tests. See the report at: file://<https://ci-builds.apache.org/job/Kafka/job/kafka-trunk-jdk11/ws/core/build/reports/tests/test/index.html>
* Try:
Run with --stacktrace option to get the stack trace. Run with --info or --debug option to get more log output. Run with --scan to get full insights.
* Get more help at https://help.gradle.org
Deprecated Gradle features were used in this build, making it incompatible with Gradle 7.0.
Use '--warning-mode all' to show the individual deprecation warnings.
See https://docs.gradle.org/6.7/userguide/command_line_interface.html#sec:command_line_warnings
BUILD FAILED in 2h 2m 38s
232 actionable tasks: 198 executed, 34 up-to-date
Build step 'Execute shell' marked build as failure
Recording test results
Not sending mail to unregistered user github@hugo-hirsch.de