You are viewing a plain text version of this content. The canonical link for it is here.
Posted to dev@tez.apache.org by Apache Jenkins Server <je...@builds.apache.org> on 2015/10/16 02:26:04 UTC
Build failed in Jenkins: Tez-Build-Hadoop-2.2 #191
See <https://builds.apache.org/job/Tez-Build-Hadoop-2.2/191/changes>
Changes:
[sree] TEZ-2866. Tez UI: Newly added columns wont be displayed by default in
[sseth] TEZ-2896. Fix thread names used during Input/Output initialization.
------------------------------------------
[...truncated 998 lines...]
[32m'app/bower_components/codemirror/mode/sql/sql.js'[39m,
[32m'app/bower_components/codemirror/mode/pig/pig.js'[39m ],
[32m'dist/scripts/templates.js'[39m: [ [32m'.tmp/scripts/compiled-templates.js'[39m ],
[32m'dist/scripts/main.js'[39m: [ [32m'.tmp/scripts/combined-scripts.js'[39m ] }
[1m uglify:[22m
{ [32m'dist/scripts/components.js'[39m: [32m'dist/scripts/components.js'[39m,
[32m'dist/scripts/templates.js'[39m: [32m'dist/scripts/templates.js'[39m,
[32m'dist/scripts/main.js'[39m: [32m'dist/scripts/main.js'[39m }
[1m requirejs:[22m
{}
[4mRunning "concurrent:dist" (concurrent) task[24m
[4mRunning "htmlmin:dist" (htmlmin) task[24m
File dist/index.html created.
[32mDone, without errors.[39m
[4mRunning "svgmin:dist" (svgmin) task[24m
[32mDone, without errors.[39m
[4mRunning "emberTemplates:dist" (emberTemplates) task[24m
File ".tmp/scripts/compiled-templates.js" created.
[4mRunning "emberTemplates:development" (emberTemplates) task[24m
File ".tmp/scripts/compiled-templates.js" created.
[32mDone, without errors.[39m
[4mRunning "neuter:app" (neuter) task[24m
[4mRunning "less:production" (less) task[24m
File .tmp/styles/styles.css created: 385.25 kB → 315.77 kB
[4mRunning "concat:dist/styles/main.css" (concat) task[24m
File "dist/styles/main.css" created.
[4mRunning "concat:dist/scripts/components.js" (concat) task[24m
File "dist/scripts/components.js" created.
[4mRunning "concat:dist/scripts/templates.js" (concat) task[24m
File "dist/scripts/templates.js" created.
[4mRunning "concat:dist/scripts/main.js" (concat) task[24m
File "dist/scripts/main.js" created.
[4mRunning "cssmin:dist" (cssmin) task[24m
File dist/styles/main.css created.
[4mRunning "cssmin:dist/styles/main.css" (cssmin) task[24m
File dist/styles/main.css created.
[4mRunning "copy:dist" (copy) task[24m
Copied [36m27[39m files
[4mRunning "usemin:html" (usemin) task[24m
[1mProcessing as HTML - dist/index.html[22m
Update the HTML to reference our concat/min/revved script files
Update the HTML with the new css filenames
Update the HTML with the new img filenames
Update the HTML with data-main tags
Update the HTML with the data tags
Update the HTML with background imgs, case there is some inline style
Update the HTML with anchors images
Update the HTML with reference in input
[4mRunning "usemin:css" (usemin) task[24m
[1mProcessing as CSS - dist/styles/main.css[22m
Update the CSS with new img filenames
[32mDone, without errors.[39m
[INFO]
[INFO] --- maven-resources-plugin:2.6:resources (default-resources) @ tez-ui ---
[INFO] Using 'UTF-8' encoding to copy filtered resources.
[INFO] Copying 2 resources
[INFO]
[INFO] --- maven-compiler-plugin:3.1:compile (default-compile) @ tez-ui ---
[INFO] No sources to compile
[INFO]
[INFO] --- maven-resources-plugin:2.6:testResources (default-testResources) @ tez-ui ---
[INFO] Using 'UTF-8' encoding to copy filtered resources.
[INFO] skip non existing resourceDirectory <https://builds.apache.org/job/Tez-Build-Hadoop-2.2/ws/tez-ui/src/test/resources>
[INFO]
[INFO] --- maven-compiler-plugin:3.1:testCompile (default-testCompile) @ tez-ui ---
[INFO] No sources to compile
[INFO]
[INFO] --- maven-surefire-plugin:2.14.1:test (default-test) @ tez-ui ---
[INFO] No tests to run.
[INFO]
[INFO] ------------------------------------------------------------------------
[INFO] Building tez-plugins 0.8.2-SNAPSHOT
[INFO] ------------------------------------------------------------------------
[INFO]
[INFO] --- maven-clean-plugin:2.5:clean (default-clean) @ tez-plugins ---
[INFO]
[INFO] --- buildnumber-maven-plugin:1.1:create (default) @ tez-plugins ---
[INFO] Checking for local modifications: skipped.
[INFO] Updating project files from SCM: skipped.
[INFO] Executing: /bin/sh -c cd <https://builds.apache.org/job/Tez-Build-Hadoop-2.2/ws/tez-plugins> && git rev-parse --verify HEAD
[INFO] Working directory: <https://builds.apache.org/job/Tez-Build-Hadoop-2.2/ws/tez-plugins>
[INFO] Storing buildNumber: 25f0247ee77bb483e52298bbf839eb15bc314454 at timestamp: 1444955202323
[INFO] Executing: /bin/sh -c cd <https://builds.apache.org/job/Tez-Build-Hadoop-2.2/ws/tez-plugins> && git rev-parse --verify HEAD
[INFO] Working directory: <https://builds.apache.org/job/Tez-Build-Hadoop-2.2/ws/tez-plugins>
[INFO] Storing buildScmBranch: UNKNOWN
[INFO]
[INFO] --- build-helper-maven-plugin:1.8:maven-version (maven-version) @ tez-plugins ---
[INFO]
[INFO] ------------------------------------------------------------------------
[INFO] Building tez-tools 0.8.2-SNAPSHOT
[INFO] ------------------------------------------------------------------------
[INFO]
[INFO] --- maven-clean-plugin:2.5:clean (default-clean) @ tez-tools ---
[INFO]
[INFO] --- buildnumber-maven-plugin:1.1:create (default) @ tez-tools ---
[INFO] Checking for local modifications: skipped.
[INFO] Updating project files from SCM: skipped.
[INFO] Executing: /bin/sh -c cd <https://builds.apache.org/job/Tez-Build-Hadoop-2.2/ws/tez-tools> && git rev-parse --verify HEAD
[INFO] Working directory: <https://builds.apache.org/job/Tez-Build-Hadoop-2.2/ws/tez-tools>
[INFO] Storing buildNumber: 25f0247ee77bb483e52298bbf839eb15bc314454 at timestamp: 1444955202336
[INFO] Executing: /bin/sh -c cd <https://builds.apache.org/job/Tez-Build-Hadoop-2.2/ws/tez-tools> && git rev-parse --verify HEAD
[INFO] Working directory: <https://builds.apache.org/job/Tez-Build-Hadoop-2.2/ws/tez-tools>
[INFO] Storing buildScmBranch: UNKNOWN
[INFO]
[INFO] --- build-helper-maven-plugin:1.8:maven-version (maven-version) @ tez-tools ---
[INFO]
[INFO] ------------------------------------------------------------------------
[INFO] Building tez-perf-analyzer 0.8.2-SNAPSHOT
[INFO] ------------------------------------------------------------------------
[INFO]
[INFO] --- maven-clean-plugin:2.5:clean (default-clean) @ tez-perf-analyzer ---
[INFO]
[INFO] --- buildnumber-maven-plugin:1.1:create (default) @ tez-perf-analyzer ---
[INFO] Checking for local modifications: skipped.
[INFO] Updating project files from SCM: skipped.
[INFO] Executing: /bin/sh -c cd <https://builds.apache.org/job/Tez-Build-Hadoop-2.2/ws/tez-tools/analyzers> && git rev-parse --verify HEAD
[INFO] Working directory: <https://builds.apache.org/job/Tez-Build-Hadoop-2.2/ws/tez-tools/analyzers>
[INFO] Storing buildNumber: 25f0247ee77bb483e52298bbf839eb15bc314454 at timestamp: 1444955202350
[INFO] Executing: /bin/sh -c cd <https://builds.apache.org/job/Tez-Build-Hadoop-2.2/ws/tez-tools/analyzers> && git rev-parse --verify HEAD
[INFO] Working directory: <https://builds.apache.org/job/Tez-Build-Hadoop-2.2/ws/tez-tools/analyzers>
[INFO] Storing buildScmBranch: UNKNOWN
[INFO]
[INFO] --- build-helper-maven-plugin:1.8:maven-version (maven-version) @ tez-perf-analyzer ---
[INFO]
[INFO] ------------------------------------------------------------------------
[INFO] Building tez-javadoc-tools 0.8.2-SNAPSHOT
[INFO] ------------------------------------------------------------------------
[INFO]
[INFO] --- maven-clean-plugin:2.5:clean (default-clean) @ tez-javadoc-tools ---
[INFO] Deleting <https://builds.apache.org/job/Tez-Build-Hadoop-2.2/ws/tez-tools/tez-javadoc-tools/target>
[INFO]
[INFO] --- buildnumber-maven-plugin:1.1:create (default) @ tez-javadoc-tools ---
[INFO] Checking for local modifications: skipped.
[INFO] Updating project files from SCM: skipped.
[INFO] Executing: /bin/sh -c cd <https://builds.apache.org/job/Tez-Build-Hadoop-2.2/ws/tez-tools/tez-javadoc-tools> && git rev-parse --verify HEAD
[INFO] Working directory: <https://builds.apache.org/job/Tez-Build-Hadoop-2.2/ws/tez-tools/tez-javadoc-tools>
[INFO] Storing buildNumber: 25f0247ee77bb483e52298bbf839eb15bc314454 at timestamp: 1444955202451
[INFO] Executing: /bin/sh -c cd <https://builds.apache.org/job/Tez-Build-Hadoop-2.2/ws/tez-tools/tez-javadoc-tools> && git rev-parse --verify HEAD
[INFO] Working directory: <https://builds.apache.org/job/Tez-Build-Hadoop-2.2/ws/tez-tools/tez-javadoc-tools>
[INFO] Storing buildScmBranch: UNKNOWN
[INFO]
[INFO] --- build-helper-maven-plugin:1.8:maven-version (maven-version) @ tez-javadoc-tools ---
[INFO]
[INFO] --- maven-resources-plugin:2.6:resources (default-resources) @ tez-javadoc-tools ---
[INFO] Using 'UTF-8' encoding to copy filtered resources.
[INFO] skip non existing resourceDirectory <https://builds.apache.org/job/Tez-Build-Hadoop-2.2/ws/tez-tools/tez-javadoc-tools/src/main/resources>
[INFO]
[INFO] --- maven-compiler-plugin:3.1:compile (default-compile) @ tez-javadoc-tools ---
[INFO] Changes detected - recompiling the module!
[INFO] Compiling 6 source files to <https://builds.apache.org/job/Tez-Build-Hadoop-2.2/ws/tez-tools/tez-javadoc-tools/target/classes>
[INFO]
[INFO] --- maven-resources-plugin:2.6:testResources (default-testResources) @ tez-javadoc-tools ---
[INFO] Using 'UTF-8' encoding to copy filtered resources.
[INFO] skip non existing resourceDirectory <https://builds.apache.org/job/Tez-Build-Hadoop-2.2/ws/tez-tools/tez-javadoc-tools/src/test/resources>
[INFO]
[INFO] --- maven-compiler-plugin:3.1:testCompile (default-testCompile) @ tez-javadoc-tools ---
[INFO] No sources to compile
[INFO]
[INFO] --- maven-surefire-plugin:2.14.1:test (default-test) @ tez-javadoc-tools ---
[INFO] No tests to run.
[INFO]
[INFO] ------------------------------------------------------------------------
[INFO] Skipping tez-dist
[INFO] This project has been banned from the build due to previous failures.
[INFO] ------------------------------------------------------------------------
[INFO]
[INFO] ------------------------------------------------------------------------
[INFO] Building Tez 0.8.2-SNAPSHOT
[INFO] ------------------------------------------------------------------------
[INFO]
[INFO] --- maven-clean-plugin:2.5:clean (default-clean) @ tez-docs ---
[INFO]
[INFO] --- buildnumber-maven-plugin:1.1:create (default) @ tez-docs ---
[INFO] Checking for local modifications: skipped.
[INFO] Updating project files from SCM: skipped.
[INFO] Executing: /bin/sh -c cd <https://builds.apache.org/job/Tez-Build-Hadoop-2.2/ws/docs> && git rev-parse --verify HEAD
[INFO] Working directory: <https://builds.apache.org/job/Tez-Build-Hadoop-2.2/ws/docs>
[INFO] Storing buildNumber: 25f0247ee77bb483e52298bbf839eb15bc314454 at timestamp: 1444955202610
[INFO] Executing: /bin/sh -c cd <https://builds.apache.org/job/Tez-Build-Hadoop-2.2/ws/docs> && git rev-parse --verify HEAD
[INFO] Working directory: <https://builds.apache.org/job/Tez-Build-Hadoop-2.2/ws/docs>
[INFO] Storing buildScmBranch: UNKNOWN
[INFO]
[INFO] --- build-helper-maven-plugin:1.8:maven-version (maven-version) @ tez-docs ---
[INFO] ------------------------------------------------------------------------
[INFO] Reactor Summary:
[INFO]
[INFO] tez ............................................... SUCCESS [ 1.484 s]
[INFO] tez-api ........................................... SUCCESS [ 47.896 s]
[INFO] tez-common ........................................ SUCCESS [ 4.639 s]
[INFO] tez-runtime-internals ............................. SUCCESS [ 14.874 s]
[INFO] tez-runtime-library ............................... SUCCESS [02:31 min]
[INFO] tez-mapreduce ..................................... SUCCESS [ 42.401 s]
[INFO] tez-examples ...................................... SUCCESS [ 0.328 s]
[INFO] tez-dag ........................................... FAILURE [03:02 min]
[INFO] tez-tests ......................................... SKIPPED
[INFO] tez-ext-service-tests ............................. SKIPPED
[INFO] tez-ui ............................................ SUCCESS [ 29.137 s]
[INFO] tez-plugins ....................................... SUCCESS [ 0.012 s]
[INFO] tez-tools ......................................... SUCCESS [ 0.014 s]
[INFO] tez-perf-analyzer ................................. SUCCESS [ 0.015 s]
[INFO] tez-javadoc-tools ................................. SUCCESS [ 0.246 s]
[INFO] tez-dist .......................................... SKIPPED
[INFO] Tez ............................................... SUCCESS [ 0.013 s]
[INFO] ------------------------------------------------------------------------
[INFO] BUILD FAILURE
[INFO] ------------------------------------------------------------------------
[INFO] Total time: 07:55 min
[INFO] Finished at: 2015-10-16T00:26:42+00:00
[INFO] Final Memory: 50M/793M
[INFO] ------------------------------------------------------------------------
[ERROR] Failed to execute goal org.apache.maven.plugins:maven-surefire-plugin:2.14.1:test (default-test) on project tez-dag: There are test failures.
[ERROR]
[ERROR] Please refer to <https://builds.apache.org/job/Tez-Build-Hadoop-2.2/ws/tez-dag/target/surefire-reports> for the individual test results.
[ERROR] -> [Help 1]
[ERROR]
[ERROR] To see the full stack trace of the errors, re-run Maven with the -e switch.
[ERROR] Re-run Maven using the -X switch to enable full debug logging.
[ERROR]
[ERROR] For more information about the errors and possible solutions, please read the following articles:
[ERROR] [Help 1] http://cwiki.apache.org/confluence/display/MAVEN/MojoFailureException
[ERROR]
[ERROR] After correcting the problems, you can resume the build with the command
[ERROR] mvn <goals> -rf :tez-dag
Build step 'Execute shell' marked build as failure
Recording test results
Jenkins build is back to normal : Tez-Build-Hadoop-2.2 #197
Posted by Apache Jenkins Server <je...@builds.apache.org>.
See <https://builds.apache.org/job/Tez-Build-Hadoop-2.2/197/changes>
Build failed in Jenkins: Tez-Build-Hadoop-2.2 #196
Posted by Apache Jenkins Server <je...@builds.apache.org>.
See <https://builds.apache.org/job/Tez-Build-Hadoop-2.2/196/changes>
Changes:
[bikas] TEZ-2888. Make critical path calculation resilient to AM crash (bikas)
------------------------------------------
[...truncated 867 lines...]
[32m'app/bower_components/codemirror/mode/pig/pig.js'[39m ],
[32m'dist/scripts/templates.js'[39m: [ [32m'.tmp/scripts/compiled-templates.js'[39m ],
[32m'dist/scripts/main.js'[39m: [ [32m'.tmp/scripts/combined-scripts.js'[39m ] }
[1m uglify:[22m
{ [32m'dist/scripts/components.js'[39m: [32m'dist/scripts/components.js'[39m,
[32m'dist/scripts/templates.js'[39m: [32m'dist/scripts/templates.js'[39m,
[32m'dist/scripts/main.js'[39m: [32m'dist/scripts/main.js'[39m }
[1m requirejs:[22m
{}
[4mRunning "concurrent:dist" (concurrent) task[24m
[4mRunning "htmlmin:dist" (htmlmin) task[24m
File dist/index.html created.
[32mDone, without errors.[39m
[4mRunning "svgmin:dist" (svgmin) task[24m
[32mDone, without errors.[39m
[4mRunning "emberTemplates:dist" (emberTemplates) task[24m
File ".tmp/scripts/compiled-templates.js" created.
[4mRunning "emberTemplates:development" (emberTemplates) task[24m
File ".tmp/scripts/compiled-templates.js" created.
[32mDone, without errors.[39m
[4mRunning "neuter:app" (neuter) task[24m
[4mRunning "less:production" (less) task[24m
File .tmp/styles/styles.css created: 385.25 kB â 315.77 kB
[4mRunning "concat:dist/styles/main.css" (concat) task[24m
File "dist/styles/main.css" created.
[4mRunning "concat:dist/scripts/components.js" (concat) task[24m
File "dist/scripts/components.js" created.
[4mRunning "concat:dist/scripts/templates.js" (concat) task[24m
File "dist/scripts/templates.js" created.
[4mRunning "concat:dist/scripts/main.js" (concat) task[24m
File "dist/scripts/main.js" created.
[4mRunning "cssmin:dist" (cssmin) task[24m
File dist/styles/main.css created.
[4mRunning "cssmin:dist/styles/main.css" (cssmin) task[24m
File dist/styles/main.css created.
[4mRunning "copy:dist" (copy) task[24m
Copied [36m27[39m files
[4mRunning "usemin:html" (usemin) task[24m
[1mProcessing as HTML - dist/index.html[22m
Update the HTML to reference our concat/min/revved script files
Update the HTML with the new css filenames
Update the HTML with the new img filenames
Update the HTML with data-main tags
Update the HTML with the data tags
Update the HTML with background imgs, case there is some inline style
Update the HTML with anchors images
Update the HTML with reference in input
[4mRunning "usemin:css" (usemin) task[24m
[1mProcessing as CSS - dist/styles/main.css[22m
Update the CSS with new img filenames
[32mDone, without errors.[39m
[INFO]
[INFO] --- maven-resources-plugin:2.6:resources (default-resources) @ tez-ui ---
[INFO] Using 'UTF-8' encoding to copy filtered resources.
[INFO] Copying 2 resources
[INFO]
[INFO] --- maven-compiler-plugin:3.1:compile (default-compile) @ tez-ui ---
[INFO] No sources to compile
[INFO]
[INFO] --- maven-resources-plugin:2.6:testResources (default-testResources) @ tez-ui ---
[INFO] Using 'UTF-8' encoding to copy filtered resources.
[INFO] skip non existing resourceDirectory <https://builds.apache.org/job/Tez-Build-Hadoop-2.2/ws/tez-ui/src/test/resources>
[INFO]
[INFO] --- maven-compiler-plugin:3.1:testCompile (default-testCompile) @ tez-ui ---
[INFO] No sources to compile
[INFO]
[INFO] --- maven-surefire-plugin:2.14.1:test (default-test) @ tez-ui ---
[INFO] No tests to run.
[INFO]
[INFO] ------------------------------------------------------------------------
[INFO] Building tez-plugins 0.8.2-SNAPSHOT
[INFO] ------------------------------------------------------------------------
[INFO]
[INFO] --- maven-clean-plugin:2.5:clean (default-clean) @ tez-plugins ---
[INFO]
[INFO] --- buildnumber-maven-plugin:1.1:create (default) @ tez-plugins ---
[INFO] Checking for local modifications: skipped.
[INFO] Updating project files from SCM: skipped.
[INFO] Executing: /bin/sh -c cd <https://builds.apache.org/job/Tez-Build-Hadoop-2.2/ws/tez-plugins> && git rev-parse --verify HEAD
[INFO] Working directory: <https://builds.apache.org/job/Tez-Build-Hadoop-2.2/ws/tez-plugins>
[INFO] Storing buildNumber: fede4c7713bfa34c825fbc9dc532475f98b67e2e at timestamp: 1445998602992
[INFO] Executing: /bin/sh -c cd <https://builds.apache.org/job/Tez-Build-Hadoop-2.2/ws/tez-plugins> && git rev-parse --verify HEAD
[INFO] Working directory: <https://builds.apache.org/job/Tez-Build-Hadoop-2.2/ws/tez-plugins>
[INFO] Storing buildScmBranch: UNKNOWN
[INFO]
[INFO] --- build-helper-maven-plugin:1.8:maven-version (maven-version) @ tez-plugins ---
[INFO]
[INFO] ------------------------------------------------------------------------
[INFO] Building tez-tools 0.8.2-SNAPSHOT
[INFO] ------------------------------------------------------------------------
[INFO]
[INFO] --- maven-clean-plugin:2.5:clean (default-clean) @ tez-tools ---
[INFO]
[INFO] --- buildnumber-maven-plugin:1.1:create (default) @ tez-tools ---
[INFO] Checking for local modifications: skipped.
[INFO] Updating project files from SCM: skipped.
[INFO] Executing: /bin/sh -c cd <https://builds.apache.org/job/Tez-Build-Hadoop-2.2/ws/tez-tools> && git rev-parse --verify HEAD
[INFO] Working directory: <https://builds.apache.org/job/Tez-Build-Hadoop-2.2/ws/tez-tools>
[INFO] Storing buildNumber: fede4c7713bfa34c825fbc9dc532475f98b67e2e at timestamp: 1445998603005
[INFO] Executing: /bin/sh -c cd <https://builds.apache.org/job/Tez-Build-Hadoop-2.2/ws/tez-tools> && git rev-parse --verify HEAD
[INFO] Working directory: <https://builds.apache.org/job/Tez-Build-Hadoop-2.2/ws/tez-tools>
[INFO] Storing buildScmBranch: UNKNOWN
[INFO]
[INFO] --- build-helper-maven-plugin:1.8:maven-version (maven-version) @ tez-tools ---
[INFO]
[INFO] ------------------------------------------------------------------------
[INFO] Building tez-perf-analyzer 0.8.2-SNAPSHOT
[INFO] ------------------------------------------------------------------------
[INFO]
[INFO] --- maven-clean-plugin:2.5:clean (default-clean) @ tez-perf-analyzer ---
[INFO]
[INFO] --- buildnumber-maven-plugin:1.1:create (default) @ tez-perf-analyzer ---
[INFO] Checking for local modifications: skipped.
[INFO] Updating project files from SCM: skipped.
[INFO] Executing: /bin/sh -c cd <https://builds.apache.org/job/Tez-Build-Hadoop-2.2/ws/tez-tools/analyzers> && git rev-parse --verify HEAD
[INFO] Working directory: <https://builds.apache.org/job/Tez-Build-Hadoop-2.2/ws/tez-tools/analyzers>
[INFO] Storing buildNumber: fede4c7713bfa34c825fbc9dc532475f98b67e2e at timestamp: 1445998603017
[INFO] Executing: /bin/sh -c cd <https://builds.apache.org/job/Tez-Build-Hadoop-2.2/ws/tez-tools/analyzers> && git rev-parse --verify HEAD
[INFO] Working directory: <https://builds.apache.org/job/Tez-Build-Hadoop-2.2/ws/tez-tools/analyzers>
[INFO] Storing buildScmBranch: UNKNOWN
[INFO]
[INFO] --- build-helper-maven-plugin:1.8:maven-version (maven-version) @ tez-perf-analyzer ---
[INFO]
[INFO] ------------------------------------------------------------------------
[INFO] Building tez-javadoc-tools 0.8.2-SNAPSHOT
[INFO] ------------------------------------------------------------------------
[INFO]
[INFO] --- maven-clean-plugin:2.5:clean (default-clean) @ tez-javadoc-tools ---
[INFO] Deleting <https://builds.apache.org/job/Tez-Build-Hadoop-2.2/ws/tez-tools/tez-javadoc-tools/target>
[INFO]
[INFO] --- buildnumber-maven-plugin:1.1:create (default) @ tez-javadoc-tools ---
[INFO] Checking for local modifications: skipped.
[INFO] Updating project files from SCM: skipped.
[INFO] Executing: /bin/sh -c cd <https://builds.apache.org/job/Tez-Build-Hadoop-2.2/ws/tez-tools/tez-javadoc-tools> && git rev-parse --verify HEAD
[INFO] Working directory: <https://builds.apache.org/job/Tez-Build-Hadoop-2.2/ws/tez-tools/tez-javadoc-tools>
[INFO] Storing buildNumber: fede4c7713bfa34c825fbc9dc532475f98b67e2e at timestamp: 1445998603104
[INFO] Executing: /bin/sh -c cd <https://builds.apache.org/job/Tez-Build-Hadoop-2.2/ws/tez-tools/tez-javadoc-tools> && git rev-parse --verify HEAD
[INFO] Working directory: <https://builds.apache.org/job/Tez-Build-Hadoop-2.2/ws/tez-tools/tez-javadoc-tools>
[INFO] Storing buildScmBranch: UNKNOWN
[INFO]
[INFO] --- build-helper-maven-plugin:1.8:maven-version (maven-version) @ tez-javadoc-tools ---
[INFO]
[INFO] --- maven-resources-plugin:2.6:resources (default-resources) @ tez-javadoc-tools ---
[INFO] Using 'UTF-8' encoding to copy filtered resources.
[INFO] skip non existing resourceDirectory <https://builds.apache.org/job/Tez-Build-Hadoop-2.2/ws/tez-tools/tez-javadoc-tools/src/main/resources>
[INFO]
[INFO] --- maven-compiler-plugin:3.1:compile (default-compile) @ tez-javadoc-tools ---
[INFO] Changes detected - recompiling the module!
[INFO] Compiling 6 source files to <https://builds.apache.org/job/Tez-Build-Hadoop-2.2/ws/tez-tools/tez-javadoc-tools/target/classes>
[INFO]
[INFO] --- maven-resources-plugin:2.6:testResources (default-testResources) @ tez-javadoc-tools ---
[INFO] Using 'UTF-8' encoding to copy filtered resources.
[INFO] skip non existing resourceDirectory <https://builds.apache.org/job/Tez-Build-Hadoop-2.2/ws/tez-tools/tez-javadoc-tools/src/test/resources>
[INFO]
[INFO] --- maven-compiler-plugin:3.1:testCompile (default-testCompile) @ tez-javadoc-tools ---
[INFO] No sources to compile
[INFO]
[INFO] --- maven-surefire-plugin:2.14.1:test (default-test) @ tez-javadoc-tools ---
[INFO] No tests to run.
[INFO]
[INFO] ------------------------------------------------------------------------
[INFO] Skipping tez-dist
[INFO] This project has been banned from the build due to previous failures.
[INFO] ------------------------------------------------------------------------
[INFO]
[INFO] ------------------------------------------------------------------------
[INFO] Building Tez 0.8.2-SNAPSHOT
[INFO] ------------------------------------------------------------------------
[INFO]
[INFO] --- maven-clean-plugin:2.5:clean (default-clean) @ tez-docs ---
[INFO]
[INFO] --- buildnumber-maven-plugin:1.1:create (default) @ tez-docs ---
[INFO] Checking for local modifications: skipped.
[INFO] Updating project files from SCM: skipped.
[INFO] Executing: /bin/sh -c cd <https://builds.apache.org/job/Tez-Build-Hadoop-2.2/ws/docs> && git rev-parse --verify HEAD
[INFO] Working directory: <https://builds.apache.org/job/Tez-Build-Hadoop-2.2/ws/docs>
[INFO] Storing buildNumber: fede4c7713bfa34c825fbc9dc532475f98b67e2e at timestamp: 1445998603214
[INFO] Executing: /bin/sh -c cd <https://builds.apache.org/job/Tez-Build-Hadoop-2.2/ws/docs> && git rev-parse --verify HEAD
[INFO] Working directory: <https://builds.apache.org/job/Tez-Build-Hadoop-2.2/ws/docs>
[INFO] Storing buildScmBranch: UNKNOWN
[INFO]
[INFO] --- build-helper-maven-plugin:1.8:maven-version (maven-version) @ tez-docs ---
[INFO] ------------------------------------------------------------------------
[INFO] Reactor Summary:
[INFO]
[INFO] tez ............................................... SUCCESS [ 1.597 s]
[INFO] tez-api ........................................... SUCCESS [ 46.811 s]
[INFO] tez-common ........................................ SUCCESS [ 4.785 s]
[INFO] tez-runtime-internals ............................. SUCCESS [ 13.814 s]
[INFO] tez-runtime-library ............................... SUCCESS [02:25 min]
[INFO] tez-mapreduce ..................................... SUCCESS [ 32.886 s]
[INFO] tez-examples ...................................... SUCCESS [ 0.407 s]
[INFO] tez-dag ........................................... FAILURE [ 4.360 s]
[INFO] tez-tests ......................................... SKIPPED
[INFO] tez-ext-service-tests ............................. SKIPPED
[INFO] tez-ui ............................................ SUCCESS [ 19.352 s]
[INFO] tez-plugins ....................................... SUCCESS [ 0.012 s]
[INFO] tez-tools ......................................... SUCCESS [ 0.013 s]
[INFO] tez-perf-analyzer ................................. SUCCESS [ 0.013 s]
[INFO] tez-javadoc-tools ................................. SUCCESS [ 0.183 s]
[INFO] tez-dist .......................................... SKIPPED
[INFO] Tez ............................................... SUCCESS [ 0.015 s]
[INFO] ------------------------------------------------------------------------
[INFO] BUILD FAILURE
[INFO] ------------------------------------------------------------------------
[INFO] Total time: 04:30 min
[INFO] Finished at: 2015-10-28T02:16:43+00:00
[INFO] Final Memory: 55M/898M
[INFO] ------------------------------------------------------------------------
[ERROR] Failed to execute goal org.apache.maven.plugins:maven-compiler-plugin:3.1:testCompile (default-testCompile) on project tez-dag: Compilation failure
[ERROR] <https://builds.apache.org/job/Tez-Build-Hadoop-2.2/ws/tez-dag/src/test/java/org/apache/tez/dag/app/TestDAGAppMaster.java>:[396,20] cannot find symbol
[ERROR] symbol: method newContainerId(org.apache.hadoop.yarn.api.records.ApplicationAttemptId,int)
[ERROR] location: class org.apache.hadoop.yarn.api.records.ContainerId
[ERROR] -> [Help 1]
[ERROR]
[ERROR] To see the full stack trace of the errors, re-run Maven with the -e switch.
[ERROR] Re-run Maven using the -X switch to enable full debug logging.
[ERROR]
[ERROR] For more information about the errors and possible solutions, please read the following articles:
[ERROR] [Help 1] http://cwiki.apache.org/confluence/display/MAVEN/MojoFailureException
[ERROR]
[ERROR] After correcting the problems, you can resume the build with the command
[ERROR] mvn <goals> -rf :tez-dag
Build step 'Execute shell' marked build as failure
Recording test results
Build failed in Jenkins: Tez-Build-Hadoop-2.2 #195
Posted by Apache Jenkins Server <je...@builds.apache.org>.
See <https://builds.apache.org/job/Tez-Build-Hadoop-2.2/195/changes>
Changes:
[jeagles] TEZ-2899. Tez UI: DAG getting created with huge horizontal gap in
[jeagles] TEZ-2899. CHANGES.txt
------------------------------------------
[...truncated 867 lines...]
[32m'app/bower_components/codemirror/mode/pig/pig.js'[39m ],
[32m'dist/scripts/templates.js'[39m: [ [32m'.tmp/scripts/compiled-templates.js'[39m ],
[32m'dist/scripts/main.js'[39m: [ [32m'.tmp/scripts/combined-scripts.js'[39m ] }
[1m uglify:[22m
{ [32m'dist/scripts/components.js'[39m: [32m'dist/scripts/components.js'[39m,
[32m'dist/scripts/templates.js'[39m: [32m'dist/scripts/templates.js'[39m,
[32m'dist/scripts/main.js'[39m: [32m'dist/scripts/main.js'[39m }
[1m requirejs:[22m
{}
[4mRunning "concurrent:dist" (concurrent) task[24m
[4mRunning "htmlmin:dist" (htmlmin) task[24m
File dist/index.html created.
[32mDone, without errors.[39m
[4mRunning "svgmin:dist" (svgmin) task[24m
[32mDone, without errors.[39m
[4mRunning "emberTemplates:dist" (emberTemplates) task[24m
File ".tmp/scripts/compiled-templates.js" created.
[4mRunning "emberTemplates:development" (emberTemplates) task[24m
File ".tmp/scripts/compiled-templates.js" created.
[32mDone, without errors.[39m
[4mRunning "neuter:app" (neuter) task[24m
[4mRunning "less:production" (less) task[24m
File .tmp/styles/styles.css created: 385.25 kB â 315.77 kB
[4mRunning "concat:dist/styles/main.css" (concat) task[24m
File "dist/styles/main.css" created.
[4mRunning "concat:dist/scripts/components.js" (concat) task[24m
File "dist/scripts/components.js" created.
[4mRunning "concat:dist/scripts/templates.js" (concat) task[24m
File "dist/scripts/templates.js" created.
[4mRunning "concat:dist/scripts/main.js" (concat) task[24m
File "dist/scripts/main.js" created.
[4mRunning "cssmin:dist" (cssmin) task[24m
File dist/styles/main.css created.
[4mRunning "cssmin:dist/styles/main.css" (cssmin) task[24m
File dist/styles/main.css created.
[4mRunning "copy:dist" (copy) task[24m
Copied [36m27[39m files
[4mRunning "usemin:html" (usemin) task[24m
[1mProcessing as HTML - dist/index.html[22m
Update the HTML to reference our concat/min/revved script files
Update the HTML with the new css filenames
Update the HTML with the new img filenames
Update the HTML with data-main tags
Update the HTML with the data tags
Update the HTML with background imgs, case there is some inline style
Update the HTML with anchors images
Update the HTML with reference in input
[4mRunning "usemin:css" (usemin) task[24m
[1mProcessing as CSS - dist/styles/main.css[22m
Update the CSS with new img filenames
[32mDone, without errors.[39m
[INFO]
[INFO] --- maven-resources-plugin:2.6:resources (default-resources) @ tez-ui ---
[INFO] Using 'UTF-8' encoding to copy filtered resources.
[INFO] Copying 2 resources
[INFO]
[INFO] --- maven-compiler-plugin:3.1:compile (default-compile) @ tez-ui ---
[INFO] No sources to compile
[INFO]
[INFO] --- maven-resources-plugin:2.6:testResources (default-testResources) @ tez-ui ---
[INFO] Using 'UTF-8' encoding to copy filtered resources.
[INFO] skip non existing resourceDirectory <https://builds.apache.org/job/Tez-Build-Hadoop-2.2/ws/tez-ui/src/test/resources>
[INFO]
[INFO] --- maven-compiler-plugin:3.1:testCompile (default-testCompile) @ tez-ui ---
[INFO] No sources to compile
[INFO]
[INFO] --- maven-surefire-plugin:2.14.1:test (default-test) @ tez-ui ---
[INFO] No tests to run.
[INFO]
[INFO] ------------------------------------------------------------------------
[INFO] Building tez-plugins 0.8.2-SNAPSHOT
[INFO] ------------------------------------------------------------------------
[INFO]
[INFO] --- maven-clean-plugin:2.5:clean (default-clean) @ tez-plugins ---
[INFO]
[INFO] --- buildnumber-maven-plugin:1.1:create (default) @ tez-plugins ---
[INFO] Checking for local modifications: skipped.
[INFO] Updating project files from SCM: skipped.
[INFO] Executing: /bin/sh -c cd <https://builds.apache.org/job/Tez-Build-Hadoop-2.2/ws/tez-plugins> && git rev-parse --verify HEAD
[INFO] Working directory: <https://builds.apache.org/job/Tez-Build-Hadoop-2.2/ws/tez-plugins>
[INFO] Storing buildNumber: c35e5cc8613e7f22dc49b6f9b05038465f82d641 at timestamp: 1445912935304
[INFO] Executing: /bin/sh -c cd <https://builds.apache.org/job/Tez-Build-Hadoop-2.2/ws/tez-plugins> && git rev-parse --verify HEAD
[INFO] Working directory: <https://builds.apache.org/job/Tez-Build-Hadoop-2.2/ws/tez-plugins>
[INFO] Storing buildScmBranch: UNKNOWN
[INFO]
[INFO] --- build-helper-maven-plugin:1.8:maven-version (maven-version) @ tez-plugins ---
[INFO]
[INFO] ------------------------------------------------------------------------
[INFO] Building tez-tools 0.8.2-SNAPSHOT
[INFO] ------------------------------------------------------------------------
[INFO]
[INFO] --- maven-clean-plugin:2.5:clean (default-clean) @ tez-tools ---
[INFO]
[INFO] --- buildnumber-maven-plugin:1.1:create (default) @ tez-tools ---
[INFO] Checking for local modifications: skipped.
[INFO] Updating project files from SCM: skipped.
[INFO] Executing: /bin/sh -c cd <https://builds.apache.org/job/Tez-Build-Hadoop-2.2/ws/tez-tools> && git rev-parse --verify HEAD
[INFO] Working directory: <https://builds.apache.org/job/Tez-Build-Hadoop-2.2/ws/tez-tools>
[INFO] Storing buildNumber: c35e5cc8613e7f22dc49b6f9b05038465f82d641 at timestamp: 1445912935321
[INFO] Executing: /bin/sh -c cd <https://builds.apache.org/job/Tez-Build-Hadoop-2.2/ws/tez-tools> && git rev-parse --verify HEAD
[INFO] Working directory: <https://builds.apache.org/job/Tez-Build-Hadoop-2.2/ws/tez-tools>
[INFO] Storing buildScmBranch: UNKNOWN
[INFO]
[INFO] --- build-helper-maven-plugin:1.8:maven-version (maven-version) @ tez-tools ---
[INFO]
[INFO] ------------------------------------------------------------------------
[INFO] Building tez-perf-analyzer 0.8.2-SNAPSHOT
[INFO] ------------------------------------------------------------------------
[INFO]
[INFO] --- maven-clean-plugin:2.5:clean (default-clean) @ tez-perf-analyzer ---
[INFO]
[INFO] --- buildnumber-maven-plugin:1.1:create (default) @ tez-perf-analyzer ---
[INFO] Checking for local modifications: skipped.
[INFO] Updating project files from SCM: skipped.
[INFO] Executing: /bin/sh -c cd <https://builds.apache.org/job/Tez-Build-Hadoop-2.2/ws/tez-tools/analyzers> && git rev-parse --verify HEAD
[INFO] Working directory: <https://builds.apache.org/job/Tez-Build-Hadoop-2.2/ws/tez-tools/analyzers>
[INFO] Storing buildNumber: c35e5cc8613e7f22dc49b6f9b05038465f82d641 at timestamp: 1445912935335
[INFO] Executing: /bin/sh -c cd <https://builds.apache.org/job/Tez-Build-Hadoop-2.2/ws/tez-tools/analyzers> && git rev-parse --verify HEAD
[INFO] Working directory: <https://builds.apache.org/job/Tez-Build-Hadoop-2.2/ws/tez-tools/analyzers>
[INFO] Storing buildScmBranch: UNKNOWN
[INFO]
[INFO] --- build-helper-maven-plugin:1.8:maven-version (maven-version) @ tez-perf-analyzer ---
[INFO]
[INFO] ------------------------------------------------------------------------
[INFO] Building tez-javadoc-tools 0.8.2-SNAPSHOT
[INFO] ------------------------------------------------------------------------
[INFO]
[INFO] --- maven-clean-plugin:2.5:clean (default-clean) @ tez-javadoc-tools ---
[INFO] Deleting <https://builds.apache.org/job/Tez-Build-Hadoop-2.2/ws/tez-tools/tez-javadoc-tools/target>
[INFO]
[INFO] --- buildnumber-maven-plugin:1.1:create (default) @ tez-javadoc-tools ---
[INFO] Checking for local modifications: skipped.
[INFO] Updating project files from SCM: skipped.
[INFO] Executing: /bin/sh -c cd <https://builds.apache.org/job/Tez-Build-Hadoop-2.2/ws/tez-tools/tez-javadoc-tools> && git rev-parse --verify HEAD
[INFO] Working directory: <https://builds.apache.org/job/Tez-Build-Hadoop-2.2/ws/tez-tools/tez-javadoc-tools>
[INFO] Storing buildNumber: c35e5cc8613e7f22dc49b6f9b05038465f82d641 at timestamp: 1445912935419
[INFO] Executing: /bin/sh -c cd <https://builds.apache.org/job/Tez-Build-Hadoop-2.2/ws/tez-tools/tez-javadoc-tools> && git rev-parse --verify HEAD
[INFO] Working directory: <https://builds.apache.org/job/Tez-Build-Hadoop-2.2/ws/tez-tools/tez-javadoc-tools>
[INFO] Storing buildScmBranch: UNKNOWN
[INFO]
[INFO] --- build-helper-maven-plugin:1.8:maven-version (maven-version) @ tez-javadoc-tools ---
[INFO]
[INFO] --- maven-resources-plugin:2.6:resources (default-resources) @ tez-javadoc-tools ---
[INFO] Using 'UTF-8' encoding to copy filtered resources.
[INFO] skip non existing resourceDirectory <https://builds.apache.org/job/Tez-Build-Hadoop-2.2/ws/tez-tools/tez-javadoc-tools/src/main/resources>
[INFO]
[INFO] --- maven-compiler-plugin:3.1:compile (default-compile) @ tez-javadoc-tools ---
[INFO] Changes detected - recompiling the module!
[INFO] Compiling 6 source files to <https://builds.apache.org/job/Tez-Build-Hadoop-2.2/ws/tez-tools/tez-javadoc-tools/target/classes>
[INFO]
[INFO] --- maven-resources-plugin:2.6:testResources (default-testResources) @ tez-javadoc-tools ---
[INFO] Using 'UTF-8' encoding to copy filtered resources.
[INFO] skip non existing resourceDirectory <https://builds.apache.org/job/Tez-Build-Hadoop-2.2/ws/tez-tools/tez-javadoc-tools/src/test/resources>
[INFO]
[INFO] --- maven-compiler-plugin:3.1:testCompile (default-testCompile) @ tez-javadoc-tools ---
[INFO] No sources to compile
[INFO]
[INFO] --- maven-surefire-plugin:2.14.1:test (default-test) @ tez-javadoc-tools ---
[INFO] No tests to run.
[INFO]
[INFO] ------------------------------------------------------------------------
[INFO] Skipping tez-dist
[INFO] This project has been banned from the build due to previous failures.
[INFO] ------------------------------------------------------------------------
[INFO]
[INFO] ------------------------------------------------------------------------
[INFO] Building Tez 0.8.2-SNAPSHOT
[INFO] ------------------------------------------------------------------------
[INFO]
[INFO] --- maven-clean-plugin:2.5:clean (default-clean) @ tez-docs ---
[INFO]
[INFO] --- buildnumber-maven-plugin:1.1:create (default) @ tez-docs ---
[INFO] Checking for local modifications: skipped.
[INFO] Updating project files from SCM: skipped.
[INFO] Executing: /bin/sh -c cd <https://builds.apache.org/job/Tez-Build-Hadoop-2.2/ws/docs> && git rev-parse --verify HEAD
[INFO] Working directory: <https://builds.apache.org/job/Tez-Build-Hadoop-2.2/ws/docs>
[INFO] Storing buildNumber: c35e5cc8613e7f22dc49b6f9b05038465f82d641 at timestamp: 1445912935547
[INFO] Executing: /bin/sh -c cd <https://builds.apache.org/job/Tez-Build-Hadoop-2.2/ws/docs> && git rev-parse --verify HEAD
[INFO] Working directory: <https://builds.apache.org/job/Tez-Build-Hadoop-2.2/ws/docs>
[INFO] Storing buildScmBranch: UNKNOWN
[INFO]
[INFO] --- build-helper-maven-plugin:1.8:maven-version (maven-version) @ tez-docs ---
[INFO] ------------------------------------------------------------------------
[INFO] Reactor Summary:
[INFO]
[INFO] tez ............................................... SUCCESS [ 1.822 s]
[INFO] tez-api ........................................... SUCCESS [ 47.938 s]
[INFO] tez-common ........................................ SUCCESS [ 4.745 s]
[INFO] tez-runtime-internals ............................. SUCCESS [ 13.642 s]
[INFO] tez-runtime-library ............................... SUCCESS [02:28 min]
[INFO] tez-mapreduce ..................................... SUCCESS [ 32.577 s]
[INFO] tez-examples ...................................... SUCCESS [ 0.394 s]
[INFO] tez-dag ........................................... FAILURE [ 4.470 s]
[INFO] tez-tests ......................................... SKIPPED
[INFO] tez-ext-service-tests ............................. SKIPPED
[INFO] tez-ui ............................................ SUCCESS [ 23.342 s]
[INFO] tez-plugins ....................................... SUCCESS [ 0.016 s]
[INFO] tez-tools ......................................... SUCCESS [ 0.014 s]
[INFO] tez-perf-analyzer ................................. SUCCESS [ 0.020 s]
[INFO] tez-javadoc-tools ................................. SUCCESS [ 0.193 s]
[INFO] tez-dist .......................................... SKIPPED
[INFO] Tez ............................................... SUCCESS [ 0.013 s]
[INFO] ------------------------------------------------------------------------
[INFO] BUILD FAILURE
[INFO] ------------------------------------------------------------------------
[INFO] Total time: 04:38 min
[INFO] Finished at: 2015-10-27T02:28:55+00:00
[INFO] Final Memory: 59M/891M
[INFO] ------------------------------------------------------------------------
[ERROR] Failed to execute goal org.apache.maven.plugins:maven-compiler-plugin:3.1:testCompile (default-testCompile) on project tez-dag: Compilation failure
[ERROR] <https://builds.apache.org/job/Tez-Build-Hadoop-2.2/ws/tez-dag/src/test/java/org/apache/tez/dag/app/TestDAGAppMaster.java>:[396,20] cannot find symbol
[ERROR] symbol: method newContainerId(org.apache.hadoop.yarn.api.records.ApplicationAttemptId,int)
[ERROR] location: class org.apache.hadoop.yarn.api.records.ContainerId
[ERROR] -> [Help 1]
[ERROR]
[ERROR] To see the full stack trace of the errors, re-run Maven with the -e switch.
[ERROR] Re-run Maven using the -X switch to enable full debug logging.
[ERROR]
[ERROR] For more information about the errors and possible solutions, please read the following articles:
[ERROR] [Help 1] http://cwiki.apache.org/confluence/display/MAVEN/MojoFailureException
[ERROR]
[ERROR] After correcting the problems, you can resume the build with the command
[ERROR] mvn <goals> -rf :tez-dag
Build step 'Execute shell' marked build as failure
Recording test results
Build failed in Jenkins: Tez-Build-Hadoop-2.2 #194
Posted by Apache Jenkins Server <je...@builds.apache.org>.
See <https://builds.apache.org/job/Tez-Build-Hadoop-2.2/194/changes>
Changes:
[sseth] TEZ-2903. Stop using proprietary APIs in RPCLoadGen. Contributed by
[rbalamohan] TEZ-2907. NPE in IFile.Reader.getLength during final merge operation
[rbalamohan] Fixing CHANGES.txt for TEZ-2882 (rbalamohan)
------------------------------------------
[...truncated 867 lines...]
[32m'app/bower_components/codemirror/mode/pig/pig.js'[39m ],
[32m'dist/scripts/templates.js'[39m: [ [32m'.tmp/scripts/compiled-templates.js'[39m ],
[32m'dist/scripts/main.js'[39m: [ [32m'.tmp/scripts/combined-scripts.js'[39m ] }
[1m uglify:[22m
{ [32m'dist/scripts/components.js'[39m: [32m'dist/scripts/components.js'[39m,
[32m'dist/scripts/templates.js'[39m: [32m'dist/scripts/templates.js'[39m,
[32m'dist/scripts/main.js'[39m: [32m'dist/scripts/main.js'[39m }
[1m requirejs:[22m
{}
[4mRunning "concurrent:dist" (concurrent) task[24m
[4mRunning "htmlmin:dist" (htmlmin) task[24m
File dist/index.html created.
[32mDone, without errors.[39m
[4mRunning "svgmin:dist" (svgmin) task[24m
[32mDone, without errors.[39m
[4mRunning "emberTemplates:dist" (emberTemplates) task[24m
File ".tmp/scripts/compiled-templates.js" created.
[4mRunning "emberTemplates:development" (emberTemplates) task[24m
File ".tmp/scripts/compiled-templates.js" created.
[32mDone, without errors.[39m
[4mRunning "neuter:app" (neuter) task[24m
[4mRunning "less:production" (less) task[24m
File .tmp/styles/styles.css created: 385.25 kB â 315.77 kB
[4mRunning "concat:dist/styles/main.css" (concat) task[24m
File "dist/styles/main.css" created.
[4mRunning "concat:dist/scripts/components.js" (concat) task[24m
File "dist/scripts/components.js" created.
[4mRunning "concat:dist/scripts/templates.js" (concat) task[24m
File "dist/scripts/templates.js" created.
[4mRunning "concat:dist/scripts/main.js" (concat) task[24m
File "dist/scripts/main.js" created.
[4mRunning "cssmin:dist" (cssmin) task[24m
File dist/styles/main.css created.
[4mRunning "cssmin:dist/styles/main.css" (cssmin) task[24m
File dist/styles/main.css created.
[4mRunning "copy:dist" (copy) task[24m
Copied [36m27[39m files
[4mRunning "usemin:html" (usemin) task[24m
[1mProcessing as HTML - dist/index.html[22m
Update the HTML to reference our concat/min/revved script files
Update the HTML with the new css filenames
Update the HTML with the new img filenames
Update the HTML with data-main tags
Update the HTML with the data tags
Update the HTML with background imgs, case there is some inline style
Update the HTML with anchors images
Update the HTML with reference in input
[4mRunning "usemin:css" (usemin) task[24m
[1mProcessing as CSS - dist/styles/main.css[22m
Update the CSS with new img filenames
[32mDone, without errors.[39m
[INFO]
[INFO] --- maven-resources-plugin:2.6:resources (default-resources) @ tez-ui ---
[INFO] Using 'UTF-8' encoding to copy filtered resources.
[INFO] Copying 2 resources
[INFO]
[INFO] --- maven-compiler-plugin:3.1:compile (default-compile) @ tez-ui ---
[INFO] No sources to compile
[INFO]
[INFO] --- maven-resources-plugin:2.6:testResources (default-testResources) @ tez-ui ---
[INFO] Using 'UTF-8' encoding to copy filtered resources.
[INFO] skip non existing resourceDirectory <https://builds.apache.org/job/Tez-Build-Hadoop-2.2/ws/tez-ui/src/test/resources>
[INFO]
[INFO] --- maven-compiler-plugin:3.1:testCompile (default-testCompile) @ tez-ui ---
[INFO] No sources to compile
[INFO]
[INFO] --- maven-surefire-plugin:2.14.1:test (default-test) @ tez-ui ---
[INFO] No tests to run.
[INFO]
[INFO] ------------------------------------------------------------------------
[INFO] Building tez-plugins 0.8.2-SNAPSHOT
[INFO] ------------------------------------------------------------------------
[INFO]
[INFO] --- maven-clean-plugin:2.5:clean (default-clean) @ tez-plugins ---
[INFO]
[INFO] --- buildnumber-maven-plugin:1.1:create (default) @ tez-plugins ---
[INFO] Checking for local modifications: skipped.
[INFO] Updating project files from SCM: skipped.
[INFO] Executing: /bin/sh -c cd <https://builds.apache.org/job/Tez-Build-Hadoop-2.2/ws/tez-plugins> && git rev-parse --verify HEAD
[INFO] Working directory: <https://builds.apache.org/job/Tez-Build-Hadoop-2.2/ws/tez-plugins>
[INFO] Storing buildNumber: 46bc363cd303a5cd1b29c0d5291ad4647cefef7d at timestamp: 1445558001222
[INFO] Executing: /bin/sh -c cd <https://builds.apache.org/job/Tez-Build-Hadoop-2.2/ws/tez-plugins> && git rev-parse --verify HEAD
[INFO] Working directory: <https://builds.apache.org/job/Tez-Build-Hadoop-2.2/ws/tez-plugins>
[INFO] Storing buildScmBranch: UNKNOWN
[INFO]
[INFO] --- build-helper-maven-plugin:1.8:maven-version (maven-version) @ tez-plugins ---
[INFO]
[INFO] ------------------------------------------------------------------------
[INFO] Building tez-tools 0.8.2-SNAPSHOT
[INFO] ------------------------------------------------------------------------
[INFO]
[INFO] --- maven-clean-plugin:2.5:clean (default-clean) @ tez-tools ---
[INFO]
[INFO] --- buildnumber-maven-plugin:1.1:create (default) @ tez-tools ---
[INFO] Checking for local modifications: skipped.
[INFO] Updating project files from SCM: skipped.
[INFO] Executing: /bin/sh -c cd <https://builds.apache.org/job/Tez-Build-Hadoop-2.2/ws/tez-tools> && git rev-parse --verify HEAD
[INFO] Working directory: <https://builds.apache.org/job/Tez-Build-Hadoop-2.2/ws/tez-tools>
[INFO] Storing buildNumber: 46bc363cd303a5cd1b29c0d5291ad4647cefef7d at timestamp: 1445558001234
[INFO] Executing: /bin/sh -c cd <https://builds.apache.org/job/Tez-Build-Hadoop-2.2/ws/tez-tools> && git rev-parse --verify HEAD
[INFO] Working directory: <https://builds.apache.org/job/Tez-Build-Hadoop-2.2/ws/tez-tools>
[INFO] Storing buildScmBranch: UNKNOWN
[INFO]
[INFO] --- build-helper-maven-plugin:1.8:maven-version (maven-version) @ tez-tools ---
[INFO]
[INFO] ------------------------------------------------------------------------
[INFO] Building tez-perf-analyzer 0.8.2-SNAPSHOT
[INFO] ------------------------------------------------------------------------
[INFO]
[INFO] --- maven-clean-plugin:2.5:clean (default-clean) @ tez-perf-analyzer ---
[INFO]
[INFO] --- buildnumber-maven-plugin:1.1:create (default) @ tez-perf-analyzer ---
[INFO] Checking for local modifications: skipped.
[INFO] Updating project files from SCM: skipped.
[INFO] Executing: /bin/sh -c cd <https://builds.apache.org/job/Tez-Build-Hadoop-2.2/ws/tez-tools/analyzers> && git rev-parse --verify HEAD
[INFO] Working directory: <https://builds.apache.org/job/Tez-Build-Hadoop-2.2/ws/tez-tools/analyzers>
[INFO] Storing buildNumber: 46bc363cd303a5cd1b29c0d5291ad4647cefef7d at timestamp: 1445558001264
[INFO] Executing: /bin/sh -c cd <https://builds.apache.org/job/Tez-Build-Hadoop-2.2/ws/tez-tools/analyzers> && git rev-parse --verify HEAD
[INFO] Working directory: <https://builds.apache.org/job/Tez-Build-Hadoop-2.2/ws/tez-tools/analyzers>
[INFO] Storing buildScmBranch: UNKNOWN
[INFO]
[INFO] --- build-helper-maven-plugin:1.8:maven-version (maven-version) @ tez-perf-analyzer ---
[INFO]
[INFO] ------------------------------------------------------------------------
[INFO] Building tez-javadoc-tools 0.8.2-SNAPSHOT
[INFO] ------------------------------------------------------------------------
[INFO]
[INFO] --- maven-clean-plugin:2.5:clean (default-clean) @ tez-javadoc-tools ---
[INFO] Deleting <https://builds.apache.org/job/Tez-Build-Hadoop-2.2/ws/tez-tools/tez-javadoc-tools/target>
[INFO]
[INFO] --- buildnumber-maven-plugin:1.1:create (default) @ tez-javadoc-tools ---
[INFO] Checking for local modifications: skipped.
[INFO] Updating project files from SCM: skipped.
[INFO] Executing: /bin/sh -c cd <https://builds.apache.org/job/Tez-Build-Hadoop-2.2/ws/tez-tools/tez-javadoc-tools> && git rev-parse --verify HEAD
[INFO] Working directory: <https://builds.apache.org/job/Tez-Build-Hadoop-2.2/ws/tez-tools/tez-javadoc-tools>
[INFO] Storing buildNumber: 46bc363cd303a5cd1b29c0d5291ad4647cefef7d at timestamp: 1445558001337
[INFO] Executing: /bin/sh -c cd <https://builds.apache.org/job/Tez-Build-Hadoop-2.2/ws/tez-tools/tez-javadoc-tools> && git rev-parse --verify HEAD
[INFO] Working directory: <https://builds.apache.org/job/Tez-Build-Hadoop-2.2/ws/tez-tools/tez-javadoc-tools>
[INFO] Storing buildScmBranch: UNKNOWN
[INFO]
[INFO] --- build-helper-maven-plugin:1.8:maven-version (maven-version) @ tez-javadoc-tools ---
[INFO]
[INFO] --- maven-resources-plugin:2.6:resources (default-resources) @ tez-javadoc-tools ---
[INFO] Using 'UTF-8' encoding to copy filtered resources.
[INFO] skip non existing resourceDirectory <https://builds.apache.org/job/Tez-Build-Hadoop-2.2/ws/tez-tools/tez-javadoc-tools/src/main/resources>
[INFO]
[INFO] --- maven-compiler-plugin:3.1:compile (default-compile) @ tez-javadoc-tools ---
[INFO] Changes detected - recompiling the module!
[INFO] Compiling 6 source files to <https://builds.apache.org/job/Tez-Build-Hadoop-2.2/ws/tez-tools/tez-javadoc-tools/target/classes>
[INFO]
[INFO] --- maven-resources-plugin:2.6:testResources (default-testResources) @ tez-javadoc-tools ---
[INFO] Using 'UTF-8' encoding to copy filtered resources.
[INFO] skip non existing resourceDirectory <https://builds.apache.org/job/Tez-Build-Hadoop-2.2/ws/tez-tools/tez-javadoc-tools/src/test/resources>
[INFO]
[INFO] --- maven-compiler-plugin:3.1:testCompile (default-testCompile) @ tez-javadoc-tools ---
[INFO] No sources to compile
[INFO]
[INFO] --- maven-surefire-plugin:2.14.1:test (default-test) @ tez-javadoc-tools ---
[INFO] No tests to run.
[INFO]
[INFO] ------------------------------------------------------------------------
[INFO] Skipping tez-dist
[INFO] This project has been banned from the build due to previous failures.
[INFO] ------------------------------------------------------------------------
[INFO]
[INFO] ------------------------------------------------------------------------
[INFO] Building Tez 0.8.2-SNAPSHOT
[INFO] ------------------------------------------------------------------------
[INFO]
[INFO] --- maven-clean-plugin:2.5:clean (default-clean) @ tez-docs ---
[INFO]
[INFO] --- buildnumber-maven-plugin:1.1:create (default) @ tez-docs ---
[INFO] Checking for local modifications: skipped.
[INFO] Updating project files from SCM: skipped.
[INFO] Executing: /bin/sh -c cd <https://builds.apache.org/job/Tez-Build-Hadoop-2.2/ws/docs> && git rev-parse --verify HEAD
[INFO] Working directory: <https://builds.apache.org/job/Tez-Build-Hadoop-2.2/ws/docs>
[INFO] Storing buildNumber: 46bc363cd303a5cd1b29c0d5291ad4647cefef7d at timestamp: 1445558001435
[INFO] Executing: /bin/sh -c cd <https://builds.apache.org/job/Tez-Build-Hadoop-2.2/ws/docs> && git rev-parse --verify HEAD
[INFO] Working directory: <https://builds.apache.org/job/Tez-Build-Hadoop-2.2/ws/docs>
[INFO] Storing buildScmBranch: UNKNOWN
[INFO]
[INFO] --- build-helper-maven-plugin:1.8:maven-version (maven-version) @ tez-docs ---
[INFO] ------------------------------------------------------------------------
[INFO] Reactor Summary:
[INFO]
[INFO] tez ............................................... SUCCESS [ 1.160 s]
[INFO] tez-api ........................................... SUCCESS [ 43.476 s]
[INFO] tez-common ........................................ SUCCESS [ 4.292 s]
[INFO] tez-runtime-internals ............................. SUCCESS [ 12.711 s]
[INFO] tez-runtime-library ............................... SUCCESS [02:16 min]
[INFO] tez-mapreduce ..................................... SUCCESS [ 30.835 s]
[INFO] tez-examples ...................................... SUCCESS [ 0.297 s]
[INFO] tez-dag ........................................... FAILURE [ 3.536 s]
[INFO] tez-tests ......................................... SKIPPED
[INFO] tez-ext-service-tests ............................. SKIPPED
[INFO] tez-ui ............................................ SUCCESS [ 18.150 s]
[INFO] tez-plugins ....................................... SUCCESS [ 0.012 s]
[INFO] tez-tools ......................................... SUCCESS [ 0.030 s]
[INFO] tez-perf-analyzer ................................. SUCCESS [ 0.015 s]
[INFO] tez-javadoc-tools ................................. SUCCESS [ 0.156 s]
[INFO] tez-dist .......................................... SKIPPED
[INFO] Tez ............................................... SUCCESS [ 0.011 s]
[INFO] ------------------------------------------------------------------------
[INFO] BUILD FAILURE
[INFO] ------------------------------------------------------------------------
[INFO] Total time: 04:12 min
[INFO] Finished at: 2015-10-22T23:53:21+00:00
[INFO] Final Memory: 54M/877M
[INFO] ------------------------------------------------------------------------
[ERROR] Failed to execute goal org.apache.maven.plugins:maven-compiler-plugin:3.1:testCompile (default-testCompile) on project tez-dag: Compilation failure
[ERROR] <https://builds.apache.org/job/Tez-Build-Hadoop-2.2/ws/tez-dag/src/test/java/org/apache/tez/dag/app/TestDAGAppMaster.java>:[396,20] cannot find symbol
[ERROR] symbol: method newContainerId(org.apache.hadoop.yarn.api.records.ApplicationAttemptId,int)
[ERROR] location: class org.apache.hadoop.yarn.api.records.ContainerId
[ERROR] -> [Help 1]
[ERROR]
[ERROR] To see the full stack trace of the errors, re-run Maven with the -e switch.
[ERROR] Re-run Maven using the -X switch to enable full debug logging.
[ERROR]
[ERROR] For more information about the errors and possible solutions, please read the following articles:
[ERROR] [Help 1] http://cwiki.apache.org/confluence/display/MAVEN/MojoFailureException
[ERROR]
[ERROR] After correcting the problems, you can resume the build with the command
[ERROR] mvn <goals> -rf :tez-dag
Build step 'Execute shell' marked build as failure
Recording test results
Build failed in Jenkins: Tez-Build-Hadoop-2.2 #193
Posted by Apache Jenkins Server <je...@builds.apache.org>.
See <https://builds.apache.org/job/Tez-Build-Hadoop-2.2/193/changes>
Changes:
[sseth] TEZ-1888. Fix javac warnings all over codebase. Contributed by Chetna
[jeagles] TEZ-2850. Tez MergeManager OOM for small Map Outputs (jeagles)
[rbalamohan] TEZ-2882. Consider improving fetch failure handling (rbalamohan)
[rbalamohan] Updating CHANGES.txt for TEZ-2882 (rbalamohan)
------------------------------------------
[...truncated 867 lines...]
[32m'app/bower_components/codemirror/mode/pig/pig.js'[39m ],
[32m'dist/scripts/templates.js'[39m: [ [32m'.tmp/scripts/compiled-templates.js'[39m ],
[32m'dist/scripts/main.js'[39m: [ [32m'.tmp/scripts/combined-scripts.js'[39m ] }
[1m uglify:[22m
{ [32m'dist/scripts/components.js'[39m: [32m'dist/scripts/components.js'[39m,
[32m'dist/scripts/templates.js'[39m: [32m'dist/scripts/templates.js'[39m,
[32m'dist/scripts/main.js'[39m: [32m'dist/scripts/main.js'[39m }
[1m requirejs:[22m
{}
[4mRunning "concurrent:dist" (concurrent) task[24m
[4mRunning "htmlmin:dist" (htmlmin) task[24m
File dist/index.html created.
[32mDone, without errors.[39m
[4mRunning "svgmin:dist" (svgmin) task[24m
[32mDone, without errors.[39m
[4mRunning "emberTemplates:dist" (emberTemplates) task[24m
File ".tmp/scripts/compiled-templates.js" created.
[4mRunning "emberTemplates:development" (emberTemplates) task[24m
File ".tmp/scripts/compiled-templates.js" created.
[32mDone, without errors.[39m
[4mRunning "neuter:app" (neuter) task[24m
[4mRunning "less:production" (less) task[24m
File .tmp/styles/styles.css created: 385.25 kB â 315.77 kB
[4mRunning "concat:dist/styles/main.css" (concat) task[24m
File "dist/styles/main.css" created.
[4mRunning "concat:dist/scripts/components.js" (concat) task[24m
File "dist/scripts/components.js" created.
[4mRunning "concat:dist/scripts/templates.js" (concat) task[24m
File "dist/scripts/templates.js" created.
[4mRunning "concat:dist/scripts/main.js" (concat) task[24m
File "dist/scripts/main.js" created.
[4mRunning "cssmin:dist" (cssmin) task[24m
File dist/styles/main.css created.
[4mRunning "cssmin:dist/styles/main.css" (cssmin) task[24m
File dist/styles/main.css created.
[4mRunning "copy:dist" (copy) task[24m
Copied [36m27[39m files
[4mRunning "usemin:html" (usemin) task[24m
[1mProcessing as HTML - dist/index.html[22m
Update the HTML to reference our concat/min/revved script files
Update the HTML with the new css filenames
Update the HTML with the new img filenames
Update the HTML with data-main tags
Update the HTML with the data tags
Update the HTML with background imgs, case there is some inline style
Update the HTML with anchors images
Update the HTML with reference in input
[4mRunning "usemin:css" (usemin) task[24m
[1mProcessing as CSS - dist/styles/main.css[22m
Update the CSS with new img filenames
[32mDone, without errors.[39m
[INFO]
[INFO] --- maven-resources-plugin:2.6:resources (default-resources) @ tez-ui ---
[INFO] Using 'UTF-8' encoding to copy filtered resources.
[INFO] Copying 2 resources
[INFO]
[INFO] --- maven-compiler-plugin:3.1:compile (default-compile) @ tez-ui ---
[INFO] No sources to compile
[INFO]
[INFO] --- maven-resources-plugin:2.6:testResources (default-testResources) @ tez-ui ---
[INFO] Using 'UTF-8' encoding to copy filtered resources.
[INFO] skip non existing resourceDirectory <https://builds.apache.org/job/Tez-Build-Hadoop-2.2/ws/tez-ui/src/test/resources>
[INFO]
[INFO] --- maven-compiler-plugin:3.1:testCompile (default-testCompile) @ tez-ui ---
[INFO] No sources to compile
[INFO]
[INFO] --- maven-surefire-plugin:2.14.1:test (default-test) @ tez-ui ---
[INFO] No tests to run.
[INFO]
[INFO] ------------------------------------------------------------------------
[INFO] Building tez-plugins 0.8.2-SNAPSHOT
[INFO] ------------------------------------------------------------------------
[INFO]
[INFO] --- maven-clean-plugin:2.5:clean (default-clean) @ tez-plugins ---
[INFO]
[INFO] --- buildnumber-maven-plugin:1.1:create (default) @ tez-plugins ---
[INFO] Checking for local modifications: skipped.
[INFO] Updating project files from SCM: skipped.
[INFO] Executing: /bin/sh -c cd <https://builds.apache.org/job/Tez-Build-Hadoop-2.2/ws/tez-plugins> && git rev-parse --verify HEAD
[INFO] Working directory: <https://builds.apache.org/job/Tez-Build-Hadoop-2.2/ws/tez-plugins>
[INFO] Storing buildNumber: 287da6a7047d0e7dadbd39c2fda0a395f4d385ca at timestamp: 1445473508782
[INFO] Executing: /bin/sh -c cd <https://builds.apache.org/job/Tez-Build-Hadoop-2.2/ws/tez-plugins> && git rev-parse --verify HEAD
[INFO] Working directory: <https://builds.apache.org/job/Tez-Build-Hadoop-2.2/ws/tez-plugins>
[INFO] Storing buildScmBranch: UNKNOWN
[INFO]
[INFO] --- build-helper-maven-plugin:1.8:maven-version (maven-version) @ tez-plugins ---
[INFO]
[INFO] ------------------------------------------------------------------------
[INFO] Building tez-tools 0.8.2-SNAPSHOT
[INFO] ------------------------------------------------------------------------
[INFO]
[INFO] --- maven-clean-plugin:2.5:clean (default-clean) @ tez-tools ---
[INFO]
[INFO] --- buildnumber-maven-plugin:1.1:create (default) @ tez-tools ---
[INFO] Checking for local modifications: skipped.
[INFO] Updating project files from SCM: skipped.
[INFO] Executing: /bin/sh -c cd <https://builds.apache.org/job/Tez-Build-Hadoop-2.2/ws/tez-tools> && git rev-parse --verify HEAD
[INFO] Working directory: <https://builds.apache.org/job/Tez-Build-Hadoop-2.2/ws/tez-tools>
[INFO] Storing buildNumber: 287da6a7047d0e7dadbd39c2fda0a395f4d385ca at timestamp: 1445473508796
[INFO] Executing: /bin/sh -c cd <https://builds.apache.org/job/Tez-Build-Hadoop-2.2/ws/tez-tools> && git rev-parse --verify HEAD
[INFO] Working directory: <https://builds.apache.org/job/Tez-Build-Hadoop-2.2/ws/tez-tools>
[INFO] Storing buildScmBranch: UNKNOWN
[INFO]
[INFO] --- build-helper-maven-plugin:1.8:maven-version (maven-version) @ tez-tools ---
[INFO]
[INFO] ------------------------------------------------------------------------
[INFO] Building tez-perf-analyzer 0.8.2-SNAPSHOT
[INFO] ------------------------------------------------------------------------
[INFO]
[INFO] --- maven-clean-plugin:2.5:clean (default-clean) @ tez-perf-analyzer ---
[INFO]
[INFO] --- buildnumber-maven-plugin:1.1:create (default) @ tez-perf-analyzer ---
[INFO] Checking for local modifications: skipped.
[INFO] Updating project files from SCM: skipped.
[INFO] Executing: /bin/sh -c cd <https://builds.apache.org/job/Tez-Build-Hadoop-2.2/ws/tez-tools/analyzers> && git rev-parse --verify HEAD
[INFO] Working directory: <https://builds.apache.org/job/Tez-Build-Hadoop-2.2/ws/tez-tools/analyzers>
[INFO] Storing buildNumber: 287da6a7047d0e7dadbd39c2fda0a395f4d385ca at timestamp: 1445473508812
[INFO] Executing: /bin/sh -c cd <https://builds.apache.org/job/Tez-Build-Hadoop-2.2/ws/tez-tools/analyzers> && git rev-parse --verify HEAD
[INFO] Working directory: <https://builds.apache.org/job/Tez-Build-Hadoop-2.2/ws/tez-tools/analyzers>
[INFO] Storing buildScmBranch: UNKNOWN
[INFO]
[INFO] --- build-helper-maven-plugin:1.8:maven-version (maven-version) @ tez-perf-analyzer ---
[INFO]
[INFO] ------------------------------------------------------------------------
[INFO] Building tez-javadoc-tools 0.8.2-SNAPSHOT
[INFO] ------------------------------------------------------------------------
[INFO]
[INFO] --- maven-clean-plugin:2.5:clean (default-clean) @ tez-javadoc-tools ---
[INFO] Deleting <https://builds.apache.org/job/Tez-Build-Hadoop-2.2/ws/tez-tools/tez-javadoc-tools/target>
[INFO]
[INFO] --- buildnumber-maven-plugin:1.1:create (default) @ tez-javadoc-tools ---
[INFO] Checking for local modifications: skipped.
[INFO] Updating project files from SCM: skipped.
[INFO] Executing: /bin/sh -c cd <https://builds.apache.org/job/Tez-Build-Hadoop-2.2/ws/tez-tools/tez-javadoc-tools> && git rev-parse --verify HEAD
[INFO] Working directory: <https://builds.apache.org/job/Tez-Build-Hadoop-2.2/ws/tez-tools/tez-javadoc-tools>
[INFO] Storing buildNumber: 287da6a7047d0e7dadbd39c2fda0a395f4d385ca at timestamp: 1445473508902
[INFO] Executing: /bin/sh -c cd <https://builds.apache.org/job/Tez-Build-Hadoop-2.2/ws/tez-tools/tez-javadoc-tools> && git rev-parse --verify HEAD
[INFO] Working directory: <https://builds.apache.org/job/Tez-Build-Hadoop-2.2/ws/tez-tools/tez-javadoc-tools>
[INFO] Storing buildScmBranch: UNKNOWN
[INFO]
[INFO] --- build-helper-maven-plugin:1.8:maven-version (maven-version) @ tez-javadoc-tools ---
[INFO]
[INFO] --- maven-resources-plugin:2.6:resources (default-resources) @ tez-javadoc-tools ---
[INFO] Using 'UTF-8' encoding to copy filtered resources.
[INFO] skip non existing resourceDirectory <https://builds.apache.org/job/Tez-Build-Hadoop-2.2/ws/tez-tools/tez-javadoc-tools/src/main/resources>
[INFO]
[INFO] --- maven-compiler-plugin:3.1:compile (default-compile) @ tez-javadoc-tools ---
[INFO] Changes detected - recompiling the module!
[INFO] Compiling 6 source files to <https://builds.apache.org/job/Tez-Build-Hadoop-2.2/ws/tez-tools/tez-javadoc-tools/target/classes>
[INFO]
[INFO] --- maven-resources-plugin:2.6:testResources (default-testResources) @ tez-javadoc-tools ---
[INFO] Using 'UTF-8' encoding to copy filtered resources.
[INFO] skip non existing resourceDirectory <https://builds.apache.org/job/Tez-Build-Hadoop-2.2/ws/tez-tools/tez-javadoc-tools/src/test/resources>
[INFO]
[INFO] --- maven-compiler-plugin:3.1:testCompile (default-testCompile) @ tez-javadoc-tools ---
[INFO] No sources to compile
[INFO]
[INFO] --- maven-surefire-plugin:2.14.1:test (default-test) @ tez-javadoc-tools ---
[INFO] No tests to run.
[INFO]
[INFO] ------------------------------------------------------------------------
[INFO] Skipping tez-dist
[INFO] This project has been banned from the build due to previous failures.
[INFO] ------------------------------------------------------------------------
[INFO]
[INFO] ------------------------------------------------------------------------
[INFO] Building Tez 0.8.2-SNAPSHOT
[INFO] ------------------------------------------------------------------------
[INFO]
[INFO] --- maven-clean-plugin:2.5:clean (default-clean) @ tez-docs ---
[INFO]
[INFO] --- buildnumber-maven-plugin:1.1:create (default) @ tez-docs ---
[INFO] Checking for local modifications: skipped.
[INFO] Updating project files from SCM: skipped.
[INFO] Executing: /bin/sh -c cd <https://builds.apache.org/job/Tez-Build-Hadoop-2.2/ws/docs> && git rev-parse --verify HEAD
[INFO] Working directory: <https://builds.apache.org/job/Tez-Build-Hadoop-2.2/ws/docs>
[INFO] Storing buildNumber: 287da6a7047d0e7dadbd39c2fda0a395f4d385ca at timestamp: 1445473509027
[INFO] Executing: /bin/sh -c cd <https://builds.apache.org/job/Tez-Build-Hadoop-2.2/ws/docs> && git rev-parse --verify HEAD
[INFO] Working directory: <https://builds.apache.org/job/Tez-Build-Hadoop-2.2/ws/docs>
[INFO] Storing buildScmBranch: UNKNOWN
[INFO]
[INFO] --- build-helper-maven-plugin:1.8:maven-version (maven-version) @ tez-docs ---
[INFO] ------------------------------------------------------------------------
[INFO] Reactor Summary:
[INFO]
[INFO] tez ............................................... SUCCESS [ 1.318 s]
[INFO] tez-api ........................................... SUCCESS [ 42.869 s]
[INFO] tez-common ........................................ SUCCESS [ 4.026 s]
[INFO] tez-runtime-internals ............................. SUCCESS [ 12.743 s]
[INFO] tez-runtime-library ............................... SUCCESS [02:15 min]
[INFO] tez-mapreduce ..................................... SUCCESS [ 30.323 s]
[INFO] tez-examples ...................................... SUCCESS [ 0.409 s]
[INFO] tez-dag ........................................... FAILURE [ 4.149 s]
[INFO] tez-tests ......................................... SKIPPED
[INFO] tez-ext-service-tests ............................. SKIPPED
[INFO] tez-ui ............................................ SUCCESS [ 17.869 s]
[INFO] tez-plugins ....................................... SUCCESS [ 0.014 s]
[INFO] tez-tools ......................................... SUCCESS [ 0.015 s]
[INFO] tez-perf-analyzer ................................. SUCCESS [ 0.015 s]
[INFO] tez-javadoc-tools ................................. SUCCESS [ 0.200 s]
[INFO] tez-dist .......................................... SKIPPED
[INFO] Tez ............................................... SUCCESS [ 0.015 s]
[INFO] ------------------------------------------------------------------------
[INFO] BUILD FAILURE
[INFO] ------------------------------------------------------------------------
[INFO] Total time: 04:10 min
[INFO] Finished at: 2015-10-22T00:25:09+00:00
[INFO] Final Memory: 58M/878M
[INFO] ------------------------------------------------------------------------
[ERROR] Failed to execute goal org.apache.maven.plugins:maven-compiler-plugin:3.1:testCompile (default-testCompile) on project tez-dag: Compilation failure
[ERROR] <https://builds.apache.org/job/Tez-Build-Hadoop-2.2/ws/tez-dag/src/test/java/org/apache/tez/dag/app/TestDAGAppMaster.java>:[396,20] cannot find symbol
[ERROR] symbol: method newContainerId(org.apache.hadoop.yarn.api.records.ApplicationAttemptId,int)
[ERROR] location: class org.apache.hadoop.yarn.api.records.ContainerId
[ERROR] -> [Help 1]
[ERROR]
[ERROR] To see the full stack trace of the errors, re-run Maven with the -e switch.
[ERROR] Re-run Maven using the -X switch to enable full debug logging.
[ERROR]
[ERROR] For more information about the errors and possible solutions, please read the following articles:
[ERROR] [Help 1] http://cwiki.apache.org/confluence/display/MAVEN/MojoFailureException
[ERROR]
[ERROR] After correcting the problems, you can resume the build with the command
[ERROR] mvn <goals> -rf :tez-dag
Build step 'Execute shell' marked build as failure
Recording test results
Build failed in Jenkins: Tez-Build-Hadoop-2.2 #192
Posted by Apache Jenkins Server <je...@builds.apache.org>.
See <https://builds.apache.org/job/Tez-Build-Hadoop-2.2/192/changes>
Changes:
[sseth] TEZ-2886. Ability to merge AM credentials with DAG credentials.
------------------------------------------
[...truncated 876 lines...]
[32m'app/bower_components/codemirror/mode/pig/pig.js'[39m ],
[32m'dist/scripts/templates.js'[39m: [ [32m'.tmp/scripts/compiled-templates.js'[39m ],
[32m'dist/scripts/main.js'[39m: [ [32m'.tmp/scripts/combined-scripts.js'[39m ] }
[1m uglify:[22m
{ [32m'dist/scripts/components.js'[39m: [32m'dist/scripts/components.js'[39m,
[32m'dist/scripts/templates.js'[39m: [32m'dist/scripts/templates.js'[39m,
[32m'dist/scripts/main.js'[39m: [32m'dist/scripts/main.js'[39m }
[1m requirejs:[22m
{}
[4mRunning "concurrent:dist" (concurrent) task[24m
[4mRunning "htmlmin:dist" (htmlmin) task[24m
File dist/index.html created.
[32mDone, without errors.[39m
[4mRunning "svgmin:dist" (svgmin) task[24m
[32mDone, without errors.[39m
[4mRunning "emberTemplates:dist" (emberTemplates) task[24m
File ".tmp/scripts/compiled-templates.js" created.
[4mRunning "emberTemplates:development" (emberTemplates) task[24m
File ".tmp/scripts/compiled-templates.js" created.
[32mDone, without errors.[39m
[4mRunning "neuter:app" (neuter) task[24m
[4mRunning "less:production" (less) task[24m
File .tmp/styles/styles.css created: 385.25 kB â 315.77 kB
[4mRunning "concat:dist/styles/main.css" (concat) task[24m
File "dist/styles/main.css" created.
[4mRunning "concat:dist/scripts/components.js" (concat) task[24m
File "dist/scripts/components.js" created.
[4mRunning "concat:dist/scripts/templates.js" (concat) task[24m
File "dist/scripts/templates.js" created.
[4mRunning "concat:dist/scripts/main.js" (concat) task[24m
File "dist/scripts/main.js" created.
[4mRunning "cssmin:dist" (cssmin) task[24m
File dist/styles/main.css created.
[4mRunning "cssmin:dist/styles/main.css" (cssmin) task[24m
File dist/styles/main.css created.
[4mRunning "copy:dist" (copy) task[24m
Copied [36m27[39m files
[4mRunning "usemin:html" (usemin) task[24m
[1mProcessing as HTML - dist/index.html[22m
Update the HTML to reference our concat/min/revved script files
Update the HTML with the new css filenames
Update the HTML with the new img filenames
Update the HTML with data-main tags
Update the HTML with the data tags
Update the HTML with background imgs, case there is some inline style
Update the HTML with anchors images
Update the HTML with reference in input
[4mRunning "usemin:css" (usemin) task[24m
[1mProcessing as CSS - dist/styles/main.css[22m
Update the CSS with new img filenames
[32mDone, without errors.[39m
[INFO]
[INFO] --- maven-resources-plugin:2.6:resources (default-resources) @ tez-ui ---
[INFO] Using 'UTF-8' encoding to copy filtered resources.
[INFO] Copying 2 resources
[INFO]
[INFO] --- maven-compiler-plugin:3.1:compile (default-compile) @ tez-ui ---
[INFO] No sources to compile
[INFO]
[INFO] --- maven-resources-plugin:2.6:testResources (default-testResources) @ tez-ui ---
[INFO] Using 'UTF-8' encoding to copy filtered resources.
[INFO] skip non existing resourceDirectory <https://builds.apache.org/job/Tez-Build-Hadoop-2.2/ws/tez-ui/src/test/resources>
[INFO]
[INFO] --- maven-compiler-plugin:3.1:testCompile (default-testCompile) @ tez-ui ---
[INFO] No sources to compile
[INFO]
[INFO] --- maven-surefire-plugin:2.14.1:test (default-test) @ tez-ui ---
[INFO] No tests to run.
[INFO]
[INFO] ------------------------------------------------------------------------
[INFO] Building tez-plugins 0.8.2-SNAPSHOT
[INFO] ------------------------------------------------------------------------
[INFO]
[INFO] --- maven-clean-plugin:2.5:clean (default-clean) @ tez-plugins ---
[INFO]
[INFO] --- buildnumber-maven-plugin:1.1:create (default) @ tez-plugins ---
[INFO] Checking for local modifications: skipped.
[INFO] Updating project files from SCM: skipped.
[INFO] Executing: /bin/sh -c cd <https://builds.apache.org/job/Tez-Build-Hadoop-2.2/ws/tez-plugins> && git rev-parse --verify HEAD
[INFO] Working directory: <https://builds.apache.org/job/Tez-Build-Hadoop-2.2/ws/tez-plugins>
[INFO] Storing buildNumber: d336ebdbc4ea86dce81a44b16d36fa2846cc4401 at timestamp: 1445125046337
[INFO] Executing: /bin/sh -c cd <https://builds.apache.org/job/Tez-Build-Hadoop-2.2/ws/tez-plugins> && git rev-parse --verify HEAD
[INFO] Working directory: <https://builds.apache.org/job/Tez-Build-Hadoop-2.2/ws/tez-plugins>
[INFO] Storing buildScmBranch: UNKNOWN
[INFO]
[INFO] --- build-helper-maven-plugin:1.8:maven-version (maven-version) @ tez-plugins ---
[INFO]
[INFO] ------------------------------------------------------------------------
[INFO] Building tez-tools 0.8.2-SNAPSHOT
[INFO] ------------------------------------------------------------------------
[INFO]
[INFO] --- maven-clean-plugin:2.5:clean (default-clean) @ tez-tools ---
[INFO]
[INFO] --- buildnumber-maven-plugin:1.1:create (default) @ tez-tools ---
[INFO] Checking for local modifications: skipped.
[INFO] Updating project files from SCM: skipped.
[INFO] Executing: /bin/sh -c cd <https://builds.apache.org/job/Tez-Build-Hadoop-2.2/ws/tez-tools> && git rev-parse --verify HEAD
[INFO] Working directory: <https://builds.apache.org/job/Tez-Build-Hadoop-2.2/ws/tez-tools>
[INFO] Storing buildNumber: d336ebdbc4ea86dce81a44b16d36fa2846cc4401 at timestamp: 1445125046350
[INFO] Executing: /bin/sh -c cd <https://builds.apache.org/job/Tez-Build-Hadoop-2.2/ws/tez-tools> && git rev-parse --verify HEAD
[INFO] Working directory: <https://builds.apache.org/job/Tez-Build-Hadoop-2.2/ws/tez-tools>
[INFO] Storing buildScmBranch: UNKNOWN
[INFO]
[INFO] --- build-helper-maven-plugin:1.8:maven-version (maven-version) @ tez-tools ---
[INFO]
[INFO] ------------------------------------------------------------------------
[INFO] Building tez-perf-analyzer 0.8.2-SNAPSHOT
[INFO] ------------------------------------------------------------------------
[INFO]
[INFO] --- maven-clean-plugin:2.5:clean (default-clean) @ tez-perf-analyzer ---
[INFO]
[INFO] --- buildnumber-maven-plugin:1.1:create (default) @ tez-perf-analyzer ---
[INFO] Checking for local modifications: skipped.
[INFO] Updating project files from SCM: skipped.
[INFO] Executing: /bin/sh -c cd <https://builds.apache.org/job/Tez-Build-Hadoop-2.2/ws/tez-tools/analyzers> && git rev-parse --verify HEAD
[INFO] Working directory: <https://builds.apache.org/job/Tez-Build-Hadoop-2.2/ws/tez-tools/analyzers>
[INFO] Storing buildNumber: d336ebdbc4ea86dce81a44b16d36fa2846cc4401 at timestamp: 1445125046363
[INFO] Executing: /bin/sh -c cd <https://builds.apache.org/job/Tez-Build-Hadoop-2.2/ws/tez-tools/analyzers> && git rev-parse --verify HEAD
[INFO] Working directory: <https://builds.apache.org/job/Tez-Build-Hadoop-2.2/ws/tez-tools/analyzers>
[INFO] Storing buildScmBranch: UNKNOWN
[INFO]
[INFO] --- build-helper-maven-plugin:1.8:maven-version (maven-version) @ tez-perf-analyzer ---
[INFO]
[INFO] ------------------------------------------------------------------------
[INFO] Building tez-javadoc-tools 0.8.2-SNAPSHOT
[INFO] ------------------------------------------------------------------------
[INFO]
[INFO] --- maven-clean-plugin:2.5:clean (default-clean) @ tez-javadoc-tools ---
[INFO] Deleting <https://builds.apache.org/job/Tez-Build-Hadoop-2.2/ws/tez-tools/tez-javadoc-tools/target>
[INFO]
[INFO] --- buildnumber-maven-plugin:1.1:create (default) @ tez-javadoc-tools ---
[INFO] Checking for local modifications: skipped.
[INFO] Updating project files from SCM: skipped.
[INFO] Executing: /bin/sh -c cd <https://builds.apache.org/job/Tez-Build-Hadoop-2.2/ws/tez-tools/tez-javadoc-tools> && git rev-parse --verify HEAD
[INFO] Working directory: <https://builds.apache.org/job/Tez-Build-Hadoop-2.2/ws/tez-tools/tez-javadoc-tools>
[INFO] Storing buildNumber: d336ebdbc4ea86dce81a44b16d36fa2846cc4401 at timestamp: 1445125046445
[INFO] Executing: /bin/sh -c cd <https://builds.apache.org/job/Tez-Build-Hadoop-2.2/ws/tez-tools/tez-javadoc-tools> && git rev-parse --verify HEAD
[INFO] Working directory: <https://builds.apache.org/job/Tez-Build-Hadoop-2.2/ws/tez-tools/tez-javadoc-tools>
[INFO] Storing buildScmBranch: UNKNOWN
[INFO]
[INFO] --- build-helper-maven-plugin:1.8:maven-version (maven-version) @ tez-javadoc-tools ---
[INFO]
[INFO] --- maven-resources-plugin:2.6:resources (default-resources) @ tez-javadoc-tools ---
[INFO] Using 'UTF-8' encoding to copy filtered resources.
[INFO] skip non existing resourceDirectory <https://builds.apache.org/job/Tez-Build-Hadoop-2.2/ws/tez-tools/tez-javadoc-tools/src/main/resources>
[INFO]
[INFO] --- maven-compiler-plugin:3.1:compile (default-compile) @ tez-javadoc-tools ---
[INFO] Changes detected - recompiling the module!
[INFO] Compiling 6 source files to <https://builds.apache.org/job/Tez-Build-Hadoop-2.2/ws/tez-tools/tez-javadoc-tools/target/classes>
[INFO]
[INFO] --- maven-resources-plugin:2.6:testResources (default-testResources) @ tez-javadoc-tools ---
[INFO] Using 'UTF-8' encoding to copy filtered resources.
[INFO] skip non existing resourceDirectory <https://builds.apache.org/job/Tez-Build-Hadoop-2.2/ws/tez-tools/tez-javadoc-tools/src/test/resources>
[INFO]
[INFO] --- maven-compiler-plugin:3.1:testCompile (default-testCompile) @ tez-javadoc-tools ---
[INFO] No sources to compile
[INFO]
[INFO] --- maven-surefire-plugin:2.14.1:test (default-test) @ tez-javadoc-tools ---
[INFO] No tests to run.
[INFO]
[INFO] ------------------------------------------------------------------------
[INFO] Skipping tez-dist
[INFO] This project has been banned from the build due to previous failures.
[INFO] ------------------------------------------------------------------------
[INFO]
[INFO] ------------------------------------------------------------------------
[INFO] Building Tez 0.8.2-SNAPSHOT
[INFO] ------------------------------------------------------------------------
[INFO]
[INFO] --- maven-clean-plugin:2.5:clean (default-clean) @ tez-docs ---
[INFO]
[INFO] --- buildnumber-maven-plugin:1.1:create (default) @ tez-docs ---
[INFO] Checking for local modifications: skipped.
[INFO] Updating project files from SCM: skipped.
[INFO] Executing: /bin/sh -c cd <https://builds.apache.org/job/Tez-Build-Hadoop-2.2/ws/docs> && git rev-parse --verify HEAD
[INFO] Working directory: <https://builds.apache.org/job/Tez-Build-Hadoop-2.2/ws/docs>
[INFO] Storing buildNumber: d336ebdbc4ea86dce81a44b16d36fa2846cc4401 at timestamp: 1445125046611
[INFO] Executing: /bin/sh -c cd <https://builds.apache.org/job/Tez-Build-Hadoop-2.2/ws/docs> && git rev-parse --verify HEAD
[INFO] Working directory: <https://builds.apache.org/job/Tez-Build-Hadoop-2.2/ws/docs>
[INFO] Storing buildScmBranch: UNKNOWN
[INFO]
[INFO] --- build-helper-maven-plugin:1.8:maven-version (maven-version) @ tez-docs ---
[INFO] ------------------------------------------------------------------------
[INFO] Reactor Summary:
[INFO]
[INFO] tez ............................................... SUCCESS [ 2.271 s]
[INFO] tez-api ........................................... SUCCESS [ 52.167 s]
[INFO] tez-common ........................................ SUCCESS [ 5.237 s]
[INFO] tez-runtime-internals ............................. SUCCESS [ 14.808 s]
[INFO] tez-runtime-library ............................... SUCCESS [02:38 min]
[INFO] tez-mapreduce ..................................... SUCCESS [ 36.807 s]
[INFO] tez-examples ...................................... SUCCESS [ 0.432 s]
[INFO] tez-dag ........................................... FAILURE [ 4.804 s]
[INFO] tez-tests ......................................... SKIPPED
[INFO] tez-ext-service-tests ............................. SKIPPED
[INFO] tez-ui ............................................ SUCCESS [ 21.967 s]
[INFO] tez-plugins ....................................... SUCCESS [ 0.015 s]
[INFO] tez-tools ......................................... SUCCESS [ 0.012 s]
[INFO] tez-perf-analyzer ................................. SUCCESS [ 0.018 s]
[INFO] tez-javadoc-tools ................................. SUCCESS [ 0.230 s]
[INFO] tez-dist .......................................... SKIPPED
[INFO] Tez ............................................... SUCCESS [ 0.012 s]
[INFO] ------------------------------------------------------------------------
[INFO] BUILD FAILURE
[INFO] ------------------------------------------------------------------------
[INFO] Total time: 04:58 min
[INFO] Finished at: 2015-10-17T23:37:26+00:00
[INFO] Final Memory: 53M/815M
[INFO] ------------------------------------------------------------------------
[ERROR] Failed to execute goal org.apache.maven.plugins:maven-compiler-plugin:3.1:testCompile (default-testCompile) on project tez-dag: Compilation failure
[ERROR] <https://builds.apache.org/job/Tez-Build-Hadoop-2.2/ws/tez-dag/src/test/java/org/apache/tez/dag/app/TestDAGAppMaster.java>:[396,20] cannot find symbol
[ERROR] symbol: method newContainerId(org.apache.hadoop.yarn.api.records.ApplicationAttemptId,int)
[ERROR] location: class org.apache.hadoop.yarn.api.records.ContainerId
[ERROR] -> [Help 1]
[ERROR]
[ERROR] To see the full stack trace of the errors, re-run Maven with the -e switch.
[ERROR] Re-run Maven using the -X switch to enable full debug logging.
[ERROR]
[ERROR] For more information about the errors and possible solutions, please read the following articles:
[ERROR] [Help 1] http://cwiki.apache.org/confluence/display/MAVEN/MojoFailureException
[ERROR]
[ERROR] After correcting the problems, you can resume the build with the command
[ERROR] mvn <goals> -rf :tez-dag
Build step 'Execute shell' marked build as failure
Recording test results