You are viewing a plain text version of this content. The canonical link for it is here.
Posted to builds@beam.apache.org by Apache Jenkins Server <je...@builds.apache.org> on 2022/02/18 12:35:05 UTC
Build failed in Jenkins: beam_PostCommit_XVR_Spark3 #1308
See <https://ci-beam.apache.org/job/beam_PostCommit_XVR_Spark3/1308/display/redirect?page=changes>
Changes:
[noreply] [adhoc] Avoid using SerializablePipelineOptions for testing to minimize
------------------------------------------
[...truncated 813.17 KB...]
urn: "beam:env:docker:v1"
payload: "\n\026apache/beam_go_sdk:dev"
capabilities: "beam:protocol:progress_reporting:v0"
capabilities: "beam:protocol:multi_core_bundle_processing:v1"
capabilities: "beam:version:sdk_base:go"
capabilities: "beam:coder:bytes:v1"
capabilities: "beam:coder:bool:v1"
capabilities: "beam:coder:varint:v1"
capabilities: "beam:coder:double:v1"
capabilities: "beam:coder:string_utf8:v1"
capabilities: "beam:coder:length_prefix:v1"
capabilities: "beam:coder:kv:v1"
capabilities: "beam:coder:iterable:v1"
capabilities: "beam:coder:state_backed_iterable:v1"
capabilities: "beam:coder:windowed_value:v1"
capabilities: "beam:coder:global_window:v1"
capabilities: "beam:coder:interval_window:v1"
capabilities: "beam:coder:row:v1"
dependencies: <
type_urn: "beam:artifact:type:file:v1"
role_urn: "beam:artifact:role:go_worker_binary:v1"
>
>
>
>
root_transform_ids: "e4"
root_transform_ids: "e5"
root_transform_ids: "s1"
root_transform_ids: "s3"
requirements: "beam:requirement:pardo:splittable_dofn:v1"
2022/02/18 12:25:09 Cross-compiling <https://ci-beam.apache.org/job/beam_PostCommit_XVR_Spark3/ws/src/sdks/go/test/integration/io/xlang/kafka/kafka_test.go> as /tmp/worker-2-1645187109609140911
2022/02/18 12:25:11 Prepared job with id: go-testkafkaio_basicreadwrite_c4c826d2-03f5-432b-ae65-f871369aa8de and staging token: go-testkafkaio_basicreadwrite_c4c826d2-03f5-432b-ae65-f871369aa8de
2022/02/18 12:25:11 Staged binary artifact with token:
2022/02/18 12:25:11 Submitted job: go0testkafkaio0basicreadwrite-jenkins-0218122511-e2aa5a05_6624d668-f6da-4023-b432-658f6e5fddef
2022/02/18 12:25:11 Job state: STOPPED
2022/02/18 12:25:11 Job state: STARTING
2022/02/18 12:25:11 Job state: RUNNING
2022/02/18 12:25:38 Job state: DONE
2022/02/18 12:25:38 Warning: 6 errors during metrics processing: [failed to deduce Step from MonitoringInfo: urn:"beam:metric:element_count:v1" type:"beam:metrics:sum_int64:v1" payload:"\x01" labels:{key:"PCOLLECTION" value:"ZmOsOosKgNExternal/KafkaIO.Read/KafkaIO.Read.ReadFromKafkaViaUnbounded/Read(KafkaUnboundedSource)/Create/Read(CreateSource)/ParDo(OutputSingleSource)/ParMultiDo(OutputSingleSource).output/SplitAndSize0"} failed to deduce Step from MonitoringInfo: urn:"beam:metric:element_count:v1" type:"beam:metrics:sum_int64:v1" payload:"\x01" labels:{key:"PCOLLECTION" value:"ZmOsOosKgNExternal/KafkaIO.Read/KafkaIO.Read.ReadFromKafkaViaUnbounded/Read(KafkaUnboundedSource)/Create/Read(CreateSource)/ParDo(OutputSingleSource)/ParMultiDo(OutputSingleSource).output/PairWithRestriction0"} failed to deduce Step from MonitoringInfo: urn:"beam:metric:sampled_byte_size:v1" type:"beam:metrics:distribution_int64:v1" payload:"\x01\xc9A\xc9A\xc9A" labels:{key:"PCOLLECTION" value:"ZmOsOosKgNExternal/KafkaIO.Read/KafkaIO.Read.ReadFromKafkaViaUnbounded/Read(KafkaUnboundedSource)/Create/Read(CreateSource)/ParDo(OutputSingleSource)/ParMultiDo(OutputSingleSource).output/SplitAndSize0"} failed to deduce Step from MonitoringInfo: urn:"beam:metric:sampled_byte_size:v1" type:"beam:metrics:distribution_int64:v1" payload:"\x01\xbcA\xbcA\xbcA" labels:{key:"PCOLLECTION" value:"ZmOsOosKgNExternal/KafkaIO.Read/KafkaIO.Read.ReadFromKafkaViaUnbounded/Read(KafkaUnboundedSource)/Create/Read(CreateSource)/ParDo(OutputSingleSource)/ParMultiDo(OutputSingleSource).output/PairWithRestriction0"} failed to deduce Step from MonitoringInfo: urn:"beam:metric:element_count:v1" type:"beam:metrics:sum_int64:v1" payload:"\x01" labels:{key:"PCOLLECTION" value:"ZmOsOosKgNExternal/KafkaIO.Read/KafkaIO.Read.ReadFromKafkaViaUnbounded/Read(KafkaUnboundedSource)/Create/Read(CreateSource)/ParDo(OutputSingleSource)/ParMultiDo(OutputSingleSource).output/SplitAndSize0"} failed to deduce Step from MonitoringInfo: urn:"beam:metric:sampled_byte_size:v1" type:"beam:metrics:distribution_int64:v1" payload:"\x01\xc9A\xc9A\xc9A" labels:{key:"PCOLLECTION" value:"ZmOsOosKgNExternal/KafkaIO.Read/KafkaIO.Read.ReadFromKafkaViaUnbounded/Read(KafkaUnboundedSource)/Create/Read(CreateSource)/ParDo(OutputSingleSource)/ParMultiDo(OutputSingleSource).output/SplitAndSize0"}]
--- PASS: TestKafkaIO_BasicReadWrite (46.32s)
PASS
ok github.com/apache/beam/sdks/v2/go/test/integration/io/xlang/kafka 49.358s
> Task :runners:spark:3:job-server:validatesCrossLanguageRunnerJavaUsingJava
org.apache.beam.runners.core.construction.ValidateRunnerXlangTest$CoGroupByKeyTest > test FAILED
org.apache.beam.vendor.grpc.v1p43p2.io.grpc.StatusRuntimeException at ValidateRunnerXlangTest.java:345
Caused by: org.apache.beam.vendor.grpc.v1p43p2.io.netty.channel.AbstractChannel$AnnotatedConnectException
Caused by: java.net.ConnectException at Errors.java:155
java.lang.NullPointerException at ValidateRunnerXlangTest.java:340
org.apache.beam.runners.core.construction.ValidateRunnerXlangTest$CombineGloballyTest > test FAILED
org.apache.beam.vendor.grpc.v1p43p2.io.grpc.StatusRuntimeException at ValidateRunnerXlangTest.java:362
Caused by: org.apache.beam.vendor.grpc.v1p43p2.io.netty.channel.AbstractChannel$AnnotatedConnectException
Caused by: java.net.ConnectException at Errors.java:155
java.lang.NullPointerException at ValidateRunnerXlangTest.java:357
org.apache.beam.runners.core.construction.ValidateRunnerXlangTest$CombinePerKeyTest > test FAILED
org.apache.beam.vendor.grpc.v1p43p2.io.grpc.StatusRuntimeException at ValidateRunnerXlangTest.java:379
Caused by: org.apache.beam.vendor.grpc.v1p43p2.io.netty.channel.AbstractChannel$AnnotatedConnectException
Caused by: java.net.ConnectException at Errors.java:155
java.lang.NullPointerException at ValidateRunnerXlangTest.java:374
org.apache.beam.runners.core.construction.ValidateRunnerXlangTest$FlattenTest > test FAILED
org.apache.beam.vendor.grpc.v1p43p2.io.grpc.StatusRuntimeException at ValidateRunnerXlangTest.java:396
Caused by: org.apache.beam.vendor.grpc.v1p43p2.io.netty.channel.AbstractChannel$AnnotatedConnectException
Caused by: java.net.ConnectException at Errors.java:155
java.lang.NullPointerException at ValidateRunnerXlangTest.java:391
org.apache.beam.runners.core.construction.ValidateRunnerXlangTest$GroupByKeyTest > test FAILED
org.apache.beam.vendor.grpc.v1p43p2.io.grpc.StatusRuntimeException at ValidateRunnerXlangTest.java:327
Caused by: org.apache.beam.vendor.grpc.v1p43p2.io.netty.channel.AbstractChannel$AnnotatedConnectException
Caused by: java.net.ConnectException at Errors.java:155
java.lang.NullPointerException at ValidateRunnerXlangTest.java:322
org.apache.beam.runners.core.construction.ValidateRunnerXlangTest$MultiInputOutputWithSideInputTest > test FAILED
org.apache.beam.vendor.grpc.v1p43p2.io.grpc.StatusRuntimeException at ValidateRunnerXlangTest.java:309
Caused by: org.apache.beam.vendor.grpc.v1p43p2.io.netty.channel.AbstractChannel$AnnotatedConnectException
Caused by: java.net.ConnectException at Errors.java:155
java.lang.NullPointerException at ValidateRunnerXlangTest.java:304
org.apache.beam.runners.core.construction.ValidateRunnerXlangTest$PartitionTest > test FAILED
org.apache.beam.vendor.grpc.v1p43p2.io.grpc.StatusRuntimeException at ValidateRunnerXlangTest.java:414
Caused by: org.apache.beam.vendor.grpc.v1p43p2.io.netty.channel.AbstractChannel$AnnotatedConnectException
Caused by: java.net.ConnectException at Errors.java:155
java.lang.NullPointerException at ValidateRunnerXlangTest.java:409
org.apache.beam.runners.core.construction.ValidateRunnerXlangTest$SingleInputOutputTest > test FAILED
org.apache.beam.vendor.grpc.v1p43p2.io.grpc.StatusRuntimeException at ValidateRunnerXlangTest.java:292
Caused by: org.apache.beam.vendor.grpc.v1p43p2.io.netty.channel.AbstractChannel$AnnotatedConnectException
Caused by: java.net.ConnectException at Errors.java:155
java.lang.NullPointerException at ValidateRunnerXlangTest.java:287
8 tests completed, 8 failed
> Task :runners:spark:3:job-server:validatesCrossLanguageRunnerJavaUsingJava FAILED
> Task :runners:spark:3:job-server:validatesCrossLanguageRunnerJavaUsingPython
org.apache.beam.runners.core.construction.ValidateRunnerXlangTest$CoGroupByKeyTest > test FAILED
org.apache.beam.vendor.grpc.v1p43p2.io.grpc.StatusRuntimeException at ValidateRunnerXlangTest.java:345
Caused by: org.apache.beam.vendor.grpc.v1p43p2.io.netty.channel.AbstractChannel$AnnotatedConnectException
Caused by: java.net.ConnectException at Errors.java:155
java.lang.NullPointerException at ValidateRunnerXlangTest.java:340
org.apache.beam.runners.core.construction.ValidateRunnerXlangTest$CombineGloballyTest > test FAILED
org.apache.beam.vendor.grpc.v1p43p2.io.grpc.StatusRuntimeException at ValidateRunnerXlangTest.java:362
Caused by: org.apache.beam.vendor.grpc.v1p43p2.io.netty.channel.AbstractChannel$AnnotatedConnectException
Caused by: java.net.ConnectException at Errors.java:155
java.lang.NullPointerException at ValidateRunnerXlangTest.java:357
org.apache.beam.runners.core.construction.ValidateRunnerXlangTest$CombinePerKeyTest > test FAILED
org.apache.beam.vendor.grpc.v1p43p2.io.grpc.StatusRuntimeException at ValidateRunnerXlangTest.java:379
Caused by: org.apache.beam.vendor.grpc.v1p43p2.io.netty.channel.AbstractChannel$AnnotatedConnectException
Caused by: java.net.ConnectException at Errors.java:155
java.lang.NullPointerException at ValidateRunnerXlangTest.java:374
org.apache.beam.runners.core.construction.ValidateRunnerXlangTest$FlattenTest > test FAILED
org.apache.beam.vendor.grpc.v1p43p2.io.grpc.StatusRuntimeException at ValidateRunnerXlangTest.java:396
Caused by: org.apache.beam.vendor.grpc.v1p43p2.io.netty.channel.AbstractChannel$AnnotatedConnectException
Caused by: java.net.ConnectException at Errors.java:155
java.lang.NullPointerException at ValidateRunnerXlangTest.java:391
org.apache.beam.runners.core.construction.ValidateRunnerXlangTest$GroupByKeyTest > test FAILED
org.apache.beam.vendor.grpc.v1p43p2.io.grpc.StatusRuntimeException at ValidateRunnerXlangTest.java:327
Caused by: org.apache.beam.vendor.grpc.v1p43p2.io.netty.channel.AbstractChannel$AnnotatedConnectException
Caused by: java.net.ConnectException at Errors.java:155
java.lang.NullPointerException at ValidateRunnerXlangTest.java:322
org.apache.beam.runners.core.construction.ValidateRunnerXlangTest$MultiInputOutputWithSideInputTest > test FAILED
org.apache.beam.vendor.grpc.v1p43p2.io.grpc.StatusRuntimeException at ValidateRunnerXlangTest.java:309
Caused by: org.apache.beam.vendor.grpc.v1p43p2.io.netty.channel.AbstractChannel$AnnotatedConnectException
Caused by: java.net.ConnectException at Errors.java:155
java.lang.NullPointerException at ValidateRunnerXlangTest.java:304
org.apache.beam.runners.core.construction.ValidateRunnerXlangTest$PartitionTest > test FAILED
org.apache.beam.vendor.grpc.v1p43p2.io.grpc.StatusRuntimeException at ValidateRunnerXlangTest.java:414
Caused by: org.apache.beam.vendor.grpc.v1p43p2.io.netty.channel.AbstractChannel$AnnotatedConnectException
Caused by: java.net.ConnectException at Errors.java:155
java.lang.NullPointerException at ValidateRunnerXlangTest.java:409
org.apache.beam.runners.core.construction.ValidateRunnerXlangTest$SingleInputOutputTest > test FAILED
org.apache.beam.vendor.grpc.v1p43p2.io.grpc.StatusRuntimeException at ValidateRunnerXlangTest.java:292
Caused by: org.apache.beam.vendor.grpc.v1p43p2.io.netty.channel.AbstractChannel$AnnotatedConnectException
Caused by: java.net.ConnectException at Errors.java:155
java.lang.NullPointerException at ValidateRunnerXlangTest.java:287
8 tests completed, 8 failed
> Task :runners:spark:3:job-server:validatesCrossLanguageRunnerJavaUsingPython FAILED
> Task :runners:spark:3:job-server:validatesCrossLanguageRunnerJavaUsingPythonOnly
org.apache.beam.runners.core.construction.ValidateRunnerXlangTest$PythonDependenciesTest > test FAILED
org.apache.beam.vendor.grpc.v1p43p2.io.grpc.StatusRuntimeException at ValidateRunnerXlangTest.java:423
Caused by: org.apache.beam.vendor.grpc.v1p43p2.io.netty.channel.AbstractChannel$AnnotatedConnectException
Caused by: java.net.ConnectException at Errors.java:155
java.lang.NullPointerException at ValidateRunnerXlangTest.java:418
1 test completed, 1 failed
> Task :runners:spark:3:job-server:validatesCrossLanguageRunnerJavaUsingPythonOnly FAILED
> Task :runners:spark:3:job-server:validatesCrossLanguageRunnerPythonUsingJava FAILED
> Task :runners:spark:3:job-server:validatesCrossLanguageRunnerPythonUsingPython FAILED
> Task :runners:spark:3:job-server:validatesCrossLanguageRunnerPythonUsingSql
> Task :runners:spark:3:job-server:validatesCrossLanguageRunnerCleanup
> Task :runners:spark:3:job-server:sparkJobServerCleanup
FAILURE: Build completed with 5 failures.
1: Task failed with an exception.
-----------
* What went wrong:
Execution failed for task ':runners:spark:3:job-server:validatesCrossLanguageRunnerJavaUsingJava'.
> There were failing tests. See the report at: file://<https://ci-beam.apache.org/job/beam_PostCommit_XVR_Spark3/ws/src/runners/spark/3/job-server/build/reports/tests/validatesCrossLanguageRunnerJavaUsingJava/index.html>
* Try:
> Run with --stacktrace option to get the stack trace.
> Run with --info or --debug option to get more log output.
> Run with --scan to get full insights.
==============================================================================
2: Task failed with an exception.
-----------
* What went wrong:
Execution failed for task ':runners:spark:3:job-server:validatesCrossLanguageRunnerJavaUsingPython'.
> There were failing tests. See the report at: file://<https://ci-beam.apache.org/job/beam_PostCommit_XVR_Spark3/ws/src/runners/spark/3/job-server/build/reports/tests/validatesCrossLanguageRunnerJavaUsingPython/index.html>
* Try:
> Run with --stacktrace option to get the stack trace.
> Run with --info or --debug option to get more log output.
> Run with --scan to get full insights.
==============================================================================
3: Task failed with an exception.
-----------
* What went wrong:
Execution failed for task ':runners:spark:3:job-server:validatesCrossLanguageRunnerJavaUsingPythonOnly'.
> There were failing tests. See the report at: file://<https://ci-beam.apache.org/job/beam_PostCommit_XVR_Spark3/ws/src/runners/spark/3/job-server/build/reports/tests/validatesCrossLanguageRunnerJavaUsingPythonOnly/index.html>
* Try:
> Run with --stacktrace option to get the stack trace.
> Run with --info or --debug option to get more log output.
> Run with --scan to get full insights.
==============================================================================
4: Task failed with an exception.
-----------
* What went wrong:
Execution failed for task ':runners:spark:3:job-server:validatesCrossLanguageRunnerPythonUsingJava'.
> Process 'command 'sh'' finished with non-zero exit value 1
* Try:
> Run with --stacktrace option to get the stack trace.
> Run with --info or --debug option to get more log output.
> Run with --scan to get full insights.
==============================================================================
5: Task failed with an exception.
-----------
* What went wrong:
Execution failed for task ':runners:spark:3:job-server:validatesCrossLanguageRunnerPythonUsingPython'.
> Process 'command 'sh'' finished with non-zero exit value 1
* Try:
> Run with --stacktrace option to get the stack trace.
> Run with --info or --debug option to get more log output.
> Run with --scan to get full insights.
==============================================================================
* Get more help at https://help.gradle.org
Deprecated Gradle features were used in this build, making it incompatible with Gradle 8.0.
You can use '--warning-mode all' to show the individual deprecation warnings and determine if they come from your own scripts or plugins.
See https://docs.gradle.org/7.3.2/userguide/command_line_interface.html#sec:command_line_warnings
Execution optimizations have been disabled for 1 invalid unit(s) of work during this build to ensure correctness.
Please consult deprecation warnings for more details.
BUILD FAILED in 26m 34s
250 actionable tasks: 170 executed, 69 from cache, 11 up-to-date
Publishing build scan...
https://gradle.com/s/cewa4sleaifdg
Build step 'Invoke Gradle script' changed build result to FAILURE
Build step 'Invoke Gradle script' marked build as failure
---------------------------------------------------------------------
To unsubscribe, e-mail: builds-unsubscribe@beam.apache.org
For additional commands, e-mail: builds-help@beam.apache.org
Jenkins build is back to normal : beam_PostCommit_XVR_Spark3 #1310
Posted by Apache Jenkins Server <je...@builds.apache.org>.
See <https://ci-beam.apache.org/job/beam_PostCommit_XVR_Spark3/1310/display/redirect?page=changes>
---------------------------------------------------------------------
To unsubscribe, e-mail: builds-unsubscribe@beam.apache.org
For additional commands, e-mail: builds-help@beam.apache.org
Build failed in Jenkins: beam_PostCommit_XVR_Spark3 #1309
Posted by Apache Jenkins Server <je...@builds.apache.org>.
See <https://ci-beam.apache.org/job/beam_PostCommit_XVR_Spark3/1309/display/redirect>
Changes:
------------------------------------------
[...truncated 570.73 KB...]
>
>
root_transform_ids: "s1"
2022/02/18 18:20:12 Cross-compiling <https://ci-beam.apache.org/job/beam_PostCommit_XVR_Spark3/ws/src/sdks/go/test/integration/io/xlang/kafka/kafka_test.go> as /tmp/worker-1-1645208412156095256
ptest.go:102: Failed to execute job: connecting to job service
failed to dial server at localhost:46099
caused by:
context deadline exceeded
--- FAIL: TestKafkaIO_BasicReadWrite (124.35s)
FAIL
FAIL github.com/apache/beam/sdks/v2/go/test/integration/io/xlang/kafka 127.371s
FAIL
> Task :runners:spark:3:job-server:validatesCrossLanguageRunnerGoUsingJava FAILED
> Task :runners:spark:3:job-server:validatesCrossLanguageRunnerJavaUsingJava
org.apache.beam.runners.core.construction.ValidateRunnerXlangTest$CoGroupByKeyTest > test FAILED
org.apache.beam.vendor.grpc.v1p43p2.io.grpc.StatusRuntimeException at ValidateRunnerXlangTest.java:345
Caused by: org.apache.beam.vendor.grpc.v1p43p2.io.netty.channel.AbstractChannel$AnnotatedConnectException
Caused by: java.net.ConnectException at Errors.java:155
java.lang.NullPointerException at ValidateRunnerXlangTest.java:340
org.apache.beam.runners.core.construction.ValidateRunnerXlangTest$CombineGloballyTest > test FAILED
org.apache.beam.vendor.grpc.v1p43p2.io.grpc.StatusRuntimeException at ValidateRunnerXlangTest.java:362
Caused by: org.apache.beam.vendor.grpc.v1p43p2.io.netty.channel.AbstractChannel$AnnotatedConnectException
Caused by: java.net.ConnectException at Errors.java:155
java.lang.NullPointerException at ValidateRunnerXlangTest.java:357
org.apache.beam.runners.core.construction.ValidateRunnerXlangTest$CombinePerKeyTest > test FAILED
org.apache.beam.vendor.grpc.v1p43p2.io.grpc.StatusRuntimeException at ValidateRunnerXlangTest.java:379
Caused by: org.apache.beam.vendor.grpc.v1p43p2.io.netty.channel.AbstractChannel$AnnotatedConnectException
Caused by: java.net.ConnectException at Errors.java:155
java.lang.NullPointerException at ValidateRunnerXlangTest.java:374
org.apache.beam.runners.core.construction.ValidateRunnerXlangTest$FlattenTest > test FAILED
org.apache.beam.vendor.grpc.v1p43p2.io.grpc.StatusRuntimeException at ValidateRunnerXlangTest.java:396
Caused by: org.apache.beam.vendor.grpc.v1p43p2.io.netty.channel.AbstractChannel$AnnotatedConnectException
Caused by: java.net.ConnectException at Errors.java:155
java.lang.NullPointerException at ValidateRunnerXlangTest.java:391
org.apache.beam.runners.core.construction.ValidateRunnerXlangTest$GroupByKeyTest > test FAILED
org.apache.beam.vendor.grpc.v1p43p2.io.grpc.StatusRuntimeException at ValidateRunnerXlangTest.java:327
Caused by: org.apache.beam.vendor.grpc.v1p43p2.io.netty.channel.AbstractChannel$AnnotatedConnectException
Caused by: java.net.ConnectException at Errors.java:155
java.lang.NullPointerException at ValidateRunnerXlangTest.java:322
org.apache.beam.runners.core.construction.ValidateRunnerXlangTest$MultiInputOutputWithSideInputTest > test FAILED
org.apache.beam.vendor.grpc.v1p43p2.io.grpc.StatusRuntimeException at ValidateRunnerXlangTest.java:309
Caused by: org.apache.beam.vendor.grpc.v1p43p2.io.netty.channel.AbstractChannel$AnnotatedConnectException
Caused by: java.net.ConnectException at Errors.java:155
java.lang.NullPointerException at ValidateRunnerXlangTest.java:304
org.apache.beam.runners.core.construction.ValidateRunnerXlangTest$PartitionTest > test FAILED
org.apache.beam.vendor.grpc.v1p43p2.io.grpc.StatusRuntimeException at ValidateRunnerXlangTest.java:414
Caused by: org.apache.beam.vendor.grpc.v1p43p2.io.netty.channel.AbstractChannel$AnnotatedConnectException
Caused by: java.net.ConnectException at Errors.java:155
java.lang.NullPointerException at ValidateRunnerXlangTest.java:409
org.apache.beam.runners.core.construction.ValidateRunnerXlangTest$SingleInputOutputTest > test FAILED
org.apache.beam.vendor.grpc.v1p43p2.io.grpc.StatusRuntimeException at ValidateRunnerXlangTest.java:292
Caused by: org.apache.beam.vendor.grpc.v1p43p2.io.netty.channel.AbstractChannel$AnnotatedConnectException
Caused by: java.net.ConnectException at Errors.java:155
java.lang.NullPointerException at ValidateRunnerXlangTest.java:287
8 tests completed, 8 failed
> Task :runners:spark:3:job-server:validatesCrossLanguageRunnerJavaUsingJava FAILED
> Task :runners:spark:3:job-server:validatesCrossLanguageRunnerJavaUsingPython
org.apache.beam.runners.core.construction.ValidateRunnerXlangTest$CoGroupByKeyTest > test FAILED
org.apache.beam.vendor.grpc.v1p43p2.io.grpc.StatusRuntimeException at ValidateRunnerXlangTest.java:345
Caused by: org.apache.beam.vendor.grpc.v1p43p2.io.netty.channel.AbstractChannel$AnnotatedConnectException
Caused by: java.net.ConnectException at Errors.java:155
java.lang.NullPointerException at ValidateRunnerXlangTest.java:340
org.apache.beam.runners.core.construction.ValidateRunnerXlangTest$CombineGloballyTest > test FAILED
org.apache.beam.vendor.grpc.v1p43p2.io.grpc.StatusRuntimeException at ValidateRunnerXlangTest.java:362
Caused by: org.apache.beam.vendor.grpc.v1p43p2.io.netty.channel.AbstractChannel$AnnotatedConnectException
Caused by: java.net.ConnectException at Errors.java:155
java.lang.NullPointerException at ValidateRunnerXlangTest.java:357
org.apache.beam.runners.core.construction.ValidateRunnerXlangTest$CombinePerKeyTest > test FAILED
org.apache.beam.vendor.grpc.v1p43p2.io.grpc.StatusRuntimeException at ValidateRunnerXlangTest.java:379
Caused by: org.apache.beam.vendor.grpc.v1p43p2.io.netty.channel.AbstractChannel$AnnotatedConnectException
Caused by: java.net.ConnectException at Errors.java:155
java.lang.NullPointerException at ValidateRunnerXlangTest.java:374
org.apache.beam.runners.core.construction.ValidateRunnerXlangTest$FlattenTest > test FAILED
org.apache.beam.vendor.grpc.v1p43p2.io.grpc.StatusRuntimeException at ValidateRunnerXlangTest.java:396
Caused by: org.apache.beam.vendor.grpc.v1p43p2.io.netty.channel.AbstractChannel$AnnotatedConnectException
Caused by: java.net.ConnectException at Errors.java:155
java.lang.NullPointerException at ValidateRunnerXlangTest.java:391
org.apache.beam.runners.core.construction.ValidateRunnerXlangTest$GroupByKeyTest > test FAILED
org.apache.beam.vendor.grpc.v1p43p2.io.grpc.StatusRuntimeException at ValidateRunnerXlangTest.java:327
Caused by: org.apache.beam.vendor.grpc.v1p43p2.io.netty.channel.AbstractChannel$AnnotatedConnectException
Caused by: java.net.ConnectException at Errors.java:155
java.lang.NullPointerException at ValidateRunnerXlangTest.java:322
org.apache.beam.runners.core.construction.ValidateRunnerXlangTest$MultiInputOutputWithSideInputTest > test FAILED
org.apache.beam.vendor.grpc.v1p43p2.io.grpc.StatusRuntimeException at ValidateRunnerXlangTest.java:309
Caused by: org.apache.beam.vendor.grpc.v1p43p2.io.netty.channel.AbstractChannel$AnnotatedConnectException
Caused by: java.net.ConnectException at Errors.java:155
java.lang.NullPointerException at ValidateRunnerXlangTest.java:304
org.apache.beam.runners.core.construction.ValidateRunnerXlangTest$PartitionTest > test FAILED
org.apache.beam.vendor.grpc.v1p43p2.io.grpc.StatusRuntimeException at ValidateRunnerXlangTest.java:414
Caused by: org.apache.beam.vendor.grpc.v1p43p2.io.netty.channel.AbstractChannel$AnnotatedConnectException
Caused by: java.net.ConnectException at Errors.java:155
java.lang.NullPointerException at ValidateRunnerXlangTest.java:409
org.apache.beam.runners.core.construction.ValidateRunnerXlangTest$SingleInputOutputTest > test FAILED
org.apache.beam.vendor.grpc.v1p43p2.io.grpc.StatusRuntimeException at ValidateRunnerXlangTest.java:292
Caused by: org.apache.beam.vendor.grpc.v1p43p2.io.netty.channel.AbstractChannel$AnnotatedConnectException
Caused by: java.net.ConnectException at Errors.java:155
java.lang.NullPointerException at ValidateRunnerXlangTest.java:287
8 tests completed, 8 failed
> Task :runners:spark:3:job-server:validatesCrossLanguageRunnerJavaUsingPython FAILED
> Task :runners:spark:3:job-server:validatesCrossLanguageRunnerJavaUsingPythonOnly
org.apache.beam.runners.core.construction.ValidateRunnerXlangTest$PythonDependenciesTest > test FAILED
org.apache.beam.vendor.grpc.v1p43p2.io.grpc.StatusRuntimeException at ValidateRunnerXlangTest.java:423
Caused by: org.apache.beam.vendor.grpc.v1p43p2.io.netty.channel.AbstractChannel$AnnotatedConnectException
Caused by: java.net.ConnectException at Errors.java:155
java.lang.NullPointerException at ValidateRunnerXlangTest.java:418
1 test completed, 1 failed
> Task :runners:spark:3:job-server:validatesCrossLanguageRunnerJavaUsingPythonOnly FAILED
> Task :runners:spark:3:job-server:validatesCrossLanguageRunnerPythonUsingJava FAILED
> Task :runners:spark:3:job-server:validatesCrossLanguageRunnerPythonUsingPython FAILED
> Task :runners:spark:3:job-server:validatesCrossLanguageRunnerPythonUsingSql
> Task :runners:spark:3:job-server:validatesCrossLanguageRunnerPythonUsingSql FAILED
> Task :runners:spark:3:job-server:validatesCrossLanguageRunnerCleanup
> Task :runners:spark:3:job-server:sparkJobServerCleanup
FAILURE: Build completed with 7 failures.
1: Task failed with an exception.
-----------
* Where:
Build file '<https://ci-beam.apache.org/job/beam_PostCommit_XVR_Spark3/ws/src/sdks/go/test/build.gradle'> line: 176
* What went wrong:
Execution failed for task ':runners:spark:3:job-server:validatesCrossLanguageRunnerGoUsingJava'.
> Process 'command 'sh'' finished with non-zero exit value 1
* Try:
> Run with --stacktrace option to get the stack trace.
> Run with --info or --debug option to get more log output.
> Run with --scan to get full insights.
==============================================================================
2: Task failed with an exception.
-----------
* What went wrong:
Execution failed for task ':runners:spark:3:job-server:validatesCrossLanguageRunnerJavaUsingJava'.
> There were failing tests. See the report at: file://<https://ci-beam.apache.org/job/beam_PostCommit_XVR_Spark3/ws/src/runners/spark/3/job-server/build/reports/tests/validatesCrossLanguageRunnerJavaUsingJava/index.html>
* Try:
> Run with --stacktrace option to get the stack trace.
> Run with --info or --debug option to get more log output.
> Run with --scan to get full insights.
==============================================================================
3: Task failed with an exception.
-----------
* What went wrong:
Execution failed for task ':runners:spark:3:job-server:validatesCrossLanguageRunnerJavaUsingPython'.
> There were failing tests. See the report at: file://<https://ci-beam.apache.org/job/beam_PostCommit_XVR_Spark3/ws/src/runners/spark/3/job-server/build/reports/tests/validatesCrossLanguageRunnerJavaUsingPython/index.html>
* Try:
> Run with --stacktrace option to get the stack trace.
> Run with --info or --debug option to get more log output.
> Run with --scan to get full insights.
==============================================================================
4: Task failed with an exception.
-----------
* What went wrong:
Execution failed for task ':runners:spark:3:job-server:validatesCrossLanguageRunnerJavaUsingPythonOnly'.
> There were failing tests. See the report at: file://<https://ci-beam.apache.org/job/beam_PostCommit_XVR_Spark3/ws/src/runners/spark/3/job-server/build/reports/tests/validatesCrossLanguageRunnerJavaUsingPythonOnly/index.html>
* Try:
> Run with --stacktrace option to get the stack trace.
> Run with --info or --debug option to get more log output.
> Run with --scan to get full insights.
==============================================================================
5: Task failed with an exception.
-----------
* What went wrong:
Execution failed for task ':runners:spark:3:job-server:validatesCrossLanguageRunnerPythonUsingJava'.
> Process 'command 'sh'' finished with non-zero exit value 1
* Try:
> Run with --stacktrace option to get the stack trace.
> Run with --info or --debug option to get more log output.
> Run with --scan to get full insights.
==============================================================================
6: Task failed with an exception.
-----------
* What went wrong:
Execution failed for task ':runners:spark:3:job-server:validatesCrossLanguageRunnerPythonUsingPython'.
> Process 'command 'sh'' finished with non-zero exit value 1
* Try:
> Run with --stacktrace option to get the stack trace.
> Run with --info or --debug option to get more log output.
> Run with --scan to get full insights.
==============================================================================
7: Task failed with an exception.
-----------
* What went wrong:
Execution failed for task ':runners:spark:3:job-server:validatesCrossLanguageRunnerPythonUsingSql'.
> Process 'command 'sh'' finished with non-zero exit value 1
* Try:
> Run with --stacktrace option to get the stack trace.
> Run with --info or --debug option to get more log output.
> Run with --scan to get full insights.
==============================================================================
* Get more help at https://help.gradle.org
Deprecated Gradle features were used in this build, making it incompatible with Gradle 8.0.
You can use '--warning-mode all' to show the individual deprecation warnings and determine if they come from your own scripts or plugins.
See https://docs.gradle.org/7.3.2/userguide/command_line_interface.html#sec:command_line_warnings
Execution optimizations have been disabled for 1 invalid unit(s) of work during this build to ensure correctness.
Please consult deprecation warnings for more details.
BUILD FAILED in 33m 40s
250 actionable tasks: 166 executed, 73 from cache, 11 up-to-date
Publishing build scan...
https://gradle.com/s/j4vthupybcpuc
Build step 'Invoke Gradle script' changed build result to FAILURE
Build step 'Invoke Gradle script' marked build as failure
---------------------------------------------------------------------
To unsubscribe, e-mail: builds-unsubscribe@beam.apache.org
For additional commands, e-mail: builds-help@beam.apache.org