You are viewing a plain text version of this content. The canonical link for it is here.
Posted to builds@beam.apache.org by Apache Jenkins Server <je...@builds.apache.org> on 2022/09/05 13:17:48 UTC
Build failed in Jenkins: beam_PerformanceTests_InfluxDbIO_IT #2283
See <https://ci-beam.apache.org/job/beam_PerformanceTests_InfluxDbIO_IT/2283/display/redirect>
Changes:
------------------------------------------
[...truncated 149.21 KB...]
> Task :sdks:java:core:compileTestJava FROM-CACHE
Custom actions are attached to task ':sdks:java:core:compileTestJava'.
Build cache key for task ':sdks:java:core:compileTestJava' is 91b0c72421e28f656b48d1f557ff69d7
Task ':sdks:java:core:compileTestJava' is not up-to-date because:
No history is available.
Loaded cache entry for task ':sdks:java:core:compileTestJava' with cache key 91b0c72421e28f656b48d1f557ff69d7
:sdks:java:core:compileTestJava (Thread[Execution worker for ':' Thread 5,5,main]) completed. Took 1.504 secs.
:sdks:java:core:testClasses (Thread[Execution worker for ':' Thread 5,5,main]) started.
> Task :sdks:java:core:testClasses
Skipping task ':sdks:java:core:testClasses' as it has no actions.
:sdks:java:core:testClasses (Thread[Execution worker for ':' Thread 5,5,main]) completed. Took 0.0 secs.
:sdks:java:core:shadowTestJar (Thread[Execution worker for ':' Thread 5,5,main]) started.
> Task :sdks:java:extensions:google-cloud-platform-core:compileJava FROM-CACHE
Custom actions are attached to task ':sdks:java:extensions:google-cloud-platform-core:compileJava'.
Build cache key for task ':sdks:java:extensions:google-cloud-platform-core:compileJava' is 8b09c013c4e14547704c77df4f0da0c6
Task ':sdks:java:extensions:google-cloud-platform-core:compileJava' is not up-to-date because:
No history is available.
Loaded cache entry for task ':sdks:java:extensions:google-cloud-platform-core:compileJava' with cache key 8b09c013c4e14547704c77df4f0da0c6
:sdks:java:extensions:google-cloud-platform-core:compileJava (Thread[included builds,5,main]) completed. Took 0.167 secs.
:sdks:java:extensions:google-cloud-platform-core:classes (Thread[included builds,5,main]) started.
> Task :sdks:java:extensions:google-cloud-platform-core:classes UP-TO-DATE
Skipping task ':sdks:java:extensions:google-cloud-platform-core:classes' as it has no actions.
:sdks:java:extensions:google-cloud-platform-core:classes (Thread[included builds,5,main]) completed. Took 0.0 secs.
:sdks:java:extensions:google-cloud-platform-core:jar (Thread[included builds,5,main]) started.
> Task :sdks:java:core:shadowTestJar FROM-CACHE
Build cache key for task ':sdks:java:core:shadowTestJar' is 8cc60da8d96b57a38d8b66be94e48e9e
Task ':sdks:java:core:shadowTestJar' is not up-to-date because:
No history is available.
Loaded cache entry for task ':sdks:java:core:shadowTestJar' with cache key 8cc60da8d96b57a38d8b66be94e48e9e
:sdks:java:core:shadowTestJar (Thread[Execution worker for ':' Thread 5,5,main]) completed. Took 0.128 secs.
:runners:core-java:compileTestJava (Thread[Execution worker for ':' Thread 5,5,main]) started.
> Task :sdks:java:extensions:google-cloud-platform-core:jar
Caching disabled for task ':sdks:java:extensions:google-cloud-platform-core:jar' because:
Not worth caching
Task ':sdks:java:extensions:google-cloud-platform-core:jar' is not up-to-date because:
No history is available.
file or directory '<https://ci-beam.apache.org/job/beam_PerformanceTests_InfluxDbIO_IT/ws/src/sdks/java/extensions/google-cloud-platform-core/build/resources/main',> not found
:sdks:java:extensions:google-cloud-platform-core:jar (Thread[included builds,5,main]) completed. Took 0.024 secs.
:sdks:java:harness:compileJava (Thread[included builds,5,main]) started.
> Task :sdks:java:harness:compileJava FROM-CACHE
Custom actions are attached to task ':sdks:java:harness:compileJava'.
Build cache key for task ':sdks:java:harness:compileJava' is d6097b68f09a7882f604a751b7609b93
Task ':sdks:java:harness:compileJava' is not up-to-date because:
No history is available.
Loaded cache entry for task ':sdks:java:harness:compileJava' with cache key d6097b68f09a7882f604a751b7609b93
:sdks:java:harness:compileJava (Thread[included builds,5,main]) completed. Took 0.104 secs.
:sdks:java:harness:classes (Thread[included builds,5,main]) started.
> Task :sdks:java:harness:classes UP-TO-DATE
Skipping task ':sdks:java:harness:classes' as it has no actions.
:sdks:java:harness:classes (Thread[included builds,5,main]) completed. Took 0.0 secs.
:sdks:java:harness:jar (Thread[included builds,5,main]) started.
> Task :sdks:java:harness:jar
Caching disabled for task ':sdks:java:harness:jar' because:
Not worth caching
Task ':sdks:java:harness:jar' is not up-to-date because:
No history is available.
file or directory '<https://ci-beam.apache.org/job/beam_PerformanceTests_InfluxDbIO_IT/ws/src/sdks/java/harness/build/resources/main',> not found
:sdks:java:harness:jar (Thread[included builds,5,main]) completed. Took 0.072 secs.
:runners:java-fn-execution:compileJava (Thread[included builds,5,main]) started.
> Task :runners:java-fn-execution:compileJava FROM-CACHE
Custom actions are attached to task ':runners:java-fn-execution:compileJava'.
Build cache key for task ':runners:java-fn-execution:compileJava' is 6a7cfdb6415c4944bc2aebff8d7ed7f8
Task ':runners:java-fn-execution:compileJava' is not up-to-date because:
No history is available.
Loaded cache entry for task ':runners:java-fn-execution:compileJava' with cache key 6a7cfdb6415c4944bc2aebff8d7ed7f8
:runners:java-fn-execution:compileJava (Thread[included builds,5,main]) completed. Took 0.106 secs.
:runners:java-fn-execution:classes (Thread[included builds,5,main]) started.
> Task :runners:java-fn-execution:classes UP-TO-DATE
Skipping task ':runners:java-fn-execution:classes' as it has no actions.
:runners:java-fn-execution:classes (Thread[included builds,5,main]) completed. Took 0.0 secs.
:runners:java-fn-execution:jar (Thread[included builds,5,main]) started.
> Task :runners:java-fn-execution:jar
Caching disabled for task ':runners:java-fn-execution:jar' because:
Not worth caching
Task ':runners:java-fn-execution:jar' is not up-to-date because:
No history is available.
file or directory '<https://ci-beam.apache.org/job/beam_PerformanceTests_InfluxDbIO_IT/ws/src/runners/java-fn-execution/build/resources/main',> not found
:runners:java-fn-execution:jar (Thread[included builds,5,main]) completed. Took 0.051 secs.
:runners:direct-java:compileJava (Thread[included builds,5,main]) started.
> Task :runners:core-java:compileTestJava FROM-CACHE
Custom actions are attached to task ':runners:core-java:compileTestJava'.
Build cache key for task ':runners:core-java:compileTestJava' is c4b6d168f94179bcad5742a22f918566
Task ':runners:core-java:compileTestJava' is not up-to-date because:
No history is available.
Loaded cache entry for task ':runners:core-java:compileTestJava' with cache key c4b6d168f94179bcad5742a22f918566
:runners:core-java:compileTestJava (Thread[Execution worker for ':' Thread 5,5,main]) completed. Took 0.386 secs.
:runners:core-java:testClasses (Thread[Execution worker for ':' Thread 5,5,main]) started.
> Task :runners:core-java:testClasses UP-TO-DATE
Skipping task ':runners:core-java:testClasses' as it has no actions.
:runners:core-java:testClasses (Thread[Execution worker for ':' Thread 5,5,main]) completed. Took 0.0 secs.
:runners:core-java:testJar (Thread[Execution worker for ':' Thread 5,5,main]) started.
> Task :runners:core-java:testJar
Caching disabled for task ':runners:core-java:testJar' because:
Not worth caching
Task ':runners:core-java:testJar' is not up-to-date because:
No history is available.
file or directory '<https://ci-beam.apache.org/job/beam_PerformanceTests_InfluxDbIO_IT/ws/src/runners/core-java/build/resources/test',> not found
:runners:core-java:testJar (Thread[Execution worker for ':' Thread 5,5,main]) completed. Took 0.043 secs.
> Task :runners:direct-java:compileJava FROM-CACHE
Custom actions are attached to task ':runners:direct-java:compileJava'.
Build cache key for task ':runners:direct-java:compileJava' is d15b775c994c070bc81719eb0ca45912
Task ':runners:direct-java:compileJava' is not up-to-date because:
No history is available.
Loaded cache entry for task ':runners:direct-java:compileJava' with cache key d15b775c994c070bc81719eb0ca45912
:runners:direct-java:compileJava (Thread[included builds,5,main]) completed. Took 0.117 secs.
:runners:direct-java:classes (Thread[included builds,5,main]) started.
> Task :runners:direct-java:classes UP-TO-DATE
Skipping task ':runners:direct-java:classes' as it has no actions.
:runners:direct-java:classes (Thread[included builds,5,main]) completed. Took 0.0 secs.
:runners:direct-java:shadowJar (Thread[included builds,5,main]) started.
> Task :runners:direct-java:shadowJar FROM-CACHE
Custom actions are attached to task ':runners:direct-java:shadowJar'.
Build cache key for task ':runners:direct-java:shadowJar' is 98b0227e7310887ec3ee4c8fdfb7972b
Task ':runners:direct-java:shadowJar' is not up-to-date because:
No history is available.
Loaded cache entry for task ':runners:direct-java:shadowJar' with cache key 98b0227e7310887ec3ee4c8fdfb7972b
:runners:direct-java:shadowJar (Thread[included builds,5,main]) completed. Took 0.312 secs.
:runners:direct-java:compileTestJava (Thread[included builds,5,main]) started.
> Task :runners:direct-java:compileTestJava FROM-CACHE
Custom actions are attached to task ':runners:direct-java:compileTestJava'.
Build cache key for task ':runners:direct-java:compileTestJava' is 0f471eb157603307c0624bb8ce13c1cb
Task ':runners:direct-java:compileTestJava' is not up-to-date because:
No history is available.
Loaded cache entry for task ':runners:direct-java:compileTestJava' with cache key 0f471eb157603307c0624bb8ce13c1cb
:runners:direct-java:compileTestJava (Thread[included builds,5,main]) completed. Took 0.115 secs.
:runners:direct-java:testClasses (Thread[included builds,5,main]) started.
> Task :runners:direct-java:testClasses UP-TO-DATE
Skipping task ':runners:direct-java:testClasses' as it has no actions.
:runners:direct-java:testClasses (Thread[included builds,5,main]) completed. Took 0.0 secs.
:runners:direct-java:shadowTestJar (Thread[included builds,5,main]) started.
> Task :runners:direct-java:shadowTestJar FROM-CACHE
Build cache key for task ':runners:direct-java:shadowTestJar' is 8f8cbefdb977f98992384e9a546ea393
Task ':runners:direct-java:shadowTestJar' is not up-to-date because:
No history is available.
Loaded cache entry for task ':runners:direct-java:shadowTestJar' with cache key 8f8cbefdb977f98992384e9a546ea393
:runners:direct-java:shadowTestJar (Thread[included builds,5,main]) completed. Took 0.229 secs.
:sdks:java:io:influxdb:integrationTest (Thread[included builds,5,main]) started.
producer locations for task group 0 (Thread[Execution worker for ':' Thread 5,5,main]) started.
producer locations for task group 0 (Thread[Execution worker for ':' Thread 5,5,main]) completed. Took 0.0 secs.
Gradle Test Executor 1 started executing tests.
> Task :sdks:java:io:influxdb:integrationTest
Custom actions are attached to task ':sdks:java:io:influxdb:integrationTest'.
Build cache key for task ':sdks:java:io:influxdb:integrationTest' is 3137e5c7fb64eaada4d0c105c5743612
Task ':sdks:java:io:influxdb:integrationTest' is not up-to-date because:
Task.upToDateWhen is false.
Starting process 'Gradle Test Executor 1'. Working directory: <https://ci-beam.apache.org/job/beam_PerformanceTests_InfluxDbIO_IT/ws/src/sdks/java/io/influxdb> Command: /usr/lib/jvm/java-8-openjdk-amd64/bin/java -DbeamTestPipelineOptions=["--influxDBURL=http://34.123.162.205:8086","--influxDBUserName=superadmin","--influxDBPassword=supersecretpassword","--databaseName=db1"] -Djava.security.manager=worker.org.gradle.process.internal.worker.child.BootstrapSecurityManager -Dorg.gradle.internal.worker.tmpdir=<https://ci-beam.apache.org/job/beam_PerformanceTests_InfluxDbIO_IT/ws/src/sdks/java/io/influxdb/build/tmp/integrationTest/work> -Dorg.gradle.native=false -Xmx2g -Dfile.encoding=UTF-8 -Duser.country=US -Duser.language=en -Duser.variant -ea -cp /home/jenkins/.gradle/caches/7.4/workerMain/gradle-worker.jar worker.org.gradle.process.internal.worker.GradleWorkerMain 'Gradle Test Executor 1'
Successfully started process 'Gradle Test Executor 1'
org.apache.beam.sdk.io.influxdb.InfluxDbIOIT > testWriteAndReadWithMultipleMetric FAILED
org.influxdb.InfluxDBIOException: java.net.SocketTimeoutException: connect timed out
at org.influxdb.impl.InfluxDBImpl.execute(InfluxDBImpl.java:836)
at org.influxdb.impl.InfluxDBImpl.executeQuery(InfluxDBImpl.java:819)
at org.influxdb.impl.InfluxDBImpl.query(InfluxDBImpl.java:554)
at org.apache.beam.sdk.io.influxdb.InfluxDbIOIT.initTest(InfluxDbIOIT.java:99)
Caused by:
java.net.SocketTimeoutException: connect timed out
at java.net.PlainSocketImpl.socketConnect(Native Method)
at java.net.AbstractPlainSocketImpl.doConnect(AbstractPlainSocketImpl.java:350)
at java.net.AbstractPlainSocketImpl.connectToAddress(AbstractPlainSocketImpl.java:206)
at java.net.AbstractPlainSocketImpl.connect(AbstractPlainSocketImpl.java:188)
at java.net.SocksSocketImpl.connect(SocksSocketImpl.java:392)
at java.net.Socket.connect(Socket.java:607)
at okhttp3.internal.platform.Platform.connectSocket(Platform.kt:119)
at okhttp3.internal.connection.RealConnection.connectSocket(RealConnection.kt:283)
at okhttp3.internal.connection.RealConnection.connect(RealConnection.kt:195)
at okhttp3.internal.connection.ExchangeFinder.findConnection(ExchangeFinder.kt:249)
at okhttp3.internal.connection.ExchangeFinder.findHealthyConnection(ExchangeFinder.kt:108)
at okhttp3.internal.connection.ExchangeFinder.find(ExchangeFinder.kt:76)
at okhttp3.internal.connection.RealCall.initExchange$okhttp(RealCall.kt:245)
at okhttp3.internal.connection.ConnectInterceptor.intercept(ConnectInterceptor.kt:32)
at okhttp3.internal.http.RealInterceptorChain.proceed(RealInterceptorChain.kt:100)
at okhttp3.internal.cache.CacheInterceptor.intercept(CacheInterceptor.kt:82)
at okhttp3.internal.http.RealInterceptorChain.proceed(RealInterceptorChain.kt:100)
at okhttp3.internal.http.BridgeInterceptor.intercept(BridgeInterceptor.kt:83)
at okhttp3.internal.http.RealInterceptorChain.proceed(RealInterceptorChain.kt:100)
at okhttp3.internal.http.RetryAndFollowUpInterceptor.intercept(RetryAndFollowUpInterceptor.kt:76)
at okhttp3.internal.http.RealInterceptorChain.proceed(RealInterceptorChain.kt:100)
at org.influxdb.impl.BasicAuthInterceptor.intercept(BasicAuthInterceptor.java:22)
at okhttp3.internal.http.RealInterceptorChain.proceed(RealInterceptorChain.kt:100)
at org.influxdb.impl.GzipRequestInterceptor.intercept(GzipRequestInterceptor.java:42)
at okhttp3.internal.http.RealInterceptorChain.proceed(RealInterceptorChain.kt:100)
at okhttp3.logging.HttpLoggingInterceptor.intercept(HttpLoggingInterceptor.kt:152)
at okhttp3.internal.http.RealInterceptorChain.proceed(RealInterceptorChain.kt:100)
at okhttp3.internal.connection.RealCall.getResponseWithInterceptorChain$okhttp(RealCall.kt:197)
at okhttp3.internal.connection.RealCall.execute(RealCall.kt:148)
at retrofit2.OkHttpCall.execute(OkHttpCall.java:190)
at org.influxdb.impl.InfluxDBImpl.execute(InfluxDBImpl.java:824)
... 3 more
Gradle Test Executor 1 finished executing tests.
> Task :sdks:java:io:influxdb:integrationTest FAILED
6 tests completed, 1 failed
Finished generating test XML results (0.019 secs) into: <https://ci-beam.apache.org/job/beam_PerformanceTests_InfluxDbIO_IT/ws/src/sdks/java/io/influxdb/build/test-results/integrationTest>
Generating HTML test report...
Finished generating test html results (0.025 secs) into: <https://ci-beam.apache.org/job/beam_PerformanceTests_InfluxDbIO_IT/ws/src/sdks/java/io/influxdb/build/reports/tests/integrationTest>
:sdks:java:io:influxdb:integrationTest (Thread[included builds,5,main]) completed. Took 24.438 secs.
FAILURE: Build failed with an exception.
* What went wrong:
Execution failed for task ':sdks:java:io:influxdb:integrationTest'.
> There were failing tests. See the report at: file://<https://ci-beam.apache.org/job/beam_PerformanceTests_InfluxDbIO_IT/ws/src/sdks/java/io/influxdb/build/reports/tests/integrationTest/index.html>
* Try:
> Run with --stacktrace option to get the stack trace.
> Run with --debug option to get more log output.
> Run with --scan to get full insights.
* Get more help at https://help.gradle.org
Deprecated Gradle features were used in this build, making it incompatible with Gradle 8.0.
You can use '--warning-mode all' to show the individual deprecation warnings and determine if they come from your own scripts or plugins.
See https://docs.gradle.org/7.4/userguide/command_line_interface.html#sec:command_line_warnings
BUILD FAILED in 46s
77 actionable tasks: 42 executed, 33 from cache, 2 up-to-date
Publishing build scan...
https://gradle.com/s/o67fk3yr4dol2
Build step 'Invoke Gradle script' changed build result to FAILURE
Build step 'Invoke Gradle script' marked build as failure
---------------------------------------------------------------------
To unsubscribe, e-mail: builds-unsubscribe@beam.apache.org
For additional commands, e-mail: builds-help@beam.apache.org
Jenkins build is back to normal : beam_PerformanceTests_InfluxDbIO_IT #2284
Posted by Apache Jenkins Server <je...@builds.apache.org>.
See <https://ci-beam.apache.org/job/beam_PerformanceTests_InfluxDbIO_IT/2284/display/redirect>
---------------------------------------------------------------------
To unsubscribe, e-mail: builds-unsubscribe@beam.apache.org
For additional commands, e-mail: builds-help@beam.apache.org