You are viewing a plain text version of this content. The canonical link for it is here.
Posted to builds@beam.apache.org by Apache Jenkins Server <je...@builds.apache.org> on 2023/10/09 05:24:44 UTC

Build failed in Jenkins: beam_PreCommit_Java_GCP_IO_Direct_Cron #1858

See <https://ci-beam.apache.org/job/beam_PreCommit_Java_GCP_IO_Direct_Cron/1858/display/redirect>

Changes:


------------------------------------------
[...truncated 19.16 MB...]
	at org.gradle.internal.event.ListenerBroadcast.dispatch(ListenerBroadcast.java:148)
	at org.gradle.internal.event.ListenerBroadcast.dispatch(ListenerBroadcast.java:37)
	at org.gradle.internal.dispatch.ProxyDispatchAdapter$DispatchingInvocationHandler.invoke(ProxyDispatchAdapter.java:94)
	at com.sun.proxy.$Proxy119.output(Unknown Source)
	at org.gradle.api.internal.tasks.testing.results.StateTrackingTestResultProcessor.output(StateTrackingTestResultProcessor.java:113)
	at org.gradle.api.internal.tasks.testing.results.AttachParentTestResultProcessor.output(AttachParentTestResultProcessor.java:52)
	at sun.reflect.GeneratedMethodAccessor609.invoke(Unknown Source)
	at sun.reflect.DelegatingMethodAccessorImpl.invoke(DelegatingMethodAccessorImpl.java:43)
	at java.lang.reflect.Method.invoke(Method.java:498)
	at org.gradle.internal.dispatch.ReflectionDispatch.dispatch(ReflectionDispatch.java:36)
	at org.gradle.internal.dispatch.ReflectionDispatch.dispatch(ReflectionDispatch.java:24)
	at org.gradle.internal.dispatch.FailureHandlingDispatch.dispatch(FailureHandlingDispatch.java:30)
	at org.gradle.internal.dispatch.AsyncDispatch.dispatchMessages(AsyncDispatch.java:87)
	at org.gradle.internal.dispatch.AsyncDispatch.access$000(AsyncDispatch.java:36)
	at org.gradle.internal.dispatch.AsyncDispatch$1.run(AsyncDispatch.java:71)
	at org.gradle.internal.concurrent.InterruptibleRunnable.run(InterruptibleRunnable.java:42)
	at org.gradle.internal.operations.CurrentBuildOperationRef.with(CurrentBuildOperationRef.java:80)
	at org.gradle.internal.operations.CurrentBuildOperationPreservingRunnable.run(CurrentBuildOperationPreservingRunnable.java:51)
	at org.gradle.internal.concurrent.ExecutorPolicy$CatchAndRecordFailures.onExecute(ExecutorPolicy.java:64)
	at org.gradle.internal.concurrent.AbstractManagedExecutor$1.run(AbstractManagedExecutor.java:47)
	at java.util.concurrent.ThreadPoolExecutor.runWorker(ThreadPoolExecutor.java:1149)
	at java.util.concurrent.ThreadPoolExecutor$Worker.run(ThreadPoolExecutor.java:624)
	at java.lang.Thread.run(Thread.java:750)
Caused by: java.io.IOException: No space left on device
	at java.io.FileOutputStream.writeBytes(Native Method)
	at java.io.FileOutputStream.write(FileOutputStream.java:326)
	at com.esotericsoftware.kryo.io.Output.flush(Output.java:163)
	... 57 more
java.io.IOException: No space left on device
com.esotericsoftware.kryo.KryoException: java.io.IOException: No space left on device
	at com.esotericsoftware.kryo.io.Output.flush(Output.java:165)
	at com.esotericsoftware.kryo.io.Output.require(Output.java:142)
	at com.esotericsoftware.kryo.io.Output.writeBoolean(Output.java:613)
	at org.gradle.internal.serialize.kryo.KryoBackedEncoder.writeBoolean(KryoBackedEncoder.java:73)
	at org.gradle.api.internal.tasks.testing.junit.result.TestOutputStore$Writer.onOutput(TestOutputStore.java:107)
	at org.gradle.api.internal.tasks.testing.junit.result.TestReportDataCollector.onOutput(TestReportDataCollector.java:167)
	at sun.reflect.GeneratedMethodAccessor607.invoke(Unknown Source)
	at sun.reflect.DelegatingMethodAccessorImpl.invoke(DelegatingMethodAccessorImpl.java:43)
	at java.lang.reflect.Method.invoke(Method.java:498)
	at org.gradle.internal.dispatch.ReflectionDispatch.dispatch(ReflectionDispatch.java:36)
	at org.gradle.internal.dispatch.ReflectionDispatch.dispatch(ReflectionDispatch.java:24)
	at org.gradle.internal.event.AbstractBroadcastDispatch.dispatch(AbstractBroadcastDispatch.java:43)
	at org.gradle.internal.event.BroadcastDispatch$SingletonDispatch.dispatch(BroadcastDispatch.java:257)
	at org.gradle.internal.event.BroadcastDispatch$SingletonDispatch.dispatch(BroadcastDispatch.java:164)
	at org.gradle.internal.event.AbstractBroadcastDispatch.dispatch(AbstractBroadcastDispatch.java:83)
	at org.gradle.internal.event.AbstractBroadcastDispatch.dispatch(AbstractBroadcastDispatch.java:69)
	at org.gradle.internal.event.BroadcastDispatch$CompositeDispatch.dispatch(BroadcastDispatch.java:363)
	at org.gradle.internal.event.BroadcastDispatch$CompositeDispatch.dispatch(BroadcastDispatch.java:261)
	at org.gradle.internal.event.ListenerBroadcast.dispatch(ListenerBroadcast.java:148)
	at org.gradle.internal.event.ListenerBroadcast.dispatch(ListenerBroadcast.java:37)
	at org.gradle.internal.dispatch.ProxyDispatchAdapter$DispatchingInvocationHandler.invoke(ProxyDispatchAdapter.java:94)
	at com.sun.proxy.$Proxy118.onOutput(Unknown Source)
	at org.gradle.api.internal.tasks.testing.results.TestListenerAdapter.output(TestListenerAdapter.java:56)
	at sun.reflect.GeneratedMethodAccessor606.invoke(Unknown Source)
	at sun.reflect.DelegatingMethodAccessorImpl.invoke(DelegatingMethodAccessorImpl.java:43)
	at java.lang.reflect.Method.invoke(Method.java:498)
	at org.gradle.internal.dispatch.ReflectionDispatch.dispatch(ReflectionDispatch.java:36)
	at org.gradle.internal.dispatch.ReflectionDispatch.dispatch(ReflectionDispatch.java:24)
	at org.gradle.internal.event.AbstractBroadcastDispatch.dispatch(AbstractBroadcastDispatch.java:43)
	at org.gradle.internal.event.BroadcastDispatch$SingletonDispatch.dispatch(BroadcastDispatch.java:257)
	at org.gradle.internal.event.BroadcastDispatch$SingletonDispatch.dispatch(BroadcastDispatch.java:164)
	at org.gradle.internal.event.AbstractBroadcastDispatch.dispatch(AbstractBroadcastDispatch.java:83)
	at org.gradle.internal.event.AbstractBroadcastDispatch.dispatch(AbstractBroadcastDispatch.java:69)
	at org.gradle.internal.event.BroadcastDispatch$CompositeDispatch.dispatch(BroadcastDispatch.java:363)
	at org.gradle.internal.event.BroadcastDispatch$CompositeDispatch.dispatch(BroadcastDispatch.java:261)
	at org.gradle.internal.event.ListenerBroadcast.dispatch(ListenerBroadcast.java:148)
	at org.gradle.internal.event.ListenerBroadcast.dispatch(ListenerBroadcast.java:37)
	at org.gradle.internal.dispatch.ProxyDispatchAdapter$DispatchingInvocationHandler.invoke(ProxyDispatchAdapter.java:94)
	at com.sun.proxy.$Proxy119.output(Unknown Source)
	at org.gradle.api.internal.tasks.testing.results.StateTrackingTestResultProcessor.output(StateTrackingTestResultProcessor.java:113)
	at org.gradle.api.internal.tasks.testing.results.AttachParentTestResultProcessor.output(AttachParentTestResultProcessor.java:52)
	at sun.reflect.GeneratedMethodAccessor609.invoke(Unknown Source)
	at sun.reflect.DelegatingMethodAccessorImpl.invoke(DelegatingMethodAccessorImpl.java:43)
	at java.lang.reflect.Method.invoke(Method.java:498)
	at org.gradle.internal.dispatch.ReflectionDispatch.dispatch(ReflectionDispatch.java:36)
	at org.gradle.internal.dispatch.ReflectionDispatch.dispatch(ReflectionDispatch.java:24)
	at org.gradle.internal.dispatch.FailureHandlingDispatch.dispatch(FailureHandlingDispatch.java:30)
	at org.gradle.internal.dispatch.AsyncDispatch.dispatchMessages(AsyncDispatch.java:87)
	at org.gradle.internal.dispatch.AsyncDispatch.access$000(AsyncDispatch.java:36)
	at org.gradle.internal.dispatch.AsyncDispatch$1.run(AsyncDispatch.java:71)
	at org.gradle.internal.concurrent.InterruptibleRunnable.run(InterruptibleRunnable.java:42)
	at org.gradle.internal.operations.CurrentBuildOperationRef.with(CurrentBuildOperationRef.java:80)
	at org.gradle.internal.operations.CurrentBuildOperationPreservingRunnable.run(CurrentBuildOperationPreservingRunnable.java:51)
	at org.gradle.internal.concurrent.ExecutorPolicy$CatchAndRecordFailures.onExecute(ExecutorPolicy.java:64)
	at org.gradle.internal.concurrent.AbstractManagedExecutor$1.run(AbstractManagedExecutor.java:47)
	at java.util.concurrent.ThreadPoolExecutor.runWorker(ThreadPoolExecutor.java:1149)
	at java.util.concurrent.ThreadPoolExecutor$Worker.run(ThreadPoolExecutor.java:624)
	at java.lang.Thread.run(Thread.java:750)
Caused by: java.io.IOException: No space left on device
	at java.io.FileOutputStream.writeBytes(Native Method)
	at java.io.FileOutputStream.write(FileOutputStream.java:326)
	at com.esotericsoftware.kryo.io.Output.flush(Output.java:163)
	... 57 more

> Task :sdks:java:io:google-cloud-platform:integrationTest FAILED
> Task :sdks:java:io:google-cloud-platform:integrationTestKms

FAILURE: Build completed with 4 failures.

1: Task failed with an exception.
-----------
* What went wrong:
Execution failed for task ':sdks:java:io:google-cloud-platform:expansion-service:shadowDistTar'.
> Could not add file '<https://ci-beam.apache.org/job/beam_PreCommit_Java_GCP_IO_Direct_Cron/ws/src/sdks/java/io/google-cloud-platform/expansion-service/build/libs/beam-sdks-java-io-google-cloud-platform-expansion-service-2.52.0-SNAPSHOT.jar'> to TAR '<https://ci-beam.apache.org/job/beam_PreCommit_Java_GCP_IO_Direct_Cron/ws/src/sdks/java/io/google-cloud-platform/expansion-service/build/distributions/expansion-service-shadow-2.52.0-SNAPSHOT.tar'.>

* Try:
> Run with --stacktrace option to get the stack trace.
> Run with --info or --debug option to get more log output.
> Get more help at https://help.gradle.org.
==============================================================================

2: Task failed with an exception.
-----------
* What went wrong:
Execution failed for task ':sdks:java:io:google-cloud-platform:expansion-service:shadowDistZip'.
> Could not add expansion-service-shadow-2.52.0-SNAPSHOT to ZIP '<https://ci-beam.apache.org/job/beam_PreCommit_Java_GCP_IO_Direct_Cron/ws/src/sdks/java/io/google-cloud-platform/expansion-service/build/distributions/expansion-service-shadow-2.52.0-SNAPSHOT.zip'.>

* Try:
> Run with --stacktrace option to get the stack trace.
> Run with --info or --debug option to get more log output.
> Get more help at https://help.gradle.org.
==============================================================================

3: Task failed with an exception.
-----------
* What went wrong:
Execution failed for task ':sdks:java:io:google-cloud-platform:expansion-service:analyzeClassesDependencies'.
> Could not resolve all dependencies for configuration ':sdks:java:io:google-cloud-platform:expansion-service:permitUnusedDeclared'.
   > Problems writing to Binary store in /home/jenkins/.gradle/.tmp/gradle6088151453165229081.bin (exist: true)

* Try:
> Run with --stacktrace option to get the stack trace.
> Run with --info or --debug option to get more log output.
> Get more help at https://help.gradle.org.
==============================================================================

4: Task failed with an exception.
-----------
* What went wrong:
Execution failed for task ':sdks:java:io:google-cloud-platform:integrationTest'.
> java.io.IOException: No space left on device

* Try:
> Run with --stacktrace option to get the stack trace.
> Run with --info or --debug option to get more log output.
> Get more help at https://help.gradle.org.
==============================================================================

Deprecated Gradle features were used in this build, making it incompatible with Gradle 9.0.

You can use '--warning-mode all' to show the individual deprecation warnings and determine if they come from your own scripts or plugins.

For more on this, please refer to https://docs.gradle.org/8.3/userguide/command_line_interface.html#sec:command_line_warnings in the Gradle documentation.

BUILD FAILED in 36m 13s
133 actionable tasks: 79 executed, 54 from cache

Publishing build scan...
https://ge.apache.org/s/t5uj62zel3fis


FAILURE: Build completed with 5 failures.

1: Task failed with an exception.
-----------
* What went wrong:
Execution failed for task ':sdks:java:io:google-cloud-platform:expansion-service:shadowDistTar'.
> Could not add file '<https://ci-beam.apache.org/job/beam_PreCommit_Java_GCP_IO_Direct_Cron/ws/src/sdks/java/io/google-cloud-platform/expansion-service/build/libs/beam-sdks-java-io-google-cloud-platform-expansion-service-2.52.0-SNAPSHOT.jar'> to TAR '<https://ci-beam.apache.org/job/beam_PreCommit_Java_GCP_IO_Direct_Cron/ws/src/sdks/java/io/google-cloud-platform/expansion-service/build/distributions/expansion-service-shadow-2.52.0-SNAPSHOT.tar'.>

* Try:
> Run with --stacktrace option to get the stack trace.
> Run with --info or --debug option to get more log output.
> Run with --scan to get full insights.
> Get more help at https://help.gradle.org.
==============================================================================

2: Task failed with an exception.
-----------
* What went wrong:
Execution failed for task ':sdks:java:io:google-cloud-platform:expansion-service:shadowDistZip'.
> Could not add expansion-service-shadow-2.52.0-SNAPSHOT to ZIP '<https://ci-beam.apache.org/job/beam_PreCommit_Java_GCP_IO_Direct_Cron/ws/src/sdks/java/io/google-cloud-platform/expansion-service/build/distributions/expansion-service-shadow-2.52.0-SNAPSHOT.zip'.>

* Try:
> Run with --stacktrace option to get the stack trace.
> Run with --info or --debug option to get more log output.
> Run with --scan to get full insights.
> Get more help at https://help.gradle.org.
==============================================================================

3: Task failed with an exception.
-----------
* What went wrong:
Execution failed for task ':sdks:java:io:google-cloud-platform:expansion-service:analyzeClassesDependencies'.
> Could not resolve all dependencies for configuration ':sdks:java:io:google-cloud-platform:expansion-service:permitUnusedDeclared'.
   > Problems writing to Binary store in /home/jenkins/.gradle/.tmp/gradle6088151453165229081.bin (exist: true)

* Try:
> Run with --stacktrace option to get the stack trace.
> Run with --info or --debug option to get more log output.
> Run with --scan to get full insights.
> Get more help at https://help.gradle.org.
==============================================================================

4: Task failed with an exception.
-----------
* What went wrong:
Execution failed for task ':sdks:java:io:google-cloud-platform:integrationTest'.
> java.io.IOException: No space left on device

* Try:
> Run with --stacktrace option to get the stack trace.
> Run with --info or --debug option to get more log output.
> Run with --scan to get full insights.
> Get more help at https://help.gradle.org.
==============================================================================

5: Task failed with an exception.
-----------
* What went wrong:
Could not add entry ':sdks:java:io:google-cloud-platform:expansion-service:shadowDistTar' to cache executionHistory.bin (<https://ci-beam.apache.org/job/beam_PreCommit_Java_GCP_IO_Direct_Cron/ws/src/.gradle/8.3/executionHistory/executionHistory.bin).>
> java.io.IOException: No space left on device

* Try:
> Run with --stacktrace option to get the stack trace.
> Run with --info or --debug option to get more log output.
> Run with --scan to get full insights.
> Get more help at https://help.gradle.org.
==============================================================================

Deprecated Gradle features were used in this build, making it incompatible with Gradle 9.0.

You can use '--warning-mode all' to show the individual deprecation warnings and determine if they come from your own scripts or plugins.

For more on this, please refer to https://docs.gradle.org/8.3/userguide/command_line_interface.html#sec:command_line_warnings in the Gradle documentation.

BUILD FAILED in 36m 14s

FAILURE: Build failed with an exception.

* What went wrong:
Could not receive a message from the daemon.

* Try:
> Run with --stacktrace option to get the stack trace.
> Run with --info or --debug option to get more log output.
> Run with --scan to get full insights.
> Get more help at https://help.gradle.org.
Build step 'Invoke Gradle script' changed build result to FAILURE
Build step 'Invoke Gradle script' marked build as failure

---------------------------------------------------------------------
To unsubscribe, e-mail: builds-unsubscribe@beam.apache.org
For additional commands, e-mail: builds-help@beam.apache.org


Jenkins build is back to normal : beam_PreCommit_Java_GCP_IO_Direct_Cron #1859

Posted by Apache Jenkins Server <je...@builds.apache.org>.
See <https://ci-beam.apache.org/job/beam_PreCommit_Java_GCP_IO_Direct_Cron/1859/display/redirect>


---------------------------------------------------------------------
To unsubscribe, e-mail: builds-unsubscribe@beam.apache.org
For additional commands, e-mail: builds-help@beam.apache.org