You are viewing a plain text version of this content. The canonical link for it is here.
Posted to dev@lucene.apache.org by Policeman Jenkins Server <je...@thetaphi.de> on 2017/02/07 16:44:28 UTC
[JENKINS] Lucene-Solr-6.x-Windows (32bit/jdk1.8.0_121) - Build #
714 - Unstable!
Build: https://jenkins.thetaphi.de/job/Lucene-Solr-6.x-Windows/714/
Java: 32bit/jdk1.8.0_121 -client -XX:+UseG1GC
1 tests failed.
FAILED: org.apache.solr.handler.admin.MBeansHandlerTest.testDiff
Error Message:
expected:<Was: [1, Now: 2], Delta: 1> but was:<Was: [4, Now: 5], Delta: 1>
Stack Trace:
org.junit.ComparisonFailure: expected:<Was: [1, Now: 2], Delta: 1> but was:<Was: [4, Now: 5], Delta: 1>
at __randomizedtesting.SeedInfo.seed([F8B49D764FB5EC9:CA9D8D4C744D66A9]:0)
at org.junit.Assert.assertEquals(Assert.java:125)
at org.junit.Assert.assertEquals(Assert.java:147)
at org.apache.solr.handler.admin.MBeansHandlerTest.testDiff(MBeansHandlerTest.java:63)
at sun.reflect.NativeMethodAccessorImpl.invoke0(Native Method)
at sun.reflect.NativeMethodAccessorImpl.invoke(NativeMethodAccessorImpl.java:62)
at sun.reflect.DelegatingMethodAccessorImpl.invoke(DelegatingMethodAccessorImpl.java:43)
at java.lang.reflect.Method.invoke(Method.java:498)
at com.carrotsearch.randomizedtesting.RandomizedRunner.invoke(RandomizedRunner.java:1713)
at com.carrotsearch.randomizedtesting.RandomizedRunner$8.evaluate(RandomizedRunner.java:907)
at com.carrotsearch.randomizedtesting.RandomizedRunner$9.evaluate(RandomizedRunner.java:943)
at com.carrotsearch.randomizedtesting.RandomizedRunner$10.evaluate(RandomizedRunner.java:957)
at com.carrotsearch.randomizedtesting.rules.SystemPropertiesRestoreRule$1.evaluate(SystemPropertiesRestoreRule.java:57)
at org.apache.lucene.util.TestRuleSetupTeardownChained$1.evaluate(TestRuleSetupTeardownChained.java:49)
at org.apache.lucene.util.AbstractBeforeAfterRule$1.evaluate(AbstractBeforeAfterRule.java:45)
at org.apache.lucene.util.TestRuleThreadAndTestName$1.evaluate(TestRuleThreadAndTestName.java:48)
at org.apache.lucene.util.TestRuleIgnoreAfterMaxFailures$1.evaluate(TestRuleIgnoreAfterMaxFailures.java:64)
at org.apache.lucene.util.TestRuleMarkFailure$1.evaluate(TestRuleMarkFailure.java:47)
at com.carrotsearch.randomizedtesting.rules.StatementAdapter.evaluate(StatementAdapter.java:36)
at com.carrotsearch.randomizedtesting.ThreadLeakControl$StatementRunner.run(ThreadLeakControl.java:368)
at com.carrotsearch.randomizedtesting.ThreadLeakControl.forkTimeoutingTask(ThreadLeakControl.java:817)
at com.carrotsearch.randomizedtesting.ThreadLeakControl$3.evaluate(ThreadLeakControl.java:468)
at com.carrotsearch.randomizedtesting.RandomizedRunner.runSingleTest(RandomizedRunner.java:916)
at com.carrotsearch.randomizedtesting.RandomizedRunner$5.evaluate(RandomizedRunner.java:802)
at com.carrotsearch.randomizedtesting.RandomizedRunner$6.evaluate(RandomizedRunner.java:852)
at com.carrotsearch.randomizedtesting.RandomizedRunner$7.evaluate(RandomizedRunner.java:863)
at com.carrotsearch.randomizedtesting.rules.StatementAdapter.evaluate(StatementAdapter.java:36)
at com.carrotsearch.randomizedtesting.rules.SystemPropertiesRestoreRule$1.evaluate(SystemPropertiesRestoreRule.java:57)
at org.apache.lucene.util.AbstractBeforeAfterRule$1.evaluate(AbstractBeforeAfterRule.java:45)
at com.carrotsearch.randomizedtesting.rules.StatementAdapter.evaluate(StatementAdapter.java:36)
at org.apache.lucene.util.TestRuleStoreClassName$1.evaluate(TestRuleStoreClassName.java:41)
at com.carrotsearch.randomizedtesting.rules.NoShadowingOrOverridesOnMethodsRule$1.evaluate(NoShadowingOrOverridesOnMethodsRule.java:40)
at com.carrotsearch.randomizedtesting.rules.NoShadowingOrOverridesOnMethodsRule$1.evaluate(NoShadowingOrOverridesOnMethodsRule.java:40)
at com.carrotsearch.randomizedtesting.rules.StatementAdapter.evaluate(StatementAdapter.java:36)
at com.carrotsearch.randomizedtesting.rules.StatementAdapter.evaluate(StatementAdapter.java:36)
at com.carrotsearch.randomizedtesting.rules.StatementAdapter.evaluate(StatementAdapter.java:36)
at org.apache.lucene.util.TestRuleAssertionsRequired$1.evaluate(TestRuleAssertionsRequired.java:53)
at org.apache.lucene.util.TestRuleMarkFailure$1.evaluate(TestRuleMarkFailure.java:47)
at org.apache.lucene.util.TestRuleIgnoreAfterMaxFailures$1.evaluate(TestRuleIgnoreAfterMaxFailures.java:64)
at org.apache.lucene.util.TestRuleIgnoreTestSuites$1.evaluate(TestRuleIgnoreTestSuites.java:54)
at com.carrotsearch.randomizedtesting.rules.StatementAdapter.evaluate(StatementAdapter.java:36)
at com.carrotsearch.randomizedtesting.ThreadLeakControl$StatementRunner.run(ThreadLeakControl.java:368)
at java.lang.Thread.run(Thread.java:745)
Build Log:
[...truncated 12171 lines...]
[junit4] Suite: org.apache.solr.handler.admin.MBeansHandlerTest
[junit4] 2> Creating dataDir: C:\Users\jenkins\workspace\Lucene-Solr-6.x-Windows\solr\build\solr-core\test\J1\temp\solr.handler.admin.MBeansHandlerTest_F8B49D764FB5EC9-001\init-core-data-001
[junit4] 2> 2307195 INFO (SUITE-MBeansHandlerTest-seed#[F8B49D764FB5EC9]-worker) [ ] o.a.s.SolrTestCaseJ4 Randomized ssl (false) and clientAuth (false) via: @org.apache.solr.util.RandomizeSSL(reason=, value=NaN, ssl=NaN, clientAuth=NaN)
[junit4] 2> 2307196 INFO (SUITE-MBeansHandlerTest-seed#[F8B49D764FB5EC9]-worker) [ ] o.a.s.SolrTestCaseJ4 ####initCore
[junit4] 2> 2307198 INFO (SUITE-MBeansHandlerTest-seed#[F8B49D764FB5EC9]-worker) [ ] o.a.s.c.SolrResourceLoader [null] Added 2 libs to classloader, from paths: [/C:/Users/jenkins/workspace/Lucene-Solr-6.x-Windows/solr/core/src/test-files/solr/collection1/lib, /C:/Users/jenkins/workspace/Lucene-Solr-6.x-Windows/solr/core/src/test-files/solr/collection1/lib/classes]
[junit4] 2> 2307286 INFO (SUITE-MBeansHandlerTest-seed#[F8B49D764FB5EC9]-worker) [ ] o.a.s.c.SolrConfig Using Lucene MatchVersion: 6.5.0
[junit4] 2> 2307340 INFO (SUITE-MBeansHandlerTest-seed#[F8B49D764FB5EC9]-worker) [ ] o.a.s.s.IndexSchema [null] Schema name=test
[junit4] 2> 2307445 WARN (SUITE-MBeansHandlerTest-seed#[F8B49D764FB5EC9]-worker) [ ] o.a.s.s.IndexSchema [null] default search field in schema is text. WARNING: Deprecated, please use 'df' on request instead.
[junit4] 2> 2307448 INFO (SUITE-MBeansHandlerTest-seed#[F8B49D764FB5EC9]-worker) [ ] o.a.s.s.IndexSchema Loaded schema test/1.0 with uniqueid field id
[junit4] 2> 2307467 INFO (SUITE-MBeansHandlerTest-seed#[F8B49D764FB5EC9]-worker) [ ] o.a.s.u.UpdateShardHandler Creating UpdateShardHandler HTTP client with params: socketTimeout=30000&connTimeout=30000&retry=true
[junit4] 2> 2307579 WARN (SUITE-MBeansHandlerTest-seed#[F8B49D764FB5EC9]-worker) [ ] o.a.s.m.r.SolrJmxReporter No serviceUrl or agentId was configured, using first MBeanServer.
[junit4] 2> 2307584 INFO (SUITE-MBeansHandlerTest-seed#[F8B49D764FB5EC9]-worker) [ ] o.a.s.m.r.SolrJmxReporter JMX monitoring enabled at server: com.sun.jmx.mbeanserver.JmxMBeanServer@1ec9637
[junit4] 2> 2307584 WARN (SUITE-MBeansHandlerTest-seed#[F8B49D764FB5EC9]-worker) [ ] o.a.s.m.r.SolrJmxReporter No serviceUrl or agentId was configured, using first MBeanServer.
[junit4] 2> 2307589 INFO (SUITE-MBeansHandlerTest-seed#[F8B49D764FB5EC9]-worker) [ ] o.a.s.m.r.SolrJmxReporter JMX monitoring enabled at server: com.sun.jmx.mbeanserver.JmxMBeanServer@1ec9637
[junit4] 2> 2307589 WARN (SUITE-MBeansHandlerTest-seed#[F8B49D764FB5EC9]-worker) [ ] o.a.s.m.r.SolrJmxReporter No serviceUrl or agentId was configured, using first MBeanServer.
[junit4] 2> 2307590 INFO (SUITE-MBeansHandlerTest-seed#[F8B49D764FB5EC9]-worker) [ ] o.a.s.m.r.SolrJmxReporter JMX monitoring enabled at server: com.sun.jmx.mbeanserver.JmxMBeanServer@1ec9637
[junit4] 2> 2307593 INFO (coreLoadExecutor-8308-thread-1) [ x:collection1] o.a.s.c.SolrResourceLoader [null] Added 2 libs to classloader, from paths: [/C:/Users/jenkins/workspace/Lucene-Solr-6.x-Windows/solr/core/src/test-files/solr/collection1/lib, /C:/Users/jenkins/workspace/Lucene-Solr-6.x-Windows/solr/core/src/test-files/solr/collection1/lib/classes]
[junit4] 2> 2307684 INFO (coreLoadExecutor-8308-thread-1) [ x:collection1] o.a.s.c.SolrConfig Using Lucene MatchVersion: 6.5.0
[junit4] 2> 2307714 INFO (coreLoadExecutor-8308-thread-1) [ x:collection1] o.a.s.s.IndexSchema [collection1] Schema name=test
[junit4] 2> 2307832 WARN (coreLoadExecutor-8308-thread-1) [ x:collection1] o.a.s.s.IndexSchema [collection1] default search field in schema is text. WARNING: Deprecated, please use 'df' on request instead.
[junit4] 2> 2307836 INFO (coreLoadExecutor-8308-thread-1) [ x:collection1] o.a.s.s.IndexSchema Loaded schema test/1.0 with uniqueid field id
[junit4] 2> 2307858 INFO (coreLoadExecutor-8308-thread-1) [ x:collection1] o.a.s.c.CoreContainer Creating SolrCore 'collection1' using configuration from instancedir C:\Users\jenkins\workspace\Lucene-Solr-6.x-Windows\solr\core\src\test-files\solr\collection1
[junit4] 2> 2307859 WARN (coreLoadExecutor-8308-thread-1) [ x:collection1] o.a.s.m.r.SolrJmxReporter No serviceUrl or agentId was configured, using first MBeanServer.
[junit4] 2> 2307859 INFO (coreLoadExecutor-8308-thread-1) [ x:collection1] o.a.s.m.r.SolrJmxReporter JMX monitoring enabled at server: com.sun.jmx.mbeanserver.JmxMBeanServer@1ec9637
[junit4] 2> 2307859 INFO (coreLoadExecutor-8308-thread-1) [ x:collection1] o.a.s.c.SolrCore [[collection1] ] Opening new SolrCore at [C:\Users\jenkins\workspace\Lucene-Solr-6.x-Windows\solr\core\src\test-files\solr\collection1], dataDir=[C:\Users\jenkins\workspace\Lucene-Solr-6.x-Windows\solr\build\solr-core\test\J1\temp\solr.handler.admin.MBeansHandlerTest_F8B49D764FB5EC9-001\init-core-data-001\]
[junit4] 2> 2307860 INFO (coreLoadExecutor-8308-thread-1) [ x:collection1] o.a.s.c.JmxMonitoredMap JMX monitoring is enabled. Adding Solr mbeans to JMX Server: com.sun.jmx.mbeanserver.JmxMBeanServer@1ec9637
[junit4] 2> 2307862 INFO (coreLoadExecutor-8308-thread-1) [ x:collection1] o.a.s.u.RandomMergePolicy RandomMergePolicy wrapping class org.apache.lucene.index.LogDocMergePolicy: [LogDocMergePolicy: minMergeSize=1000, mergeFactor=35, maxMergeSize=9223372036854775807, maxMergeSizeForForcedMerge=9223372036854775807, calibrateSizeByDeletes=true, maxMergeDocs=2147483647, maxCFSSegmentSizeMB=8.796093022207999E12, noCFSRatio=1.0]
[junit4] 2> 2308035 INFO (coreLoadExecutor-8308-thread-1) [ x:collection1] o.a.s.u.UpdateHandler Using UpdateLog implementation: org.apache.solr.update.UpdateLog
[junit4] 2> 2308035 INFO (coreLoadExecutor-8308-thread-1) [ x:collection1] o.a.s.u.UpdateLog Initializing UpdateLog: dataDir= defaultSyncLevel=FLUSH numRecordsToKeep=100 maxNumLogsToKeep=10 numVersionBuckets=65536
[junit4] 2> 2308037 INFO (coreLoadExecutor-8308-thread-1) [ x:collection1] o.a.s.u.CommitTracker Hard AutoCommit: disabled
[junit4] 2> 2308037 INFO (coreLoadExecutor-8308-thread-1) [ x:collection1] o.a.s.u.CommitTracker Soft AutoCommit: disabled
[junit4] 2> 2308038 INFO (coreLoadExecutor-8308-thread-1) [ x:collection1] o.a.s.u.RandomMergePolicy RandomMergePolicy wrapping class org.apache.lucene.index.TieredMergePolicy: [TieredMergePolicy: maxMergeAtOnce=32, maxMergeAtOnceExplicit=36, maxMergedSegmentMB=53.244140625, floorSegmentMB=0.419921875, forceMergeDeletesPctAllowed=14.918625967257631, segmentsPerTier=45.0, maxCFSSegmentSizeMB=8.796093022207999E12, noCFSRatio=0.5338111407897135
[junit4] 2> 2308040 INFO (coreLoadExecutor-8308-thread-1) [ x:collection1] o.a.s.s.SolrIndexSearcher Opening [Searcher@b23ba7[collection1] main]
[junit4] 2> 2308040 INFO (coreLoadExecutor-8308-thread-1) [ x:collection1] o.a.s.h.c.SpellCheckComponent Initializing spell checkers
[junit4] 2> 2308049 INFO (coreLoadExecutor-8308-thread-1) [ x:collection1] o.a.s.s.DirectSolrSpellChecker init: {name=direct,classname=DirectSolrSpellChecker,field=lowerfilt,minQueryLength=3}
[junit4] 2> 2308095 INFO (coreLoadExecutor-8308-thread-1) [ x:collection1] o.a.s.h.ReplicationHandler Commits will be reserved for 10000
[junit4] 2> 2308095 INFO (searcherExecutor-8309-thread-1-processing-x:collection1) [ x:collection1] o.a.s.h.c.SpellCheckComponent Loading spell index for spellchecker: default
[junit4] 2> 2308096 INFO (searcherExecutor-8309-thread-1-processing-x:collection1) [ x:collection1] o.a.s.h.c.SpellCheckComponent Loading spell index for spellchecker: direct
[junit4] 2> 2308096 INFO (searcherExecutor-8309-thread-1-processing-x:collection1) [ x:collection1] o.a.s.h.c.SpellCheckComponent Loading spell index for spellchecker: wordbreak
[junit4] 2> 2308096 INFO (searcherExecutor-8309-thread-1-processing-x:collection1) [ x:collection1] o.a.s.h.c.SpellCheckComponent Loading spell index for spellchecker: multipleFields
[junit4] 2> 2308096 INFO (searcherExecutor-8309-thread-1-processing-x:collection1) [ x:collection1] o.a.s.h.c.SpellCheckComponent Loading spell index for spellchecker: jarowinkler
[junit4] 2> 2308097 INFO (searcherExecutor-8309-thread-1-processing-x:collection1) [ x:collection1] o.a.s.h.c.SpellCheckComponent Loading spell index for spellchecker: external
[junit4] 2> 2308098 INFO (searcherExecutor-8309-thread-1-processing-x:collection1) [ x:collection1] o.a.s.h.c.SpellCheckComponent Loading spell index for spellchecker: freq
[junit4] 2> 2308099 INFO (searcherExecutor-8309-thread-1-processing-x:collection1) [ x:collection1] o.a.s.h.c.SpellCheckComponent Loading spell index for spellchecker: fqcn
[junit4] 2> 2308099 INFO (searcherExecutor-8309-thread-1-processing-x:collection1) [ x:collection1] o.a.s.h.c.SpellCheckComponent Loading spell index for spellchecker: perDict
[junit4] 2> 2308102 INFO (searcherExecutor-8309-thread-1-processing-x:collection1) [ x:collection1] o.a.s.c.SolrCore [collection1] Registered new searcher Searcher@b23ba7[collection1] main{ExitableDirectoryReader(UninvertingDirectoryReader())}
[junit4] 2> 2308102 INFO (coreLoadExecutor-8308-thread-1) [ x:collection1] o.a.s.u.UpdateLog Could not find max version in index or recent updates, using new clock 1558690747288387584
[junit4] 2> 2308111 INFO (SUITE-MBeansHandlerTest-seed#[F8B49D764FB5EC9]-worker) [ ] o.a.s.SolrTestCaseJ4 ####initCore end
[junit4] 2> 2308114 INFO (TEST-MBeansHandlerTest.testBackCompatNames-seed#[F8B49D764FB5EC9]) [ ] o.a.s.SolrTestCaseJ4 ###Starting testBackCompatNames
[junit4] 2> 2308115 INFO (TEST-MBeansHandlerTest.testBackCompatNames-seed#[F8B49D764FB5EC9]) [ ] o.a.s.c.S.Request [collection1] webapp=null path=null params={qt=/admin/mbeans&wt=xml} status=0 QTime=0
[junit4] 2> 2308133 INFO (TEST-MBeansHandlerTest.testBackCompatNames-seed#[F8B49D764FB5EC9]) [ ] o.a.s.c.S.Request [collection1] webapp=null path=null params={qt=/admin/mbeans&cat=QUERYHANDLER&wt=xml} status=0 QTime=0
[junit4] 2> 2308134 INFO (TEST-MBeansHandlerTest.testBackCompatNames-seed#[F8B49D764FB5EC9]) [ ] o.a.s.c.S.Request [collection1] webapp=null path=null params={qt=/admin/mbeans&cat=UPDATE&wt=xml} status=0 QTime=0
[junit4] 2> 2308135 INFO (TEST-MBeansHandlerTest.testBackCompatNames-seed#[F8B49D764FB5EC9]) [ ] o.a.s.SolrTestCaseJ4 ###Ending testBackCompatNames
[junit4] 2> 2308137 INFO (TEST-MBeansHandlerTest.testXMLDiffWithExternalEntity-seed#[F8B49D764FB5EC9]) [ ] o.a.s.SolrTestCaseJ4 ###Starting testXMLDiffWithExternalEntity
[junit4] 2> 2308227 INFO (TEST-MBeansHandlerTest.testXMLDiffWithExternalEntity-seed#[F8B49D764FB5EC9]) [ ] o.a.s.SolrTestCaseJ4 ###Ending testXMLDiffWithExternalEntity
[junit4] 2> 2308230 INFO (TEST-MBeansHandlerTest.testDiff-seed#[F8B49D764FB5EC9]) [ ] o.a.s.SolrTestCaseJ4 ###Starting testDiff
[junit4] 2> 2308233 INFO (TEST-MBeansHandlerTest.testDiff-seed#[F8B49D764FB5EC9]) [ ] o.a.s.c.S.Request [collection1] webapp=null path=null params={qt=/admin/mbeans&stats=true&wt=xml} status=0 QTime=2
[junit4] 2> 2308255 INFO (TEST-MBeansHandlerTest.testDiff-seed#[F8B49D764FB5EC9]) [ ] o.a.s.c.S.Request [collection1] webapp=null path=null params={qt=/admin/mbeans&stats=true&diff=true&wt=xml} status=0 QTime=19
[junit4] 2> 2308257 INFO (TEST-MBeansHandlerTest.testDiff-seed#[F8B49D764FB5EC9]) [ ] o.a.s.SolrTestCaseJ4 ###Ending testDiff
[junit4] 2> NOTE: reproduce with: ant test -Dtestcase=MBeansHandlerTest -Dtests.method=testDiff -Dtests.seed=F8B49D764FB5EC9 -Dtests.slow=true -Dtests.locale=ja -Dtests.timezone=America/Dawson_Creek -Dtests.asserts=true -Dtests.file.encoding=ISO-8859-1
[junit4] FAILURE 0.04s J1 | MBeansHandlerTest.testDiff <<<
[junit4] > Throwable #1: org.junit.ComparisonFailure: expected:<Was: [1, Now: 2], Delta: 1> but was:<Was: [4, Now: 5], Delta: 1>
[junit4] > at __randomizedtesting.SeedInfo.seed([F8B49D764FB5EC9:CA9D8D4C744D66A9]:0)
[junit4] > at org.apache.solr.handler.admin.MBeansHandlerTest.testDiff(MBeansHandlerTest.java:63)
[junit4] > at java.lang.Thread.run(Thread.java:745)
[junit4] 2> 2308263 INFO (SUITE-MBeansHandlerTest-seed#[F8B49D764FB5EC9]-worker) [ ] o.a.s.SolrTestCaseJ4 ###deleteCore
[junit4] 2> 2308263 INFO (SUITE-MBeansHandlerTest-seed#[F8B49D764FB5EC9]-worker) [ ] o.a.s.c.CoreContainer Shutting down CoreContainer instance=14937543
[junit4] 2> 2308264 INFO (coreCloseExecutor-8314-thread-1) [ x:collection1] o.a.s.c.SolrCore [collection1] CLOSING SolrCore org.apache.solr.core.SolrCore@11ad34f
[junit4] 2> 2308329 INFO (coreCloseExecutor-8314-thread-1) [ x:collection1] o.a.s.m.SolrMetricManager Closing metric reporters for: solr.core.collection1
[junit4] 2> 2308334 INFO (SUITE-MBeansHandlerTest-seed#[F8B49D764FB5EC9]-worker) [ ] o.a.s.m.SolrMetricManager Closing metric reporters for: solr.node
[junit4] 2> NOTE: leaving temporary files on disk at: C:\Users\jenkins\workspace\Lucene-Solr-6.x-Windows\solr\build\solr-core\test\J1\temp\solr.handler.admin.MBeansHandlerTest_F8B49D764FB5EC9-001
[junit4] 2> NOTE: test params are: codec=Asserting(Lucene62): {}, docValues:{}, maxPointsInLeafNode=779, maxMBSortInHeap=5.047386011106675, sim=RandomSimilarity(queryNorm=false,coord=crazy): {}, locale=ja, timezone=America/Dawson_Creek
[junit4] 2> NOTE: Windows 10 10.0 x86/Oracle Corporation 1.8.0_121 (32-bit)/cpus=3,threads=1,free=111691552,total=284164096
[junit4] 2> NOTE: All tests run in this JVM: [LeaderInitiatedRecoveryOnCommitTest, HighlighterConfigTest, TermVectorComponentDistributedTest, TestCollationFieldDocValues, DateMathParserTest, CdcrRequestHandlerTest, TestReversedWildcardFilterFactory, TestUniqueKeyFieldResource, TestAtomicUpdateErrorCases, TestFiltering, JsonValidatorTest, MultiThreadedOCPTest, HdfsChaosMonkeyNothingIsSafeTest, SpatialHeatmapFacetsTest, TestSolrQueryParserDefaultOperatorResource, SimpleCollectionCreateDeleteTest, AssignTest, TestDocSet, TestSystemIdResolver, UUIDFieldTest, TestSQLHandlerNonCloud, RulesTest, TestScoreJoinQPNoScore, FieldMutatingUpdateProcessorTest, CopyFieldTest, TestDFRSimilarityFactory, TestLeaderElectionZkExpiry, TestSolrConfigHandlerConcurrent, MigrateRouteKeyTest, DistributedIntervalFacetingTest, FieldAnalysisRequestHandlerTest, CoreSorterTest, TestRequestForwarding, HdfsRecoverLeaseTest, ReturnFieldsTest, TestInfoStreamLogging, TestRecovery, RemoteQueryErrorTest, TestDistributedMissingSort, TestPathTrie, SpellingQueryConverterTest, TestSortByMinMaxFunction, TestDFISimilarityFactory, DistributedFacetPivotSmallAdvancedTest, DistributedQueueTest, TestCorePropertiesReload, TestFoldingMultitermQuery, ClassificationUpdateProcessorFactoryTest, TestBulkSchemaConcurrent, TestCloudPseudoReturnFields, CoreAdminRequestStatusTest, TestSolrCloudWithDelegationTokens, ConvertedLegacyTest, TestDocTermOrds, TermVectorComponentTest, CircularListTest, LeaderElectionIntegrationTest, SolrInfoMBeanTest, IndexSchemaTest, DocValuesNotIndexedTest, TestSolrCoreProperties, RankQueryTest, TestDynamicLoading, DistributedExpandComponentTest, TestZkChroot, CoreAdminHandlerTest, UUIDUpdateProcessorFallbackTest, PreAnalyzedFieldManagedSchemaCloudTest, TestQueryTypes, SuggesterWFSTTest, SimpleMLTQParserTest, SolrCloudExampleTest, DirectUpdateHandlerOptimizeTest, DistributedFacetPivotLargeTest, TestFileDictionaryLookup, TestManagedSynonymFilterFactory, PreAnalyzedFieldTest, TestSuggestSpellingConverter, OverseerModifyCollectionTest, TestInitQParser, TestAddFieldRealTimeGet, CheckHdfsIndexTest, TestSubQueryTransformerCrossCore, TestExpandComponent, TestSlowCompositeReaderWrapper, ParsingFieldUpdateProcessorsTest, BlockJoinFacetSimpleTest, BadIndexSchemaTest, SecurityConfHandlerTest, SliceStateTest, NotRequiredUniqueKeyTest, TestJoin, TestRestoreCore, TestFieldCacheReopen, DeleteReplicaTest, StressHdfsTest, TestAuthorizationFramework, TestSolrCloudSnapshots, ConcurrentDeleteAndCreateCollectionTest, TestLegacyFieldCache, HttpPartitionTest, TestFieldTypeResource, StatsReloadRaceTest, TestJsonRequest, TestCoreAdminApis, CollectionsAPIAsyncDistributedZkTest, TestStressLiveNodes, TestReloadDeadlock, SortByFunctionTest, OpenCloseCoreStressTest, SolrMetricsIntegrationTest, AutoCommitTest, QueryResultKeyTest, TestManagedSchemaAPI, TestSolrFieldCacheMBean, TestPHPSerializedResponseWriter, TestNumericTerms64, CacheHeaderTest, BlockJoinFacetDistribTest, TestBadConfig, TestExactStatsCache, TestAnalyzeInfixSuggestions, SuggestComponentTest, TestReload, DateRangeFieldTest, TestFieldCacheVsDocValues, FullSolrCloudDistribCmdsTest, TestDownShardTolerantSearch, SuggesterTest, QueryParsingTest, TestConfigReload, TestConfigSetsAPIZkFailure, ResourceLoaderTest, TestSolrQueryParser, BitVectorTest, TestCoreDiscovery, WordBreakSolrSpellCheckerTest, TriLevelCompositeIdRoutingTest, TestFuzzyAnalyzedSuggestions, ExternalFileFieldSortTest, TestRandomCollapseQParserPlugin, TestJmxMonitoredMap, DistributedQueryComponentOptimizationTest, TestIndexingPerformance, DebugComponentTest, TestMissingGroups, ShardRoutingCustomTest, DistributedTermsComponentTest, TestCollapseQParserPlugin, TestChildDocTransformer, SuggesterTSTTest, RAMDirectoryFactoryTest, SpellCheckComponentTest, TestPushWriter, UpdateParamsTest, ReplicationFactorTest, TestFieldCacheSort, TestIndexSearcher, TestRandomFaceting, TestLocalFSCloudBackupRestore, AddBlockUpdateTest, SolrMetricManagerTest, SolrIndexConfigTest, TestSSLRandomization, TestMacroExpander, TestTrackingShardHandlerFactory, RequestHandlersTest, CSVRequestHandlerTest, HdfsThreadLeakTest, TestCodecSupport, BasicDistributedZkTest, ChaosMonkeySafeLeaderTest, BasicDistributedZk2Test, CollectionsAPIDistributedZkTest, BasicZkTest, RecoveryZkTest, TestReplicationHandler, TestDistributedGrouping, ZkControllerTest, TestRealTimeGet, TestStressReorder, TestRangeQuery, TestCoreContainer, SimpleFacetsTest, TestSolr4Spatial, StatsComponentTest, PeerSyncTest, DirectUpdateHandlerTest, SoftAutoCommitTest, ShowFileRequestHandlerTest, CurrencyFieldOpenExchangeTest, DistributedQueryElevationComponentTest, SignatureUpdateProcessorFactoryTest, SolrRequestParserTest, DocValuesTest, QueryEqualityTest, TestRemoteStreaming, DistanceFunctionTest, XsltUpdateRequestHandlerTest, DisMaxRequestHandlerTest, TestQueryUtils, StandardRequestHandlerTest, TestWriterPerf, PrimitiveFieldTypeTest, FileBasedSpellCheckerTest, TestValueSourceCache, RegexBoostProcessorTest, SolrPluginUtilsTest, MBeansHandlerTest]
[junit4] Completed [413/690 (1!)] on J1 in 1.19s, 3 tests, 1 failure <<< FAILURES!
[...truncated 55658 lines...]
[JENKINS] Lucene-Solr-6.x-Windows (32bit/jdk1.8.0_121) - Build #
720 - Still Failing!
Posted by Policeman Jenkins Server <je...@thetaphi.de>.
Build: https://jenkins.thetaphi.de/job/Lucene-Solr-6.x-Windows/720/
Java: 32bit/jdk1.8.0_121 -client -XX:+UseParallelGC
All tests passed
Build Log:
[...truncated 66637 lines...]
-ecj-javadoc-lint-tests:
[mkdir] Created dir: C:\Users\jenkins\AppData\Local\Temp\ecj786844096
[ecj-lint] Compiling 759 source files to C:\Users\jenkins\AppData\Local\Temp\ecj786844096
[ecj-lint] invalid Class-Path header in manifest of jar file: C:\Users\jenkins\workspace\Lucene-Solr-6.x-Windows\solr\core\lib\org.restlet-2.3.0.jar
[ecj-lint] invalid Class-Path header in manifest of jar file: C:\Users\jenkins\workspace\Lucene-Solr-6.x-Windows\solr\core\lib\org.restlet.ext.servlet-2.3.0.jar
[ecj-lint] ----------
[ecj-lint] 1. WARNING in C:\Users\jenkins\workspace\Lucene-Solr-6.x-Windows\solr\core\src\test\org\apache\solr\cloud\OverseerTest.java (at line 266)
[ecj-lint] ZkStateReader reader = new ZkStateReader(zkClient);
[ecj-lint] ^^^^^^
[ecj-lint] Resource leak: 'reader' is never closed
[ecj-lint] ----------
[ecj-lint] 2. WARNING in C:\Users\jenkins\workspace\Lucene-Solr-6.x-Windows\solr\core\src\test\org\apache\solr\cloud\OverseerTest.java (at line 316)
[ecj-lint] ZkStateReader reader = new ZkStateReader(zkClient);
[ecj-lint] ^^^^^^
[ecj-lint] Resource leak: 'reader' is never closed
[ecj-lint] ----------
[ecj-lint] ----------
[ecj-lint] 3. WARNING in C:\Users\jenkins\workspace\Lucene-Solr-6.x-Windows\solr\core\src\test\org\apache\solr\core\HdfsDirectoryFactoryTest.java (at line 146)
[ecj-lint] HdfsDirectoryFactory hdfsFactory = new HdfsDirectoryFactory();
[ecj-lint] ^^^^^^^^^^^
[ecj-lint] Resource leak: 'hdfsFactory' is never closed
[ecj-lint] ----------
[ecj-lint] ----------
[ecj-lint] 4. WARNING in C:\Users\jenkins\workspace\Lucene-Solr-6.x-Windows\solr\core\src\test\org\apache\solr\handler\admin\SecurityConfHandlerTest.java (at line 53)
[ecj-lint] BasicAuthPlugin basicAuth = new BasicAuthPlugin();
[ecj-lint] ^^^^^^^^^
[ecj-lint] Resource leak: 'basicAuth' is never closed
[ecj-lint] ----------
[ecj-lint] ----------
[ecj-lint] 5. WARNING in C:\Users\jenkins\workspace\Lucene-Solr-6.x-Windows\solr\core\src\test\org\apache\solr\handler\component\DistributedDebugComponentTest.java (at line 163)
[ecj-lint] SolrClient client = random().nextBoolean() ? collection1 : collection2;
[ecj-lint] ^^^^^^
[ecj-lint] Resource leak: 'client' is never closed
[ecj-lint] ----------
[ecj-lint] 6. WARNING in C:\Users\jenkins\workspace\Lucene-Solr-6.x-Windows\solr\core\src\test\org\apache\solr\handler\component\DistributedDebugComponentTest.java (at line 221)
[ecj-lint] throw new AssertionError(q.toString() + ": " + e.getMessage(), e);
[ecj-lint] ^^^^^^^^^^^^^^^^^^^^^^^^^^^^^^^^^^^^^^^^^^^^^^^^^^^^^^^^^^^^^^^^^^
[ecj-lint] Resource leak: 'client' is not closed at this location
[ecj-lint] ----------
[ecj-lint] ----------
[ecj-lint] 7. WARNING in C:\Users\jenkins\workspace\Lucene-Solr-6.x-Windows\solr\core\src\test\org\apache\solr\highlight\HighlighterTest.java (at line 201)
[ecj-lint] Analyzer a1 = new WhitespaceAnalyzer();
[ecj-lint] ^^
[ecj-lint] Resource leak: 'a1' is never closed
[ecj-lint] ----------
[ecj-lint] 8. WARNING in C:\Users\jenkins\workspace\Lucene-Solr-6.x-Windows\solr\core\src\test\org\apache\solr\highlight\HighlighterTest.java (at line 204)
[ecj-lint] OffsetWindowTokenFilter tots = new OffsetWindowTokenFilter(tokenStream);
[ecj-lint] ^^^^
[ecj-lint] Resource leak: 'tots' is never closed
[ecj-lint] ----------
[ecj-lint] 9. WARNING in C:\Users\jenkins\workspace\Lucene-Solr-6.x-Windows\solr\core\src\test\org\apache\solr\highlight\HighlighterTest.java (at line 208)
[ecj-lint] Analyzer a2 = new WhitespaceAnalyzer();
[ecj-lint] ^^
[ecj-lint] Resource leak: 'a2' is never closed
[ecj-lint] ----------
[ecj-lint] ----------
[ecj-lint] 10. WARNING in C:\Users\jenkins\workspace\Lucene-Solr-6.x-Windows\solr\core\src\test\org\apache\solr\request\TestBinaryResponseWriter.java (at line 65)
[ecj-lint] NamedList res = (NamedList) new JavaBinCodec().unmarshal(new ByteArrayInputStream(baos.toByteArray()));
[ecj-lint] ^^^^^^^^^^^^^^^^^^
[ecj-lint] Resource leak: '<unassigned Closeable value>' is never closed
[ecj-lint] ----------
[ecj-lint] ----------
[ecj-lint] 11. WARNING in C:\Users\jenkins\workspace\Lucene-Solr-6.x-Windows\solr\core\src\test\org\apache\solr\response\TestBinaryResponseWriter.java (at line 63)
[ecj-lint] NamedList res = (NamedList) new JavaBinCodec().unmarshal(new ByteArrayInputStream(baos.toByteArray()));
[ecj-lint] ^^^^^^^^^^^^^^^^^^
[ecj-lint] Resource leak: '<unassigned Closeable value>' is never closed
[ecj-lint] ----------
[ecj-lint] ----------
[ecj-lint] 12. WARNING in C:\Users\jenkins\workspace\Lucene-Solr-6.x-Windows\solr\core\src\test\org\apache\solr\response\TestJavabinTupleStreamParser.java (at line 72)
[ecj-lint] JavabinTupleStreamParser parser = new JavabinTupleStreamParser(new ByteArrayInputStream(bytes), true);
[ecj-lint] ^^^^^^
[ecj-lint] Resource leak: 'parser' is never closed
[ecj-lint] ----------
[ecj-lint] 13. WARNING in C:\Users\jenkins\workspace\Lucene-Solr-6.x-Windows\solr\core\src\test\org\apache\solr\response\TestJavabinTupleStreamParser.java (at line 173)
[ecj-lint] new JavaBinCodec().marshal(response.getValues(), baos);
[ecj-lint] ^^^^^^^^^^^^^^^^^^
[ecj-lint] Resource leak: '<unassigned Closeable value>' is never closed
[ecj-lint] ----------
[ecj-lint] 14. WARNING in C:\Users\jenkins\workspace\Lucene-Solr-6.x-Windows\solr\core\src\test\org\apache\solr\response\TestJavabinTupleStreamParser.java (at line 175)
[ecj-lint] Object o = new JavaBinCodec().unmarshal(new ByteArrayInputStream(bytes));
[ecj-lint] ^^^^^^^^^^^^^^^^^^
[ecj-lint] Resource leak: '<unassigned Closeable value>' is never closed
[ecj-lint] ----------
[ecj-lint] 15. WARNING in C:\Users\jenkins\workspace\Lucene-Solr-6.x-Windows\solr\core\src\test\org\apache\solr\response\TestJavabinTupleStreamParser.java (at line 178)
[ecj-lint] JavabinTupleStreamParser parser = new JavabinTupleStreamParser(new ByteArrayInputStream(bytes), false);
[ecj-lint] ^^^^^^
[ecj-lint] Resource leak: 'parser' is never closed
[ecj-lint] ----------
[ecj-lint] 16. WARNING in C:\Users\jenkins\workspace\Lucene-Solr-6.x-Windows\solr\core\src\test\org\apache\solr\response\TestJavabinTupleStreamParser.java (at line 192)
[ecj-lint] new JavaBinCodec().marshal(response.getValues(), baos);
[ecj-lint] ^^^^^^^^^^^^^^^^^^
[ecj-lint] Resource leak: '<unassigned Closeable value>' is never closed
[ecj-lint] ----------
[ecj-lint] ----------
[ecj-lint] 17. WARNING in C:\Users\jenkins\workspace\Lucene-Solr-6.x-Windows\solr\core\src\test\org\apache\solr\response\TestPushWriter.java (at line 57)
[ecj-lint] m = (Map) new JavaBinCodec().unmarshal(new ByteArrayInputStream(baos.toByteArray()));
[ecj-lint] ^^^^^^^^^^^^^^^^^^
[ecj-lint] Resource leak: '<unassigned Closeable value>' is never closed
[ecj-lint] ----------
[ecj-lint] ----------
[ecj-lint] 18. WARNING in C:\Users\jenkins\workspace\Lucene-Solr-6.x-Windows\solr\core\src\test\org\apache\solr\response\transform\TestSubQueryTransformer.java (at line 387)
[ecj-lint] unmarshalled = (NamedList<Object>) new JavaBinCodec().unmarshal(
[ecj-lint] ^^^^^^^^^^^^^^^^^^
[ecj-lint] Resource leak: '<unassigned Closeable value>' is never closed
[ecj-lint] ----------
[ecj-lint] ----------
[ecj-lint] 19. WARNING in C:\Users\jenkins\workspace\Lucene-Solr-6.x-Windows\solr\core\src\test\org\apache\solr\search\TestDocSet.java (at line 241)
[ecj-lint] return loadfactor!=0 ? new HashDocSet(a,0,n,1/loadfactor) : new HashDocSet(a,0,n);
[ecj-lint] ^^^^^^^^^^^^^^^^^^^^^^^^^^^^^^^^^^
[ecj-lint] Resource leak: '<unassigned Closeable value>' is never closed
[ecj-lint] ----------
[ecj-lint] 20. WARNING in C:\Users\jenkins\workspace\Lucene-Solr-6.x-Windows\solr\core\src\test\org\apache\solr\search\TestDocSet.java (at line 531)
[ecj-lint] DocSet a = new BitDocSet(bs);
[ecj-lint] ^
[ecj-lint] Resource leak: 'a' is never closed
[ecj-lint] ----------
[ecj-lint] ----------
[ecj-lint] 21. WARNING in C:\Users\jenkins\workspace\Lucene-Solr-6.x-Windows\solr\core\src\test\org\apache\solr\security\TestPKIAuthenticationPlugin.java (at line 85)
[ecj-lint] final MockPKIAuthenticationPlugin mock = new MockPKIAuthenticationPlugin(null, nodeName);
[ecj-lint] ^^^^
[ecj-lint] Resource leak: 'mock' is never closed
[ecj-lint] ----------
[ecj-lint] 22. WARNING in C:\Users\jenkins\workspace\Lucene-Solr-6.x-Windows\solr\core\src\test\org\apache\solr\security\TestPKIAuthenticationPlugin.java (at line 138)
[ecj-lint] MockPKIAuthenticationPlugin mock1 = new MockPKIAuthenticationPlugin(null, nodeName) {
[ecj-lint] ^^^^^
[ecj-lint] Resource leak: 'mock1' is never closed
[ecj-lint] ----------
[ecj-lint] ----------
[ecj-lint] 23. WARNING in C:\Users\jenkins\workspace\Lucene-Solr-6.x-Windows\solr\core\src\test\org\apache\solr\security\TestRuleBasedAuthorizationPlugin.java (at line 365)
[ecj-lint] RuleBasedAuthorizationPlugin plugin = new RuleBasedAuthorizationPlugin();
[ecj-lint] ^^^^^^
[ecj-lint] Resource leak: 'plugin' is never closed
[ecj-lint] ----------
[ecj-lint] ----------
[ecj-lint] 24. WARNING in C:\Users\jenkins\workspace\Lucene-Solr-6.x-Windows\solr\core\src\test\org\apache\solr\security\TestSha256AuthenticationProvider.java (at line 49)
[ecj-lint] BasicAuthPlugin basicAuthPlugin = new BasicAuthPlugin();
[ecj-lint] ^^^^^^^^^^^^^^^
[ecj-lint] Resource leak: 'basicAuthPlugin' is never closed
[ecj-lint] ----------
[ecj-lint] ----------
[ecj-lint] 25. WARNING in C:\Users\jenkins\workspace\Lucene-Solr-6.x-Windows\solr\core\src\test\org\apache\solr\spelling\SimpleQueryConverter.java (at line 42)
[ecj-lint] WhitespaceAnalyzer analyzer = new WhitespaceAnalyzer();
[ecj-lint] ^^^^^^^^
[ecj-lint] Resource leak: 'analyzer' is never closed
[ecj-lint] ----------
[ecj-lint] ----------
[ecj-lint] 26. ERROR in C:\Users\jenkins\workspace\Lucene-Solr-6.x-Windows\solr\core\src\test\org\apache\solr\store\blockcache\BlockCacheTest.java (at line 22)
[ecj-lint] import java.util.concurrent.atomic.AtomicInteger;
[ecj-lint] ^^^^^^^^^^^^^^^^^^^^^^^^^^^^^^^^^^^^^^^^^
[ecj-lint] The import java.util.concurrent.atomic.AtomicInteger is never used
[ecj-lint] ----------
[ecj-lint] ----------
[ecj-lint] 27. WARNING in C:\Users\jenkins\workspace\Lucene-Solr-6.x-Windows\solr\core\src\test\org\apache\solr\uninverting\TestFieldCacheVsDocValues.java (at line 139)
[ecj-lint] IndexWriter w = new IndexWriter(d, newIndexWriterConfig(analyzer));
[ecj-lint] ^
[ecj-lint] Resource leak: 'w' is never closed
[ecj-lint] ----------
[ecj-lint] 28. WARNING in C:\Users\jenkins\workspace\Lucene-Solr-6.x-Windows\solr\core\src\test\org\apache\solr\uninverting\TestFieldCacheVsDocValues.java (at line 172)
[ecj-lint] throw iae;
[ecj-lint] ^^^^^^^^^^
[ecj-lint] Resource leak: 'w' is not closed at this location
[ecj-lint] ----------
[ecj-lint] 29. WARNING in C:\Users\jenkins\workspace\Lucene-Solr-6.x-Windows\solr\core\src\test\org\apache\solr\uninverting\TestFieldCacheVsDocValues.java (at line 178)
[ecj-lint] return;
[ecj-lint] ^^^^^^^
[ecj-lint] Resource leak: 'w' is not closed at this location
[ecj-lint] ----------
[ecj-lint] ----------
[ecj-lint] 30. WARNING in C:\Users\jenkins\workspace\Lucene-Solr-6.x-Windows\solr\core\src\test\org\apache\solr\update\AddBlockUpdateTest.java (at line 415)
[ecj-lint] new JavaBinCodec().marshal(topDocument, os);
[ecj-lint] ^^^^^^^^^^^^^^^^^^
[ecj-lint] Resource leak: '<unassigned Closeable value>' is never closed
[ecj-lint] ----------
[ecj-lint] 31. WARNING in C:\Users\jenkins\workspace\Lucene-Solr-6.x-Windows\solr\core\src\test\org\apache\solr\update\AddBlockUpdateTest.java (at line 419)
[ecj-lint] SolrInputDocument result = (SolrInputDocument) new JavaBinCodec().unmarshal(is);
[ecj-lint] ^^^^^^^^^^^^^^^^^^
[ecj-lint] Resource leak: '<unassigned Closeable value>' is never closed
[ecj-lint] ----------
[ecj-lint] ----------
[ecj-lint] 32. WARNING in C:\Users\jenkins\workspace\Lucene-Solr-6.x-Windows\solr\core\src\test\org\apache\solr\update\SolrIndexSplitterTest.java (at line 181)
[ecj-lint] EmbeddedSolrServer server1 = new EmbeddedSolrServer(h.getCoreContainer(), "split1");
[ecj-lint] ^^^^^^^
[ecj-lint] Resource leak: 'server1' is never closed
[ecj-lint] ----------
[ecj-lint] 33. WARNING in C:\Users\jenkins\workspace\Lucene-Solr-6.x-Windows\solr\core\src\test\org\apache\solr\update\SolrIndexSplitterTest.java (at line 182)
[ecj-lint] EmbeddedSolrServer server2 = new EmbeddedSolrServer(h.getCoreContainer(), "split2");
[ecj-lint] ^^^^^^^
[ecj-lint] Resource leak: 'server2' is never closed
[ecj-lint] ----------
[ecj-lint] 33 problems (1 error, 32 warnings)
BUILD FAILED
C:\Users\jenkins\workspace\Lucene-Solr-6.x-Windows\build.xml:775: The following error occurred while executing this line:
C:\Users\jenkins\workspace\Lucene-Solr-6.x-Windows\build.xml:101: The following error occurred while executing this line:
C:\Users\jenkins\workspace\Lucene-Solr-6.x-Windows\solr\build.xml:674: The following error occurred while executing this line:
C:\Users\jenkins\workspace\Lucene-Solr-6.x-Windows\lucene\common-build.xml:2007: The following error occurred while executing this line:
C:\Users\jenkins\workspace\Lucene-Solr-6.x-Windows\lucene\common-build.xml:2040: Compile failed; see the compiler error output for details.
Total time: 99 minutes 16 seconds
Build step 'Invoke Ant' marked build as failure
Archiving artifacts
[WARNINGS] Skipping publisher since build result is FAILURE
Recording test results
Email was triggered for: Failure - Any
Sending email for trigger: Failure - Any
[JENKINS] Lucene-Solr-6.x-Windows (32bit/jdk1.8.0_121) - Build #
719 - Still Failing!
Posted by Policeman Jenkins Server <je...@thetaphi.de>.
Build: https://jenkins.thetaphi.de/job/Lucene-Solr-6.x-Windows/719/
Java: 32bit/jdk1.8.0_121 -server -XX:+UseParallelGC
1 tests failed.
FAILED: org.apache.solr.handler.admin.MBeansHandlerTest.testDiff
Error Message:
expected:<Was: [1, Now: 2], Delta: 1> but was:<Was: [4, Now: 5], Delta: 1>
Stack Trace:
org.junit.ComparisonFailure: expected:<Was: [1, Now: 2], Delta: 1> but was:<Was: [4, Now: 5], Delta: 1>
at __randomizedtesting.SeedInfo.seed([BCAC31D56FD1F65B:79BAF54E7F67CE3B]:0)
at org.junit.Assert.assertEquals(Assert.java:125)
at org.junit.Assert.assertEquals(Assert.java:147)
at org.apache.solr.handler.admin.MBeansHandlerTest.testDiff(MBeansHandlerTest.java:63)
at sun.reflect.NativeMethodAccessorImpl.invoke0(Native Method)
at sun.reflect.NativeMethodAccessorImpl.invoke(NativeMethodAccessorImpl.java:62)
at sun.reflect.DelegatingMethodAccessorImpl.invoke(DelegatingMethodAccessorImpl.java:43)
at java.lang.reflect.Method.invoke(Method.java:498)
at com.carrotsearch.randomizedtesting.RandomizedRunner.invoke(RandomizedRunner.java:1713)
at com.carrotsearch.randomizedtesting.RandomizedRunner$8.evaluate(RandomizedRunner.java:907)
at com.carrotsearch.randomizedtesting.RandomizedRunner$9.evaluate(RandomizedRunner.java:943)
at com.carrotsearch.randomizedtesting.RandomizedRunner$10.evaluate(RandomizedRunner.java:957)
at com.carrotsearch.randomizedtesting.rules.SystemPropertiesRestoreRule$1.evaluate(SystemPropertiesRestoreRule.java:57)
at org.apache.lucene.util.TestRuleSetupTeardownChained$1.evaluate(TestRuleSetupTeardownChained.java:49)
at org.apache.lucene.util.AbstractBeforeAfterRule$1.evaluate(AbstractBeforeAfterRule.java:45)
at org.apache.lucene.util.TestRuleThreadAndTestName$1.evaluate(TestRuleThreadAndTestName.java:48)
at org.apache.lucene.util.TestRuleIgnoreAfterMaxFailures$1.evaluate(TestRuleIgnoreAfterMaxFailures.java:64)
at org.apache.lucene.util.TestRuleMarkFailure$1.evaluate(TestRuleMarkFailure.java:47)
at com.carrotsearch.randomizedtesting.rules.StatementAdapter.evaluate(StatementAdapter.java:36)
at com.carrotsearch.randomizedtesting.ThreadLeakControl$StatementRunner.run(ThreadLeakControl.java:368)
at com.carrotsearch.randomizedtesting.ThreadLeakControl.forkTimeoutingTask(ThreadLeakControl.java:817)
at com.carrotsearch.randomizedtesting.ThreadLeakControl$3.evaluate(ThreadLeakControl.java:468)
at com.carrotsearch.randomizedtesting.RandomizedRunner.runSingleTest(RandomizedRunner.java:916)
at com.carrotsearch.randomizedtesting.RandomizedRunner$5.evaluate(RandomizedRunner.java:802)
at com.carrotsearch.randomizedtesting.RandomizedRunner$6.evaluate(RandomizedRunner.java:852)
at com.carrotsearch.randomizedtesting.RandomizedRunner$7.evaluate(RandomizedRunner.java:863)
at com.carrotsearch.randomizedtesting.rules.StatementAdapter.evaluate(StatementAdapter.java:36)
at com.carrotsearch.randomizedtesting.rules.SystemPropertiesRestoreRule$1.evaluate(SystemPropertiesRestoreRule.java:57)
at org.apache.lucene.util.AbstractBeforeAfterRule$1.evaluate(AbstractBeforeAfterRule.java:45)
at com.carrotsearch.randomizedtesting.rules.StatementAdapter.evaluate(StatementAdapter.java:36)
at org.apache.lucene.util.TestRuleStoreClassName$1.evaluate(TestRuleStoreClassName.java:41)
at com.carrotsearch.randomizedtesting.rules.NoShadowingOrOverridesOnMethodsRule$1.evaluate(NoShadowingOrOverridesOnMethodsRule.java:40)
at com.carrotsearch.randomizedtesting.rules.NoShadowingOrOverridesOnMethodsRule$1.evaluate(NoShadowingOrOverridesOnMethodsRule.java:40)
at com.carrotsearch.randomizedtesting.rules.StatementAdapter.evaluate(StatementAdapter.java:36)
at com.carrotsearch.randomizedtesting.rules.StatementAdapter.evaluate(StatementAdapter.java:36)
at com.carrotsearch.randomizedtesting.rules.StatementAdapter.evaluate(StatementAdapter.java:36)
at org.apache.lucene.util.TestRuleAssertionsRequired$1.evaluate(TestRuleAssertionsRequired.java:53)
at org.apache.lucene.util.TestRuleMarkFailure$1.evaluate(TestRuleMarkFailure.java:47)
at org.apache.lucene.util.TestRuleIgnoreAfterMaxFailures$1.evaluate(TestRuleIgnoreAfterMaxFailures.java:64)
at org.apache.lucene.util.TestRuleIgnoreTestSuites$1.evaluate(TestRuleIgnoreTestSuites.java:54)
at com.carrotsearch.randomizedtesting.rules.StatementAdapter.evaluate(StatementAdapter.java:36)
at com.carrotsearch.randomizedtesting.ThreadLeakControl$StatementRunner.run(ThreadLeakControl.java:368)
at java.lang.Thread.run(Thread.java:745)
Build Log:
[...truncated 11384 lines...]
[junit4] Suite: org.apache.solr.handler.admin.MBeansHandlerTest
[junit4] 2> Creating dataDir: C:\Users\jenkins\workspace\Lucene-Solr-6.x-Windows\solr\build\solr-core\test\J1\temp\solr.handler.admin.MBeansHandlerTest_BCAC31D56FD1F65B-001\init-core-data-001
[junit4] 2> 541074 INFO (SUITE-MBeansHandlerTest-seed#[BCAC31D56FD1F65B]-worker) [ ] o.a.s.SolrTestCaseJ4 Randomized ssl (false) and clientAuth (true) via: @org.apache.solr.util.RandomizeSSL(reason=, value=NaN, ssl=NaN, clientAuth=NaN)
[junit4] 2> 541075 INFO (SUITE-MBeansHandlerTest-seed#[BCAC31D56FD1F65B]-worker) [ ] o.a.s.SolrTestCaseJ4 ####initCore
[junit4] 2> 541076 INFO (SUITE-MBeansHandlerTest-seed#[BCAC31D56FD1F65B]-worker) [ ] o.a.s.c.SolrResourceLoader [null] Added 2 libs to classloader, from paths: [/C:/Users/jenkins/workspace/Lucene-Solr-6.x-Windows/solr/core/src/test-files/solr/collection1/lib, /C:/Users/jenkins/workspace/Lucene-Solr-6.x-Windows/solr/core/src/test-files/solr/collection1/lib/classes]
[junit4] 2> 541183 INFO (SUITE-MBeansHandlerTest-seed#[BCAC31D56FD1F65B]-worker) [ ] o.a.s.c.SolrConfig Using Lucene MatchVersion: 6.5.0
[junit4] 2> 541206 INFO (SUITE-MBeansHandlerTest-seed#[BCAC31D56FD1F65B]-worker) [ ] o.a.s.s.IndexSchema [null] Schema name=test
[junit4] 2> 541296 WARN (SUITE-MBeansHandlerTest-seed#[BCAC31D56FD1F65B]-worker) [ ] o.a.s.s.IndexSchema [null] default search field in schema is text. WARNING: Deprecated, please use 'df' on request instead.
[junit4] 2> 541299 INFO (SUITE-MBeansHandlerTest-seed#[BCAC31D56FD1F65B]-worker) [ ] o.a.s.s.IndexSchema Loaded schema test/1.0 with uniqueid field id
[junit4] 2> 541314 INFO (SUITE-MBeansHandlerTest-seed#[BCAC31D56FD1F65B]-worker) [ ] o.a.s.u.UpdateShardHandler Creating UpdateShardHandler HTTP client with params: socketTimeout=30000&connTimeout=30000&retry=true
[junit4] 2> 541437 WARN (SUITE-MBeansHandlerTest-seed#[BCAC31D56FD1F65B]-worker) [ ] o.a.s.m.r.SolrJmxReporter No serviceUrl or agentId was configured, using first MBeanServer.
[junit4] 2> 541439 INFO (SUITE-MBeansHandlerTest-seed#[BCAC31D56FD1F65B]-worker) [ ] o.a.s.m.r.SolrJmxReporter JMX monitoring enabled at server: com.sun.jmx.mbeanserver.JmxMBeanServer@1eb90ed
[junit4] 2> 541439 WARN (SUITE-MBeansHandlerTest-seed#[BCAC31D56FD1F65B]-worker) [ ] o.a.s.m.r.SolrJmxReporter No serviceUrl or agentId was configured, using first MBeanServer.
[junit4] 2> 541445 INFO (SUITE-MBeansHandlerTest-seed#[BCAC31D56FD1F65B]-worker) [ ] o.a.s.m.r.SolrJmxReporter JMX monitoring enabled at server: com.sun.jmx.mbeanserver.JmxMBeanServer@1eb90ed
[junit4] 2> 541445 WARN (SUITE-MBeansHandlerTest-seed#[BCAC31D56FD1F65B]-worker) [ ] o.a.s.m.r.SolrJmxReporter No serviceUrl or agentId was configured, using first MBeanServer.
[junit4] 2> 541445 INFO (SUITE-MBeansHandlerTest-seed#[BCAC31D56FD1F65B]-worker) [ ] o.a.s.m.r.SolrJmxReporter JMX monitoring enabled at server: com.sun.jmx.mbeanserver.JmxMBeanServer@1eb90ed
[junit4] 2> 541446 INFO (coreLoadExecutor-2478-thread-1) [ x:collection1] o.a.s.c.SolrResourceLoader [null] Added 2 libs to classloader, from paths: [/C:/Users/jenkins/workspace/Lucene-Solr-6.x-Windows/solr/core/src/test-files/solr/collection1/lib, /C:/Users/jenkins/workspace/Lucene-Solr-6.x-Windows/solr/core/src/test-files/solr/collection1/lib/classes]
[junit4] 2> 541523 INFO (coreLoadExecutor-2478-thread-1) [ x:collection1] o.a.s.c.SolrConfig Using Lucene MatchVersion: 6.5.0
[junit4] 2> 541544 INFO (coreLoadExecutor-2478-thread-1) [ x:collection1] o.a.s.s.IndexSchema [collection1] Schema name=test
[junit4] 2> 541628 WARN (coreLoadExecutor-2478-thread-1) [ x:collection1] o.a.s.s.IndexSchema [collection1] default search field in schema is text. WARNING: Deprecated, please use 'df' on request instead.
[junit4] 2> 541629 INFO (coreLoadExecutor-2478-thread-1) [ x:collection1] o.a.s.s.IndexSchema Loaded schema test/1.0 with uniqueid field id
[junit4] 2> 541648 INFO (coreLoadExecutor-2478-thread-1) [ x:collection1] o.a.s.c.CoreContainer Creating SolrCore 'collection1' using configuration from instancedir C:\Users\jenkins\workspace\Lucene-Solr-6.x-Windows\solr\core\src\test-files\solr\collection1
[junit4] 2> 541649 WARN (coreLoadExecutor-2478-thread-1) [ x:collection1] o.a.s.m.r.SolrJmxReporter No serviceUrl or agentId was configured, using first MBeanServer.
[junit4] 2> 541649 INFO (coreLoadExecutor-2478-thread-1) [ x:collection1] o.a.s.m.r.SolrJmxReporter JMX monitoring enabled at server: com.sun.jmx.mbeanserver.JmxMBeanServer@1eb90ed
[junit4] 2> 541649 INFO (coreLoadExecutor-2478-thread-1) [ x:collection1] o.a.s.c.SolrCore [[collection1] ] Opening new SolrCore at [C:\Users\jenkins\workspace\Lucene-Solr-6.x-Windows\solr\core\src\test-files\solr\collection1], dataDir=[C:\Users\jenkins\workspace\Lucene-Solr-6.x-Windows\solr\build\solr-core\test\J1\temp\solr.handler.admin.MBeansHandlerTest_BCAC31D56FD1F65B-001\init-core-data-001\]
[junit4] 2> 541649 INFO (coreLoadExecutor-2478-thread-1) [ x:collection1] o.a.s.c.JmxMonitoredMap JMX monitoring is enabled. Adding Solr mbeans to JMX Server: com.sun.jmx.mbeanserver.JmxMBeanServer@1eb90ed
[junit4] 2> 541654 INFO (coreLoadExecutor-2478-thread-1) [ x:collection1] o.a.s.u.RandomMergePolicy RandomMergePolicy wrapping class org.apache.lucene.index.TieredMergePolicy: [TieredMergePolicy: maxMergeAtOnce=46, maxMergeAtOnceExplicit=10, maxMergedSegmentMB=99.931640625, floorSegmentMB=0.814453125, forceMergeDeletesPctAllowed=19.10575590146173, segmentsPerTier=30.0, maxCFSSegmentSizeMB=8.796093022207999E12, noCFSRatio=0.0
[junit4] 2> 541802 INFO (coreLoadExecutor-2478-thread-1) [ x:collection1] o.a.s.u.UpdateHandler Using UpdateLog implementation: org.apache.solr.update.UpdateLog
[junit4] 2> 541802 INFO (coreLoadExecutor-2478-thread-1) [ x:collection1] o.a.s.u.UpdateLog Initializing UpdateLog: dataDir= defaultSyncLevel=FLUSH numRecordsToKeep=100 maxNumLogsToKeep=10 numVersionBuckets=65536
[junit4] 2> 541802 INFO (coreLoadExecutor-2478-thread-1) [ x:collection1] o.a.s.u.CommitTracker Hard AutoCommit: disabled
[junit4] 2> 541802 INFO (coreLoadExecutor-2478-thread-1) [ x:collection1] o.a.s.u.CommitTracker Soft AutoCommit: disabled
[junit4] 2> 541802 INFO (coreLoadExecutor-2478-thread-1) [ x:collection1] o.a.s.u.RandomMergePolicy RandomMergePolicy wrapping class org.apache.lucene.index.LogByteSizeMergePolicy: [LogByteSizeMergePolicy: minMergeSize=1677721, mergeFactor=18, maxMergeSize=2147483648, maxMergeSizeForForcedMerge=9223372036854775807, calibrateSizeByDeletes=false, maxMergeDocs=2147483647, maxCFSSegmentSizeMB=8.796093022207999E12, noCFSRatio=0.0]
[junit4] 2> 541807 INFO (coreLoadExecutor-2478-thread-1) [ x:collection1] o.a.s.s.SolrIndexSearcher Opening [Searcher@62a621[collection1] main]
[junit4] 2> 541808 INFO (coreLoadExecutor-2478-thread-1) [ x:collection1] o.a.s.h.c.SpellCheckComponent Initializing spell checkers
[junit4] 2> 541820 INFO (coreLoadExecutor-2478-thread-1) [ x:collection1] o.a.s.s.DirectSolrSpellChecker init: {name=direct,classname=DirectSolrSpellChecker,field=lowerfilt,minQueryLength=3}
[junit4] 2> 541861 INFO (coreLoadExecutor-2478-thread-1) [ x:collection1] o.a.s.h.ReplicationHandler Commits will be reserved for 10000
[junit4] 2> 541861 INFO (searcherExecutor-2479-thread-1-processing-x:collection1) [ x:collection1] o.a.s.h.c.SpellCheckComponent Loading spell index for spellchecker: default
[junit4] 2> 541862 INFO (searcherExecutor-2479-thread-1-processing-x:collection1) [ x:collection1] o.a.s.h.c.SpellCheckComponent Loading spell index for spellchecker: direct
[junit4] 2> 541862 INFO (searcherExecutor-2479-thread-1-processing-x:collection1) [ x:collection1] o.a.s.h.c.SpellCheckComponent Loading spell index for spellchecker: wordbreak
[junit4] 2> 541862 INFO (searcherExecutor-2479-thread-1-processing-x:collection1) [ x:collection1] o.a.s.h.c.SpellCheckComponent Loading spell index for spellchecker: multipleFields
[junit4] 2> 541862 INFO (searcherExecutor-2479-thread-1-processing-x:collection1) [ x:collection1] o.a.s.h.c.SpellCheckComponent Loading spell index for spellchecker: jarowinkler
[junit4] 2> 541863 INFO (coreLoadExecutor-2478-thread-1) [ x:collection1] o.a.s.u.UpdateLog Could not find max version in index or recent updates, using new clock 1558922475080777728
[junit4] 2> 541863 INFO (searcherExecutor-2479-thread-1-processing-x:collection1) [ x:collection1] o.a.s.h.c.SpellCheckComponent Loading spell index for spellchecker: external
[junit4] 2> 541863 INFO (searcherExecutor-2479-thread-1-processing-x:collection1) [ x:collection1] o.a.s.h.c.SpellCheckComponent Loading spell index for spellchecker: freq
[junit4] 2> 541864 INFO (searcherExecutor-2479-thread-1-processing-x:collection1) [ x:collection1] o.a.s.h.c.SpellCheckComponent Loading spell index for spellchecker: fqcn
[junit4] 2> 541865 INFO (searcherExecutor-2479-thread-1-processing-x:collection1) [ x:collection1] o.a.s.h.c.SpellCheckComponent Loading spell index for spellchecker: perDict
[junit4] 2> 541865 INFO (searcherExecutor-2479-thread-1-processing-x:collection1) [ x:collection1] o.a.s.c.SolrCore [collection1] Registered new searcher Searcher@62a621[collection1] main{ExitableDirectoryReader(UninvertingDirectoryReader())}
[junit4] 2> 541871 INFO (SUITE-MBeansHandlerTest-seed#[BCAC31D56FD1F65B]-worker) [ ] o.a.s.SolrTestCaseJ4 ####initCore end
[junit4] 2> 541873 INFO (TEST-MBeansHandlerTest.testXMLDiffWithExternalEntity-seed#[BCAC31D56FD1F65B]) [ ] o.a.s.SolrTestCaseJ4 ###Starting testXMLDiffWithExternalEntity
[junit4] 2> 542017 INFO (TEST-MBeansHandlerTest.testXMLDiffWithExternalEntity-seed#[BCAC31D56FD1F65B]) [ ] o.a.s.SolrTestCaseJ4 ###Ending testXMLDiffWithExternalEntity
[junit4] 2> 542020 INFO (TEST-MBeansHandlerTest.testBackCompatNames-seed#[BCAC31D56FD1F65B]) [ ] o.a.s.SolrTestCaseJ4 ###Starting testBackCompatNames
[junit4] 2> 542021 INFO (TEST-MBeansHandlerTest.testBackCompatNames-seed#[BCAC31D56FD1F65B]) [ ] o.a.s.c.S.Request [collection1] webapp=null path=null params={qt=/admin/mbeans&wt=xml} status=0 QTime=1
[junit4] 2> 542032 INFO (TEST-MBeansHandlerTest.testBackCompatNames-seed#[BCAC31D56FD1F65B]) [ ] o.a.s.c.S.Request [collection1] webapp=null path=null params={qt=/admin/mbeans&cat=QUERYHANDLER&wt=xml} status=0 QTime=0
[junit4] 2> 542034 INFO (TEST-MBeansHandlerTest.testBackCompatNames-seed#[BCAC31D56FD1F65B]) [ ] o.a.s.c.S.Request [collection1] webapp=null path=null params={qt=/admin/mbeans&cat=UPDATE&wt=xml} status=0 QTime=0
[junit4] 2> 542034 INFO (TEST-MBeansHandlerTest.testBackCompatNames-seed#[BCAC31D56FD1F65B]) [ ] o.a.s.SolrTestCaseJ4 ###Ending testBackCompatNames
[junit4] 2> 542036 INFO (TEST-MBeansHandlerTest.testDiff-seed#[BCAC31D56FD1F65B]) [ ] o.a.s.SolrTestCaseJ4 ###Starting testDiff
[junit4] 2> 542039 INFO (TEST-MBeansHandlerTest.testDiff-seed#[BCAC31D56FD1F65B]) [ ] o.a.s.c.S.Request [collection1] webapp=null path=null params={qt=/admin/mbeans&stats=true&wt=xml} status=0 QTime=2
[junit4] 2> 542056 INFO (TEST-MBeansHandlerTest.testDiff-seed#[BCAC31D56FD1F65B]) [ ] o.a.s.c.S.Request [collection1] webapp=null path=null params={qt=/admin/mbeans&stats=true&diff=true&wt=xml} status=0 QTime=15
[junit4] 2> 542059 INFO (TEST-MBeansHandlerTest.testDiff-seed#[BCAC31D56FD1F65B]) [ ] o.a.s.SolrTestCaseJ4 ###Ending testDiff
[junit4] 2> NOTE: reproduce with: ant test -Dtestcase=MBeansHandlerTest -Dtests.method=testDiff -Dtests.seed=BCAC31D56FD1F65B -Dtests.slow=true -Dtests.locale=ar-YE -Dtests.timezone=Asia/Dili -Dtests.asserts=true -Dtests.file.encoding=ISO-8859-1
[junit4] FAILURE 0.03s J1 | MBeansHandlerTest.testDiff <<<
[junit4] > Throwable #1: org.junit.ComparisonFailure: expected:<Was: [1, Now: 2], Delta: 1> but was:<Was: [4, Now: 5], Delta: 1>
[junit4] > at __randomizedtesting.SeedInfo.seed([BCAC31D56FD1F65B:79BAF54E7F67CE3B]:0)
[junit4] > at org.apache.solr.handler.admin.MBeansHandlerTest.testDiff(MBeansHandlerTest.java:63)
[junit4] > at java.lang.Thread.run(Thread.java:745)
[junit4] 2> 542067 INFO (SUITE-MBeansHandlerTest-seed#[BCAC31D56FD1F65B]-worker) [ ] o.a.s.SolrTestCaseJ4 ###deleteCore
[junit4] 2> 542067 INFO (SUITE-MBeansHandlerTest-seed#[BCAC31D56FD1F65B]-worker) [ ] o.a.s.c.CoreContainer Shutting down CoreContainer instance=31989791
[junit4] 2> 542069 INFO (coreCloseExecutor-2484-thread-1) [ x:collection1] o.a.s.c.SolrCore [collection1] CLOSING SolrCore org.apache.solr.core.SolrCore@7e60a2
[junit4] 2> 542098 INFO (coreCloseExecutor-2484-thread-1) [ x:collection1] o.a.s.m.SolrMetricManager Closing metric reporters for: solr.core.collection1
[junit4] 2> 542100 INFO (SUITE-MBeansHandlerTest-seed#[BCAC31D56FD1F65B]-worker) [ ] o.a.s.m.SolrMetricManager Closing metric reporters for: solr.node
[junit4] 2> NOTE: leaving temporary files on disk at: C:\Users\jenkins\workspace\Lucene-Solr-6.x-Windows\solr\build\solr-core\test\J1\temp\solr.handler.admin.MBeansHandlerTest_BCAC31D56FD1F65B-001
[junit4] 2> NOTE: test params are: codec=FastDecompressionCompressingStoredFields(storedFieldsFormat=CompressingStoredFieldsFormat(compressionMode=FAST_DECOMPRESSION, chunkSize=25696, maxDocsPerChunk=905, blockSize=961), termVectorsFormat=CompressingTermVectorsFormat(compressionMode=FAST_DECOMPRESSION, chunkSize=25696, blockSize=961)), sim=RandomSimilarity(queryNorm=true,coord=crazy): {}, locale=ar-YE, timezone=Asia/Dili
[junit4] 2> NOTE: Windows 10 10.0 x86/Oracle Corporation 1.8.0_121 (32-bit)/cpus=3,threads=1,free=110982024,total=305397760
[junit4] 2> NOTE: All tests run in this JVM: [TestObjectReleaseTracker, SortSpecParsingTest, DebugComponentTest, TestCodecSupport, TestSimpleTrackingShardHandler, TestCloudPseudoReturnFields, TestConfigSetsAPI, DistributedQueryComponentOptimizationTest, TestLocalFSCloudBackupRestore, TestCustomDocTransformer, CloudMLTQParserTest, DistributedFacetPivotSmallAdvancedTest, ExitableDirectoryReaderTest, ResourceLoaderTest, CircularListTest, MergeStrategyTest, TestNoOpRegenerator, RAMDirectoryFactoryTest, SolrSlf4jReporterTest, CollectionsAPIDistributedZkTest, TestMergePolicyConfig, TestSolrCloudWithSecureImpersonation, UtilsToolTest, TestManagedSchema, TestPerFieldSimilarityWithDefaultOverride, TestRecoveryHdfs, SliceStateTest, SpellPossibilityIteratorTest, TestAuthenticationFramework, TestCustomSort, StressHdfsTest, SubstringBytesRefFilterTest, DistributedIntervalFacetingTest, TestInfoStreamLogging, TestConfigOverlay, TriLevelCompositeIdRoutingTest, CoreSorterTest, TestExactSharedStatsCache, TestBlendedInfixSuggestions, TestManagedStopFilterFactory, TestSolrCoreParser, TestSQLHandlerNonCloud, TestFieldCacheSortRandom, RegexBoostProcessorTest, TestQuerySenderListener, AnalyticsQueryTest, ClassificationUpdateProcessorIntegrationTest, TestDynamicLoading, WordBreakSolrSpellCheckerTest, DocValuesMissingTest, TestLuceneMatchVersion, TestReplicationHandlerBackup, SolrGraphiteReporterTest, DistanceUnitsTest, SolrCmdDistributorTest, TestLeaderElectionZkExpiry, HdfsRecoverLeaseTest, ZkSolrClientTest, TestDynamicFieldCollectionResource, BJQParserTest, CollectionsAPIAsyncDistributedZkTest, TestStandardQParsers, ScriptEngineTest, TestFieldCacheSanityChecker, NoCacheHeaderTest, TestFiltering, PreAnalyzedUpdateProcessorTest, OverriddenZkACLAndCredentialsProvidersTest, TestNonDefinedSimilarityFactory, SharedFSAutoReplicaFailoverTest, SuggesterTest, TestIntervalFaceting, OpenCloseCoreStressTest, ZkStateReaderTest, CloneFieldUpdateProcessorFactoryTest, TestFieldCache, HdfsChaosMonkeyNothingIsSafeTest, TestRawResponseWriter, SuggesterWFSTTest, HdfsLockFactoryTest, TestJavabinTupleStreamParser, TestDocSet, TestNumericTerms32, TestDownShardTolerantSearch, TestClassicSimilarityFactory, PreAnalyzedFieldTest, TestSha256AuthenticationProvider, SpellCheckCollatorTest, TestShardHandlerFactory, TestConfigSetProperties, MBeansHandlerTest]
[junit4] Completed [169/691 (1!)] on J1 in 1.05s, 3 tests, 1 failure <<< FAILURES!
[...truncated 54844 lines...]
-ecj-javadoc-lint-src:
[mkdir] Created dir: C:\Users\jenkins\AppData\Local\Temp\ecj1914057057
[ecj-lint] Compiling 1033 source files to C:\Users\jenkins\AppData\Local\Temp\ecj1914057057
[ecj-lint] invalid Class-Path header in manifest of jar file: C:\Users\jenkins\workspace\Lucene-Solr-6.x-Windows\solr\core\lib\org.restlet-2.3.0.jar
[ecj-lint] invalid Class-Path header in manifest of jar file: C:\Users\jenkins\workspace\Lucene-Solr-6.x-Windows\solr\core\lib\org.restlet.ext.servlet-2.3.0.jar
[ecj-lint] ----------
[ecj-lint] 1. WARNING in C:\Users\jenkins\workspace\Lucene-Solr-6.x-Windows\solr\core\src\java\org\apache\solr\client\solrj\embedded\EmbeddedSolrServer.java (at line 203)
[ecj-lint] new JavaBinCodec(resolver) {
[ecj-lint]
[ecj-lint] @Override
[ecj-lint] public void writeSolrDocument(SolrDocument doc) {
[ecj-lint] callback.streamSolrDocument(doc);
[ecj-lint] //super.writeSolrDocument( doc, fields );
[ecj-lint] }
[ecj-lint]
[ecj-lint] @Override
[ecj-lint] public void writeSolrDocumentList(SolrDocumentList docs) throws IOException {
[ecj-lint] if (docs.size() > 0) {
[ecj-lint] SolrDocumentList tmp = new SolrDocumentList();
[ecj-lint] tmp.setMaxScore(docs.getMaxScore());
[ecj-lint] tmp.setNumFound(docs.getNumFound());
[ecj-lint] tmp.setStart(docs.getStart());
[ecj-lint] docs = tmp;
[ecj-lint] }
[ecj-lint] callback.streamDocListInfo(docs.getNumFound(), docs.getStart(), docs.getMaxScore());
[ecj-lint] super.writeSolrDocumentList(docs);
[ecj-lint] }
[ecj-lint]
[ecj-lint] }.setWritableDocFields(resolver). marshal(rsp.getValues(), out);
[ecj-lint] ^^^^^^^^^^^^^^^^^^^^^^^^^^^^^^^^^^^^^^^^^^^^^^^^^^^^^^^^^^^^^^^^^^^^^^^^^^^^^^^^^^^^^^^^^^^^^^^^^^^^^^^^^^^^^^^^^^^^^^^^^^^^^^^^^^^^^^^^^^^^^^^^^^^^^^^^^^^^^^^^^^^^^^^^^^^^^^^^^^^^^^^^^^^^^^^^^^^^^^^^^^^^^^^^^^^^^^^^^^^^^^^^^^^^^^^^^^^^^^^^^^^^^^^^^^^^^^^^^^^^^^^^^^^^^^^^^^^^^^^^^^^^^^^^^^^^^^^^^^^^^^^^^^^^^^^^^^^^^^^^^^^^^^^^^^^^^^^^^^^^^^^^^^^^^^^^^^^^^^^^^^^^^^^^^^^^^^^^^^^^^^^^^^^^^^^^^^^^^^^^^^^^^^^^^^^^^^^^^^^^^^^^^^^^^^^^^^^^^^^^^^^^^^^^^^^^^^^^^^^^^^^^^^^^^^^^^^^^^^^^^^^^^^^^^^^^^^^^^^^^^^^^^^^^^^^^^^^^^^^^^^^^^^^^^^^^^^^^^^^^^^^^^^^^^^^^^^^^^^^^^^^^^^^^^^^^^^^^^^^^^^^^^^^^^^^^^^^^^^^^^^^^^^^^^^^^^^^^^^^^^^^^^^^^^^^^^^^^^^^^^^^^^^^^^^^^^^^^^^^^^^^^^^^^^^^^^^^^^^^^^^^^^^^^^^^^^^^^^^^^^^^^^^^^^^^^^^^^^^^^^^^^^^^^^^^^^^^^^^^^^^^^^^^^^^^^^^^^^^^^^^^^^^^^^^^^^^^^^^^^^^^^^^^^^^^^^^^^^^^^^^^^^^^^^^^^^^^^
[ecj-lint] Resource leak: '<unassigned Closeable value>' is never closed
[ecj-lint] ----------
[ecj-lint] 2. WARNING in C:\Users\jenkins\workspace\Lucene-Solr-6.x-Windows\solr\core\src\java\org\apache\solr\client\solrj\embedded\EmbeddedSolrServer.java (at line 227)
[ecj-lint] return (NamedList<Object>) new JavaBinCodec(resolver).unmarshal(in);
[ecj-lint] ^^^^^^^^^^^^^^^^^^^^^^^^^^
[ecj-lint] Resource leak: '<unassigned Closeable value>' is never closed
[ecj-lint] ----------
[ecj-lint] ----------
[ecj-lint] 3. WARNING in C:\Users\jenkins\workspace\Lucene-Solr-6.x-Windows\solr\core\src\java\org\apache\solr\cloud\Assign.java (at line 101)
[ecj-lint] Collections.sort(shardIdNames, (o1, o2) -> {
[ecj-lint] ^^^^^^^^^^^
[ecj-lint] (Recovered) Internal inconsistency detected during lambda shape analysis
[ecj-lint] ----------
[ecj-lint] 4. WARNING in C:\Users\jenkins\workspace\Lucene-Solr-6.x-Windows\solr\core\src\java\org\apache\solr\cloud\Assign.java (at line 101)
[ecj-lint] Collections.sort(shardIdNames, (o1, o2) -> {
[ecj-lint] ^^^^^^^^^^^
[ecj-lint] (Recovered) Internal inconsistency detected during lambda shape analysis
[ecj-lint] ----------
[ecj-lint] 5. WARNING in C:\Users\jenkins\workspace\Lucene-Solr-6.x-Windows\solr\core\src\java\org\apache\solr\cloud\Assign.java (at line 101)
[ecj-lint] Collections.sort(shardIdNames, (o1, o2) -> {
[ecj-lint] ^^^^^^^^^^^
[ecj-lint] (Recovered) Internal inconsistency detected during lambda shape analysis
[ecj-lint] ----------
[ecj-lint] ----------
[ecj-lint] 6. WARNING in C:\Users\jenkins\workspace\Lucene-Solr-6.x-Windows\solr\core\src\java\org\apache\solr\cloud\rule\ReplicaAssigner.java (at line 212)
[ecj-lint] Collections.sort(sortedLiveNodes, (n1, n2) -> {
[ecj-lint] ^^^^^^^^^^^
[ecj-lint] (Recovered) Internal inconsistency detected during lambda shape analysis
[ecj-lint] ----------
[ecj-lint] 7. WARNING in C:\Users\jenkins\workspace\Lucene-Solr-6.x-Windows\solr\core\src\java\org\apache\solr\cloud\rule\ReplicaAssigner.java (at line 212)
[ecj-lint] Collections.sort(sortedLiveNodes, (n1, n2) -> {
[ecj-lint] ^^^^^^^^^^^
[ecj-lint] (Recovered) Internal inconsistency detected during lambda shape analysis
[ecj-lint] ----------
[ecj-lint] 8. WARNING in C:\Users\jenkins\workspace\Lucene-Solr-6.x-Windows\solr\core\src\java\org\apache\solr\cloud\rule\ReplicaAssigner.java (at line 212)
[ecj-lint] Collections.sort(sortedLiveNodes, (n1, n2) -> {
[ecj-lint] ^^^^^^^^^^^
[ecj-lint] (Recovered) Internal inconsistency detected during lambda shape analysis
[ecj-lint] ----------
[ecj-lint] ----------
[ecj-lint] 9. WARNING in C:\Users\jenkins\workspace\Lucene-Solr-6.x-Windows\solr\core\src\java\org\apache\solr\core\CoreContainer.java (at line 904)
[ecj-lint] core = new SolrCore(dcore, coreConfig);
[ecj-lint] ^^^^^^^^^^^^^^^^^^^^^^^^^^^^^^^^^^^^^^
[ecj-lint] Resource leak: 'core' is never closed
[ecj-lint] ----------
[ecj-lint] ----------
[ecj-lint] 10. WARNING in C:\Users\jenkins\workspace\Lucene-Solr-6.x-Windows\solr\core\src\java\org\apache\solr\core\HdfsDirectoryFactory.java (at line 230)
[ecj-lint] dir = new BlockDirectory(path, hdfsDir, cache, null, blockCacheReadEnabled, false, cacheMerges, cacheReadOnce);
[ecj-lint] ^^^^^^^^^^^^^^^^^^^^^^^^^^^^^^^^^^^^^^^^^^^^^^^^^^^^^^^^^^^^^^^^^^^^^^^^^^^^^^^^^^^^^^^^^^^^^^^^^^^^^^^^^^^^^^
[ecj-lint] Resource leak: 'dir' is never closed
[ecj-lint] ----------
[ecj-lint] ----------
[ecj-lint] 11. WARNING in C:\Users\jenkins\workspace\Lucene-Solr-6.x-Windows\solr\core\src\java\org\apache\solr\handler\AnalysisRequestHandlerBase.java (at line 120)
[ecj-lint] reader = cfiltfac.create(reader);
[ecj-lint] ^^^^^^^^^^^^^^^^^^^^^^^^^^^^^^^^
[ecj-lint] Resource leak: 'reader' is not closed at this location
[ecj-lint] ----------
[ecj-lint] 12. WARNING in C:\Users\jenkins\workspace\Lucene-Solr-6.x-Windows\solr\core\src\java\org\apache\solr\handler\AnalysisRequestHandlerBase.java (at line 144)
[ecj-lint] return namedList;
[ecj-lint] ^^^^^^^^^^^^^^^^^
[ecj-lint] Resource leak: 'listBasedTokenStream' is not closed at this location
[ecj-lint] ----------
[ecj-lint] ----------
[ecj-lint] 13. WARNING in C:\Users\jenkins\workspace\Lucene-Solr-6.x-Windows\solr\core\src\java\org\apache\solr\handler\ClassifyStream.java (at line 88)
[ecj-lint] SolrCore solrCore = (SolrCore) solrCoreObj;
[ecj-lint] ^^^^^^^^
[ecj-lint] Resource leak: 'solrCore' is never closed
[ecj-lint] ----------
[ecj-lint] ----------
[ecj-lint] 14. WARNING in C:\Users\jenkins\workspace\Lucene-Solr-6.x-Windows\solr\core\src\java\org\apache\solr\handler\ReplicationHandler.java (at line 1236)
[ecj-lint] DirectoryReader reader = s==null ? null : s.get().getIndexReader();
[ecj-lint] ^^^^^^
[ecj-lint] Resource leak: 'reader' is never closed
[ecj-lint] ----------
[ecj-lint] ----------
[ecj-lint] 15. WARNING in C:\Users\jenkins\workspace\Lucene-Solr-6.x-Windows\solr\core\src\java\org\apache\solr\handler\SQLHandler.java (at line 255)
[ecj-lint] ParallelStream parallelStream = new ParallelStream(workerZkHost, workerCollection, tupleStream, numWorkers, comp);
[ecj-lint] ^^^^^^^^^^^^^^
[ecj-lint] Resource leak: 'parallelStream' is never closed
[ecj-lint] ----------
[ecj-lint] 16. WARNING in C:\Users\jenkins\workspace\Lucene-Solr-6.x-Windows\solr\core\src\java\org\apache\solr\handler\SQLHandler.java (at line 394)
[ecj-lint] ParallelStream parallelStream = new ParallelStream(workerZkHost, workerCollection, tupleStream, numWorkers, comp);
[ecj-lint] ^^^^^^^^^^^^^^
[ecj-lint] Resource leak: 'parallelStream' is never closed
[ecj-lint] ----------
[ecj-lint] ----------
[ecj-lint] 17. WARNING in C:\Users\jenkins\workspace\Lucene-Solr-6.x-Windows\solr\core\src\java\org\apache\solr\handler\component\ExpandComponent.java (at line 222)
[ecj-lint] UninvertingReader uninvertingReader = new UninvertingReader(new ReaderWrapper(searcher.getSlowAtomicReader(), field), mapping);
[ecj-lint] ^^^^^^^^^^^^^^^^^
[ecj-lint] Resource leak: 'uninvertingReader' is never closed
[ecj-lint] ----------
[ecj-lint] ----------
[ecj-lint] 18. WARNING in C:\Users\jenkins\workspace\Lucene-Solr-6.x-Windows\solr\core\src\java\org\apache\solr\highlight\DefaultSolrHighlighter.java (at line 554)
[ecj-lint] tvWindowStream = new OffsetWindowTokenFilter(tvStream);
[ecj-lint] ^^^^^^^^^^^^^^^^^^^^^^^^^^^^^^^^^^^^^^^^^^^^^^^^^^^^^^
[ecj-lint] Resource leak: 'tvWindowStream' is never closed
[ecj-lint] ----------
[ecj-lint] ----------
[ecj-lint] 19. ERROR in C:\Users\jenkins\workspace\Lucene-Solr-6.x-Windows\solr\core\src\java\org\apache\solr\request\SimpleFacets.java (at line 26)
[ecj-lint] import java.util.LinkedList;
[ecj-lint] ^^^^^^^^^^^^^^^^^^^^
[ecj-lint] The import java.util.LinkedList is never used
[ecj-lint] ----------
[ecj-lint] 20. ERROR in C:\Users\jenkins\workspace\Lucene-Solr-6.x-Windows\solr\core\src\java\org\apache\solr\request\SimpleFacets.java (at line 41)
[ecj-lint] import org.apache.commons.lang.StringUtils;
[ecj-lint] ^^^^^^^^^^^^^^^^^^^^^^^^^^^^^^^^^^^
[ecj-lint] The import org.apache.commons.lang.StringUtils is never used
[ecj-lint] ----------
[ecj-lint] 21. WARNING in C:\Users\jenkins\workspace\Lucene-Solr-6.x-Windows\solr\core\src\java\org\apache\solr\request\SimpleFacets.java (at line 904)
[ecj-lint] fastForRandomSet = new HashDocSet(sset.getDocs(), 0, sset.size());
[ecj-lint] ^^^^^^^^^^^^^^^^^^^^^^^^^^^^^^^^^^^^^^^^^^^^^^^^^^^^^^^^^^^^^^^^^
[ecj-lint] Resource leak: 'fastForRandomSet' is never closed
[ecj-lint] ----------
[ecj-lint] ----------
[ecj-lint] 22. WARNING in C:\Users\jenkins\workspace\Lucene-Solr-6.x-Windows\solr\core\src\java\org\apache\solr\response\BinaryResponseWriter.java (at line 51)
[ecj-lint] new JavaBinCodec(resolver).setWritableDocFields(resolver).marshal(response.getValues(), out);
[ecj-lint] ^^^^^^^^^^^^^^^^^^^^^^^^^^
[ecj-lint] Resource leak: '<unassigned Closeable value>' is never closed
[ecj-lint] ----------
[ecj-lint] 23. WARNING in C:\Users\jenkins\workspace\Lucene-Solr-6.x-Windows\solr\core\src\java\org\apache\solr\response\BinaryResponseWriter.java (at line 163)
[ecj-lint] new JavaBinCodec(resolver).setWritableDocFields(resolver).marshal(rsp.getValues(), out);
[ecj-lint] ^^^^^^^^^^^^^^^^^^^^^^^^^^
[ecj-lint] Resource leak: '<unassigned Closeable value>' is never closed
[ecj-lint] ----------
[ecj-lint] 24. WARNING in C:\Users\jenkins\workspace\Lucene-Solr-6.x-Windows\solr\core\src\java\org\apache\solr\response\BinaryResponseWriter.java (at line 166)
[ecj-lint] return (NamedList<Object>) new JavaBinCodec(resolver).unmarshal(in);
[ecj-lint] ^^^^^^^^^^^^^^^^^^^^^^^^^^
[ecj-lint] Resource leak: '<unassigned Closeable value>' is never closed
[ecj-lint] ----------
[ecj-lint] ----------
[ecj-lint] 25. WARNING in C:\Users\jenkins\workspace\Lucene-Solr-6.x-Windows\solr\core\src\java\org\apache\solr\response\SmileResponseWriter.java (at line 33)
[ecj-lint] new SmileWriter(out, request, response).writeResponse();
[ecj-lint] ^^^^^^^^^^^^^^^^^^^^^^^^^^^^^^^^^^^^^^^
[ecj-lint] Resource leak: '<unassigned Closeable value>' is never closed
[ecj-lint] ----------
[ecj-lint] ----------
[ecj-lint] 26. WARNING in C:\Users\jenkins\workspace\Lucene-Solr-6.x-Windows\solr\core\src\java\org\apache\solr\schema\OpenExchangeRatesOrgProvider.java (at line 146)
[ecj-lint] ratesJsonStream = resourceLoader.openResource(ratesFileLocation);
[ecj-lint] ^^^^^^^^^^^^^^^^^^^^^^^^^^^^^^^^^^^^^^^^^^^^^^^^^^^^^^^^^^^^^^^^
[ecj-lint] Resource leak: 'ratesJsonStream' is not closed at this location
[ecj-lint] ----------
[ecj-lint] ----------
[ecj-lint] 27. WARNING in C:\Users\jenkins\workspace\Lucene-Solr-6.x-Windows\solr\core\src\java\org\apache\solr\search\CollapsingQParserPlugin.java (at line 1185)
[ecj-lint] UninvertingReader uninvertingReader = new UninvertingReader(new ReaderWrapper(searcher.getSlowAtomicReader(), collapseField), mapping);
[ecj-lint] ^^^^^^^^^^^^^^^^^
[ecj-lint] Resource leak: 'uninvertingReader' is never closed
[ecj-lint] ----------
[ecj-lint] ----------
[ecj-lint] 28. WARNING in C:\Users\jenkins\workspace\Lucene-Solr-6.x-Windows\solr\core\src\java\org\apache\solr\search\CursorMark.java (at line 188)
[ecj-lint] pieces = (List<Object>) new JavaBinCodec().unmarshal(in);
[ecj-lint] ^^^^^^^^^^^^^^^^^^
[ecj-lint] Resource leak: '<unassigned Closeable value>' is never closed
[ecj-lint] ----------
[ecj-lint] 29. WARNING in C:\Users\jenkins\workspace\Lucene-Solr-6.x-Windows\solr\core\src\java\org\apache\solr\search\CursorMark.java (at line 265)
[ecj-lint] new JavaBinCodec().marshal(marshalledValues, out);
[ecj-lint] ^^^^^^^^^^^^^^^^^^
[ecj-lint] Resource leak: '<unassigned Closeable value>' is never closed
[ecj-lint] ----------
[ecj-lint] ----------
[ecj-lint] 30. WARNING in C:\Users\jenkins\workspace\Lucene-Solr-6.x-Windows\solr\core\src\java\org\apache\solr\search\DocSlice.java (at line 145)
[ecj-lint] HashDocSet h = new HashDocSet(docs,offset,len);
[ecj-lint] ^
[ecj-lint] Resource leak: 'h' is never closed
[ecj-lint] ----------
[ecj-lint] 31. WARNING in C:\Users\jenkins\workspace\Lucene-Solr-6.x-Windows\solr\core\src\java\org\apache\solr\search\DocSlice.java (at line 154)
[ecj-lint] HashDocSet h = new HashDocSet(docs,offset,len);
[ecj-lint] ^
[ecj-lint] Resource leak: 'h' is never closed
[ecj-lint] ----------
[ecj-lint] 32. WARNING in C:\Users\jenkins\workspace\Lucene-Solr-6.x-Windows\solr\core\src\java\org\apache\solr\search\DocSlice.java (at line 163)
[ecj-lint] HashDocSet h = new HashDocSet(docs,offset,len);
[ecj-lint] ^
[ecj-lint] Resource leak: 'h' is never closed
[ecj-lint] ----------
[ecj-lint] ----------
[ecj-lint] 33. WARNING in C:\Users\jenkins\workspace\Lucene-Solr-6.x-Windows\solr\core\src\java\org\apache\solr\search\function\OrdFieldSource.java (at line 78)
[ecj-lint] SolrIndexSearcher is = (SolrIndexSearcher) o;
[ecj-lint] ^^
[ecj-lint] Resource leak: 'is' is never closed
[ecj-lint] ----------
[ecj-lint] ----------
[ecj-lint] 34. WARNING in C:\Users\jenkins\workspace\Lucene-Solr-6.x-Windows\solr\core\src\java\org\apache\solr\search\function\ReverseOrdFieldSource.java (at line 78)
[ecj-lint] SolrIndexSearcher is = (SolrIndexSearcher) o;
[ecj-lint] ^^
[ecj-lint] Resource leak: 'is' is never closed
[ecj-lint] ----------
[ecj-lint] ----------
[ecj-lint] 35. WARNING in C:\Users\jenkins\workspace\Lucene-Solr-6.x-Windows\solr\core\src\java\org\apache\solr\servlet\SolrDispatchFilter.java (at line 263)
[ecj-lint] throw new SolrException(ErrorCode.SERVER_ERROR, "Error occurred while loading solr.xml from zookeeper", e);
[ecj-lint] ^^^^^^^^^^^^^^^^^^^^^^^^^^^^^^^^^^^^^^^^^^^^^^^^^^^^^^^^^^^^^^^^^^^^^^^^^^^^^^^^^^^^^^^^^^^^^^^^^^^^^^^^^^^
[ecj-lint] Resource leak: 'loader' is not closed at this location
[ecj-lint] ----------
[ecj-lint] ----------
[ecj-lint] 36. WARNING in C:\Users\jenkins\workspace\Lucene-Solr-6.x-Windows\solr\core\src\java\org\apache\solr\update\CdcrTransactionLog.java (at line 98)
[ecj-lint] ChannelFastInputStream is = new ChannelFastInputStream(channel, pos);
[ecj-lint] ^^
[ecj-lint] Resource leak: 'is' is never closed
[ecj-lint] ----------
[ecj-lint] ----------
[ecj-lint] 37. WARNING in C:\Users\jenkins\workspace\Lucene-Solr-6.x-Windows\solr\core\src\java\org\apache\solr\update\HdfsTransactionLog.java (at line 188)
[ecj-lint] LogCodec codec = new LogCodec(resolver);
[ecj-lint] ^^^^^
[ecj-lint] Resource leak: 'codec' is never closed
[ecj-lint] ----------
[ecj-lint] 38. WARNING in C:\Users\jenkins\workspace\Lucene-Solr-6.x-Windows\solr\core\src\java\org\apache\solr\update\HdfsTransactionLog.java (at line 258)
[ecj-lint] LogCodec codec = new LogCodec(resolver);
[ecj-lint] ^^^^^
[ecj-lint] Resource leak: 'codec' is never closed
[ecj-lint] ----------
[ecj-lint] ----------
[ecj-lint] 39. WARNING in C:\Users\jenkins\workspace\Lucene-Solr-6.x-Windows\solr\core\src\java\org\apache\solr\update\TransactionLog.java (at line 226)
[ecj-lint] ChannelFastInputStream is = new ChannelFastInputStream(channel, pos);
[ecj-lint] ^^
[ecj-lint] Resource leak: 'is' is never closed
[ecj-lint] ----------
[ecj-lint] 40. WARNING in C:\Users\jenkins\workspace\Lucene-Solr-6.x-Windows\solr\core\src\java\org\apache\solr\update\TransactionLog.java (at line 226)
[ecj-lint] ChannelFastInputStream is = new ChannelFastInputStream(channel, pos);
[ecj-lint] ^^
[ecj-lint] Resource leak: 'is' is never closed
[ecj-lint] ----------
[ecj-lint] 41. WARNING in C:\Users\jenkins\workspace\Lucene-Solr-6.x-Windows\solr\core\src\java\org\apache\solr\update\TransactionLog.java (at line 258)
[ecj-lint] LogCodec codec = new LogCodec(resolver);
[ecj-lint] ^^^^^
[ecj-lint] Resource leak: 'codec' is never closed
[ecj-lint] ----------
[ecj-lint] 42. WARNING in C:\Users\jenkins\workspace\Lucene-Solr-6.x-Windows\solr\core\src\java\org\apache\solr\update\TransactionLog.java (at line 273)
[ecj-lint] LogCodec codec = new LogCodec(resolver);
[ecj-lint] ^^^^^
[ecj-lint] Resource leak: 'codec' is never closed
[ecj-lint] ----------
[ecj-lint] 43. WARNING in C:\Users\jenkins\workspace\Lucene-Solr-6.x-Windows\solr\core\src\java\org\apache\solr\update\TransactionLog.java (at line 492)
[ecj-lint] LogCodec codec = new LogCodec(resolver);
[ecj-lint] ^^^^^
[ecj-lint] Resource leak: 'codec' is never closed
[ecj-lint] ----------
[ecj-lint] ----------
[ecj-lint] 44. WARNING in C:\Users\jenkins\workspace\Lucene-Solr-6.x-Windows\solr\core\src\java\org\apache\solr\util\SimplePostTool.java (at line 655)
[ecj-lint] BAOS bos = new BAOS();
[ecj-lint] ^^^
[ecj-lint] Resource leak: 'bos' is never closed
[ecj-lint] ----------
[ecj-lint] 45. WARNING in C:\Users\jenkins\workspace\Lucene-Solr-6.x-Windows\solr\core\src\java\org\apache\solr\util\SimplePostTool.java (at line 655)
[ecj-lint] BAOS bos = new BAOS();
[ecj-lint] ^^^
[ecj-lint] Resource leak: 'bos' is never closed
[ecj-lint] ----------
[ecj-lint] ----------
[ecj-lint] 46. WARNING in C:\Users\jenkins\workspace\Lucene-Solr-6.x-Windows\solr\core\src\java\org\apache\solr\util\SolrLogLayout.java (at line 149)
[ecj-lint] SolrQueryRequest req = requestInfo == null ? null : requestInfo.getReq();
[ecj-lint] ^^^
[ecj-lint] Resource leak: 'req' is never closed
[ecj-lint] ----------
[ecj-lint] 46 problems (2 errors, 44 warnings)
BUILD FAILED
C:\Users\jenkins\workspace\Lucene-Solr-6.x-Windows\build.xml:775: The following error occurred while executing this line:
C:\Users\jenkins\workspace\Lucene-Solr-6.x-Windows\build.xml:101: The following error occurred while executing this line:
C:\Users\jenkins\workspace\Lucene-Solr-6.x-Windows\solr\build.xml:674: The following error occurred while executing this line:
C:\Users\jenkins\workspace\Lucene-Solr-6.x-Windows\lucene\common-build.xml:2001: The following error occurred while executing this line:
C:\Users\jenkins\workspace\Lucene-Solr-6.x-Windows\lucene\common-build.xml:2040: Compile failed; see the compiler error output for details.
Total time: 97 minutes 51 seconds
Build step 'Invoke Ant' marked build as failure
Archiving artifacts
[WARNINGS] Skipping publisher since build result is FAILURE
Recording test results
Email was triggered for: Failure - Any
Sending email for trigger: Failure - Any
[JENKINS] Lucene-Solr-6.x-Windows (32bit/jdk1.8.0_121) - Build #
718 - Failure!
Posted by Policeman Jenkins Server <je...@thetaphi.de>.
Build: https://jenkins.thetaphi.de/job/Lucene-Solr-6.x-Windows/718/
Java: 32bit/jdk1.8.0_121 -server -XX:+UseParallelGC
1 tests failed.
FAILED: org.apache.solr.handler.admin.MBeansHandlerTest.testDiff
Error Message:
expected:<Was: [1, Now: 2], Delta: 1> but was:<Was: [4, Now: 5], Delta: 1>
Stack Trace:
org.junit.ComparisonFailure: expected:<Was: [1, Now: 2], Delta: 1> but was:<Was: [4, Now: 5], Delta: 1>
at __randomizedtesting.SeedInfo.seed([7D3E9F50E0EB9A2C:B8285BCBF05DA24C]:0)
at org.junit.Assert.assertEquals(Assert.java:125)
at org.junit.Assert.assertEquals(Assert.java:147)
at org.apache.solr.handler.admin.MBeansHandlerTest.testDiff(MBeansHandlerTest.java:63)
at sun.reflect.NativeMethodAccessorImpl.invoke0(Native Method)
at sun.reflect.NativeMethodAccessorImpl.invoke(NativeMethodAccessorImpl.java:62)
at sun.reflect.DelegatingMethodAccessorImpl.invoke(DelegatingMethodAccessorImpl.java:43)
at java.lang.reflect.Method.invoke(Method.java:498)
at com.carrotsearch.randomizedtesting.RandomizedRunner.invoke(RandomizedRunner.java:1713)
at com.carrotsearch.randomizedtesting.RandomizedRunner$8.evaluate(RandomizedRunner.java:907)
at com.carrotsearch.randomizedtesting.RandomizedRunner$9.evaluate(RandomizedRunner.java:943)
at com.carrotsearch.randomizedtesting.RandomizedRunner$10.evaluate(RandomizedRunner.java:957)
at com.carrotsearch.randomizedtesting.rules.SystemPropertiesRestoreRule$1.evaluate(SystemPropertiesRestoreRule.java:57)
at org.apache.lucene.util.TestRuleSetupTeardownChained$1.evaluate(TestRuleSetupTeardownChained.java:49)
at org.apache.lucene.util.AbstractBeforeAfterRule$1.evaluate(AbstractBeforeAfterRule.java:45)
at org.apache.lucene.util.TestRuleThreadAndTestName$1.evaluate(TestRuleThreadAndTestName.java:48)
at org.apache.lucene.util.TestRuleIgnoreAfterMaxFailures$1.evaluate(TestRuleIgnoreAfterMaxFailures.java:64)
at org.apache.lucene.util.TestRuleMarkFailure$1.evaluate(TestRuleMarkFailure.java:47)
at com.carrotsearch.randomizedtesting.rules.StatementAdapter.evaluate(StatementAdapter.java:36)
at com.carrotsearch.randomizedtesting.ThreadLeakControl$StatementRunner.run(ThreadLeakControl.java:368)
at com.carrotsearch.randomizedtesting.ThreadLeakControl.forkTimeoutingTask(ThreadLeakControl.java:817)
at com.carrotsearch.randomizedtesting.ThreadLeakControl$3.evaluate(ThreadLeakControl.java:468)
at com.carrotsearch.randomizedtesting.RandomizedRunner.runSingleTest(RandomizedRunner.java:916)
at com.carrotsearch.randomizedtesting.RandomizedRunner$5.evaluate(RandomizedRunner.java:802)
at com.carrotsearch.randomizedtesting.RandomizedRunner$6.evaluate(RandomizedRunner.java:852)
at com.carrotsearch.randomizedtesting.RandomizedRunner$7.evaluate(RandomizedRunner.java:863)
at com.carrotsearch.randomizedtesting.rules.StatementAdapter.evaluate(StatementAdapter.java:36)
at com.carrotsearch.randomizedtesting.rules.SystemPropertiesRestoreRule$1.evaluate(SystemPropertiesRestoreRule.java:57)
at org.apache.lucene.util.AbstractBeforeAfterRule$1.evaluate(AbstractBeforeAfterRule.java:45)
at com.carrotsearch.randomizedtesting.rules.StatementAdapter.evaluate(StatementAdapter.java:36)
at org.apache.lucene.util.TestRuleStoreClassName$1.evaluate(TestRuleStoreClassName.java:41)
at com.carrotsearch.randomizedtesting.rules.NoShadowingOrOverridesOnMethodsRule$1.evaluate(NoShadowingOrOverridesOnMethodsRule.java:40)
at com.carrotsearch.randomizedtesting.rules.NoShadowingOrOverridesOnMethodsRule$1.evaluate(NoShadowingOrOverridesOnMethodsRule.java:40)
at com.carrotsearch.randomizedtesting.rules.StatementAdapter.evaluate(StatementAdapter.java:36)
at com.carrotsearch.randomizedtesting.rules.StatementAdapter.evaluate(StatementAdapter.java:36)
at com.carrotsearch.randomizedtesting.rules.StatementAdapter.evaluate(StatementAdapter.java:36)
at org.apache.lucene.util.TestRuleAssertionsRequired$1.evaluate(TestRuleAssertionsRequired.java:53)
at org.apache.lucene.util.TestRuleMarkFailure$1.evaluate(TestRuleMarkFailure.java:47)
at org.apache.lucene.util.TestRuleIgnoreAfterMaxFailures$1.evaluate(TestRuleIgnoreAfterMaxFailures.java:64)
at org.apache.lucene.util.TestRuleIgnoreTestSuites$1.evaluate(TestRuleIgnoreTestSuites.java:54)
at com.carrotsearch.randomizedtesting.rules.StatementAdapter.evaluate(StatementAdapter.java:36)
at com.carrotsearch.randomizedtesting.ThreadLeakControl$StatementRunner.run(ThreadLeakControl.java:368)
at java.lang.Thread.run(Thread.java:745)
Build Log:
[...truncated 12182 lines...]
[junit4] Suite: org.apache.solr.handler.admin.MBeansHandlerTest
[junit4] 2> Creating dataDir: C:\Users\jenkins\workspace\Lucene-Solr-6.x-Windows\solr\build\solr-core\test\J0\temp\solr.handler.admin.MBeansHandlerTest_7D3E9F50E0EB9A2C-001\init-core-data-001
[junit4] 2> 2005822 INFO (SUITE-MBeansHandlerTest-seed#[7D3E9F50E0EB9A2C]-worker) [ ] o.a.s.SolrTestCaseJ4 Randomized ssl (false) and clientAuth (false) via: @org.apache.solr.util.RandomizeSSL(reason=, value=NaN, ssl=NaN, clientAuth=NaN)
[junit4] 2> 2005823 INFO (SUITE-MBeansHandlerTest-seed#[7D3E9F50E0EB9A2C]-worker) [ ] o.a.s.SolrTestCaseJ4 ####initCore
[junit4] 2> 2005825 INFO (SUITE-MBeansHandlerTest-seed#[7D3E9F50E0EB9A2C]-worker) [ ] o.a.s.c.SolrResourceLoader [null] Added 2 libs to classloader, from paths: [/C:/Users/jenkins/workspace/Lucene-Solr-6.x-Windows/solr/core/src/test-files/solr/collection1/lib, /C:/Users/jenkins/workspace/Lucene-Solr-6.x-Windows/solr/core/src/test-files/solr/collection1/lib/classes]
[junit4] 2> 2005902 WARN (SUITE-MBeansHandlerTest-seed#[7D3E9F50E0EB9A2C]-worker) [ ] o.a.s.c.Config Beginning with Solr 5.5, <mergePolicy> is deprecated, use <mergePolicyFactory> instead.
[junit4] 2> 2005904 INFO (SUITE-MBeansHandlerTest-seed#[7D3E9F50E0EB9A2C]-worker) [ ] o.a.s.c.SolrConfig Using Lucene MatchVersion: 6.5.0
[junit4] 2> 2005935 INFO (SUITE-MBeansHandlerTest-seed#[7D3E9F50E0EB9A2C]-worker) [ ] o.a.s.s.IndexSchema [null] Schema name=test
[junit4] 2> 2006020 WARN (SUITE-MBeansHandlerTest-seed#[7D3E9F50E0EB9A2C]-worker) [ ] o.a.s.s.IndexSchema [null] default search field in schema is text. WARNING: Deprecated, please use 'df' on request instead.
[junit4] 2> 2006023 INFO (SUITE-MBeansHandlerTest-seed#[7D3E9F50E0EB9A2C]-worker) [ ] o.a.s.s.IndexSchema Loaded schema test/1.0 with uniqueid field id
[junit4] 2> 2006039 INFO (SUITE-MBeansHandlerTest-seed#[7D3E9F50E0EB9A2C]-worker) [ ] o.a.s.u.UpdateShardHandler Creating UpdateShardHandler HTTP client with params: socketTimeout=30000&connTimeout=30000&retry=true
[junit4] 2> 2006141 WARN (SUITE-MBeansHandlerTest-seed#[7D3E9F50E0EB9A2C]-worker) [ ] o.a.s.m.r.SolrJmxReporter No serviceUrl or agentId was configured, using first MBeanServer.
[junit4] 2> 2006143 INFO (SUITE-MBeansHandlerTest-seed#[7D3E9F50E0EB9A2C]-worker) [ ] o.a.s.m.r.SolrJmxReporter JMX monitoring enabled at server: com.sun.jmx.mbeanserver.JmxMBeanServer@1a66c5f
[junit4] 2> 2006143 WARN (SUITE-MBeansHandlerTest-seed#[7D3E9F50E0EB9A2C]-worker) [ ] o.a.s.m.r.SolrJmxReporter No serviceUrl or agentId was configured, using first MBeanServer.
[junit4] 2> 2006146 INFO (SUITE-MBeansHandlerTest-seed#[7D3E9F50E0EB9A2C]-worker) [ ] o.a.s.m.r.SolrJmxReporter JMX monitoring enabled at server: com.sun.jmx.mbeanserver.JmxMBeanServer@1a66c5f
[junit4] 2> 2006146 WARN (SUITE-MBeansHandlerTest-seed#[7D3E9F50E0EB9A2C]-worker) [ ] o.a.s.m.r.SolrJmxReporter No serviceUrl or agentId was configured, using first MBeanServer.
[junit4] 2> 2006147 INFO (SUITE-MBeansHandlerTest-seed#[7D3E9F50E0EB9A2C]-worker) [ ] o.a.s.m.r.SolrJmxReporter JMX monitoring enabled at server: com.sun.jmx.mbeanserver.JmxMBeanServer@1a66c5f
[junit4] 2> 2006149 INFO (coreLoadExecutor-7071-thread-1) [ x:collection1] o.a.s.c.SolrResourceLoader [null] Added 2 libs to classloader, from paths: [/C:/Users/jenkins/workspace/Lucene-Solr-6.x-Windows/solr/core/src/test-files/solr/collection1/lib, /C:/Users/jenkins/workspace/Lucene-Solr-6.x-Windows/solr/core/src/test-files/solr/collection1/lib/classes]
[junit4] 2> 2006232 WARN (coreLoadExecutor-7071-thread-1) [ x:collection1] o.a.s.c.Config Beginning with Solr 5.5, <mergePolicy> is deprecated, use <mergePolicyFactory> instead.
[junit4] 2> 2006235 INFO (coreLoadExecutor-7071-thread-1) [ x:collection1] o.a.s.c.SolrConfig Using Lucene MatchVersion: 6.5.0
[junit4] 2> 2006254 INFO (coreLoadExecutor-7071-thread-1) [ x:collection1] o.a.s.s.IndexSchema [collection1] Schema name=test
[junit4] 2> 2006323 WARN (coreLoadExecutor-7071-thread-1) [ x:collection1] o.a.s.s.IndexSchema [collection1] default search field in schema is text. WARNING: Deprecated, please use 'df' on request instead.
[junit4] 2> 2006324 INFO (coreLoadExecutor-7071-thread-1) [ x:collection1] o.a.s.s.IndexSchema Loaded schema test/1.0 with uniqueid field id
[junit4] 2> 2006340 INFO (coreLoadExecutor-7071-thread-1) [ x:collection1] o.a.s.c.CoreContainer Creating SolrCore 'collection1' using configuration from instancedir C:\Users\jenkins\workspace\Lucene-Solr-6.x-Windows\solr\core\src\test-files\solr\collection1
[junit4] 2> 2006341 WARN (coreLoadExecutor-7071-thread-1) [ x:collection1] o.a.s.m.r.SolrJmxReporter No serviceUrl or agentId was configured, using first MBeanServer.
[junit4] 2> 2006341 INFO (coreLoadExecutor-7071-thread-1) [ x:collection1] o.a.s.m.r.SolrJmxReporter JMX monitoring enabled at server: com.sun.jmx.mbeanserver.JmxMBeanServer@1a66c5f
[junit4] 2> 2006341 INFO (coreLoadExecutor-7071-thread-1) [ x:collection1] o.a.s.c.SolrCore [[collection1] ] Opening new SolrCore at [C:\Users\jenkins\workspace\Lucene-Solr-6.x-Windows\solr\core\src\test-files\solr\collection1], dataDir=[C:\Users\jenkins\workspace\Lucene-Solr-6.x-Windows\solr\build\solr-core\test\J0\temp\solr.handler.admin.MBeansHandlerTest_7D3E9F50E0EB9A2C-001\init-core-data-001\]
[junit4] 2> 2006341 INFO (coreLoadExecutor-7071-thread-1) [ x:collection1] o.a.s.c.JmxMonitoredMap JMX monitoring is enabled. Adding Solr mbeans to JMX Server: com.sun.jmx.mbeanserver.JmxMBeanServer@1a66c5f
[junit4] 2> 2006342 INFO (coreLoadExecutor-7071-thread-1) [ x:collection1] o.a.s.u.RandomMergePolicy RandomMergePolicy wrapping class org.apache.lucene.index.TieredMergePolicy: [TieredMergePolicy: maxMergeAtOnce=37, maxMergeAtOnceExplicit=48, maxMergedSegmentMB=42.849609375, floorSegmentMB=1.7041015625, forceMergeDeletesPctAllowed=9.833611480667857, segmentsPerTier=41.0, maxCFSSegmentSizeMB=8.796093022207999E12, noCFSRatio=0.3721953164340861
[junit4] 2> 2006525 INFO (coreLoadExecutor-7071-thread-1) [ x:collection1] o.a.s.u.UpdateHandler Using UpdateLog implementation: org.apache.solr.update.UpdateLog
[junit4] 2> 2006525 INFO (coreLoadExecutor-7071-thread-1) [ x:collection1] o.a.s.u.UpdateLog Initializing UpdateLog: dataDir= defaultSyncLevel=FLUSH numRecordsToKeep=100 maxNumLogsToKeep=10 numVersionBuckets=65536
[junit4] 2> 2006526 INFO (coreLoadExecutor-7071-thread-1) [ x:collection1] o.a.s.u.CommitTracker Hard AutoCommit: disabled
[junit4] 2> 2006526 INFO (coreLoadExecutor-7071-thread-1) [ x:collection1] o.a.s.u.CommitTracker Soft AutoCommit: disabled
[junit4] 2> 2006526 INFO (coreLoadExecutor-7071-thread-1) [ x:collection1] o.a.s.u.RandomMergePolicy RandomMergePolicy wrapping class org.apache.lucene.index.LogDocMergePolicy: [LogDocMergePolicy: minMergeSize=1000, mergeFactor=43, maxMergeSize=9223372036854775807, maxMergeSizeForForcedMerge=9223372036854775807, calibrateSizeByDeletes=true, maxMergeDocs=2147483647, maxCFSSegmentSizeMB=8.796093022207999E12, noCFSRatio=0.4774243285204248]
[junit4] 2> 2006527 INFO (coreLoadExecutor-7071-thread-1) [ x:collection1] o.a.s.s.SolrIndexSearcher Opening [Searcher@835346[collection1] main]
[junit4] 2> 2006527 INFO (coreLoadExecutor-7071-thread-1) [ x:collection1] o.a.s.h.c.SpellCheckComponent Initializing spell checkers
[junit4] 2> 2006537 INFO (coreLoadExecutor-7071-thread-1) [ x:collection1] o.a.s.s.DirectSolrSpellChecker init: {name=direct,classname=DirectSolrSpellChecker,field=lowerfilt,minQueryLength=3}
[junit4] 2> 2006599 INFO (coreLoadExecutor-7071-thread-1) [ x:collection1] o.a.s.h.ReplicationHandler Commits will be reserved for 10000
[junit4] 2> 2006599 INFO (searcherExecutor-7072-thread-1-processing-x:collection1) [ x:collection1] o.a.s.h.c.SpellCheckComponent Loading spell index for spellchecker: default
[junit4] 2> 2006600 INFO (searcherExecutor-7072-thread-1-processing-x:collection1) [ x:collection1] o.a.s.h.c.SpellCheckComponent Loading spell index for spellchecker: direct
[junit4] 2> 2006600 INFO (searcherExecutor-7072-thread-1-processing-x:collection1) [ x:collection1] o.a.s.h.c.SpellCheckComponent Loading spell index for spellchecker: wordbreak
[junit4] 2> 2006600 INFO (searcherExecutor-7072-thread-1-processing-x:collection1) [ x:collection1] o.a.s.h.c.SpellCheckComponent Loading spell index for spellchecker: multipleFields
[junit4] 2> 2006600 INFO (searcherExecutor-7072-thread-1-processing-x:collection1) [ x:collection1] o.a.s.h.c.SpellCheckComponent Loading spell index for spellchecker: jarowinkler
[junit4] 2> 2006601 INFO (searcherExecutor-7072-thread-1-processing-x:collection1) [ x:collection1] o.a.s.h.c.SpellCheckComponent Loading spell index for spellchecker: external
[junit4] 2> 2006601 INFO (searcherExecutor-7072-thread-1-processing-x:collection1) [ x:collection1] o.a.s.h.c.SpellCheckComponent Loading spell index for spellchecker: freq
[junit4] 2> 2006602 INFO (searcherExecutor-7072-thread-1-processing-x:collection1) [ x:collection1] o.a.s.h.c.SpellCheckComponent Loading spell index for spellchecker: fqcn
[junit4] 2> 2006602 INFO (searcherExecutor-7072-thread-1-processing-x:collection1) [ x:collection1] o.a.s.h.c.SpellCheckComponent Loading spell index for spellchecker: perDict
[junit4] 2> 2006603 INFO (searcherExecutor-7072-thread-1-processing-x:collection1) [ x:collection1] o.a.s.c.SolrCore [collection1] Registered new searcher Searcher@835346[collection1] main{ExitableDirectoryReader(UninvertingDirectoryReader())}
[junit4] 2> 2006604 INFO (coreLoadExecutor-7071-thread-1) [ x:collection1] o.a.s.u.UpdateLog Could not find max version in index or recent updates, using new clock 1558878730350231552
[junit4] 2> 2006611 INFO (SUITE-MBeansHandlerTest-seed#[7D3E9F50E0EB9A2C]-worker) [ ] o.a.s.SolrTestCaseJ4 ####initCore end
[junit4] 2> 2006614 INFO (TEST-MBeansHandlerTest.testXMLDiffWithExternalEntity-seed#[7D3E9F50E0EB9A2C]) [ ] o.a.s.SolrTestCaseJ4 ###Starting testXMLDiffWithExternalEntity
[junit4] 2> 2006617 INFO (TEST-MBeansHandlerTest.testXMLDiffWithExternalEntity-seed#[7D3E9F50E0EB9A2C]) [ ] o.a.s.SolrTestCaseJ4 ###Ending testXMLDiffWithExternalEntity
[junit4] 2> 2006618 INFO (TEST-MBeansHandlerTest.testBackCompatNames-seed#[7D3E9F50E0EB9A2C]) [ ] o.a.s.SolrTestCaseJ4 ###Starting testBackCompatNames
[junit4] 2> 2006624 INFO (TEST-MBeansHandlerTest.testBackCompatNames-seed#[7D3E9F50E0EB9A2C]) [ ] o.a.s.c.S.Request [collection1] webapp=null path=null params={qt=/admin/mbeans&wt=xml} status=0 QTime=5
[junit4] 2> 2006659 INFO (TEST-MBeansHandlerTest.testBackCompatNames-seed#[7D3E9F50E0EB9A2C]) [ ] o.a.s.c.S.Request [collection1] webapp=null path=null params={qt=/admin/mbeans&cat=QUERYHANDLER&wt=xml} status=0 QTime=0
[junit4] 2> 2006660 INFO (TEST-MBeansHandlerTest.testBackCompatNames-seed#[7D3E9F50E0EB9A2C]) [ ] o.a.s.c.S.Request [collection1] webapp=null path=null params={qt=/admin/mbeans&cat=UPDATE&wt=xml} status=0 QTime=0
[junit4] 2> 2006661 INFO (TEST-MBeansHandlerTest.testBackCompatNames-seed#[7D3E9F50E0EB9A2C]) [ ] o.a.s.SolrTestCaseJ4 ###Ending testBackCompatNames
[junit4] 2> 2006665 INFO (TEST-MBeansHandlerTest.testDiff-seed#[7D3E9F50E0EB9A2C]) [ ] o.a.s.SolrTestCaseJ4 ###Starting testDiff
[junit4] 2> 2006678 INFO (TEST-MBeansHandlerTest.testDiff-seed#[7D3E9F50E0EB9A2C]) [ ] o.a.s.c.S.Request [collection1] webapp=null path=null params={qt=/admin/mbeans&stats=true&wt=xml} status=0 QTime=12
[junit4] 2> 2006731 INFO (TEST-MBeansHandlerTest.testDiff-seed#[7D3E9F50E0EB9A2C]) [ ] o.a.s.c.S.Request [collection1] webapp=null path=null params={qt=/admin/mbeans&stats=true&diff=true&wt=xml} status=0 QTime=41
[junit4] 2> 2006733 INFO (TEST-MBeansHandlerTest.testDiff-seed#[7D3E9F50E0EB9A2C]) [ ] o.a.s.SolrTestCaseJ4 ###Ending testDiff
[junit4] 2> NOTE: reproduce with: ant test -Dtestcase=MBeansHandlerTest -Dtests.method=testDiff -Dtests.seed=7D3E9F50E0EB9A2C -Dtests.slow=true -Dtests.locale=es-PY -Dtests.timezone=AET -Dtests.asserts=true -Dtests.file.encoding=ISO-8859-1
[junit4] FAILURE 0.08s J0 | MBeansHandlerTest.testDiff <<<
[junit4] > Throwable #1: org.junit.ComparisonFailure: expected:<Was: [1, Now: 2], Delta: 1> but was:<Was: [4, Now: 5], Delta: 1>
[junit4] > at __randomizedtesting.SeedInfo.seed([7D3E9F50E0EB9A2C:B8285BCBF05DA24C]:0)
[junit4] > at org.apache.solr.handler.admin.MBeansHandlerTest.testDiff(MBeansHandlerTest.java:63)
[junit4] > at java.lang.Thread.run(Thread.java:745)
[junit4] 2> 2006740 INFO (SUITE-MBeansHandlerTest-seed#[7D3E9F50E0EB9A2C]-worker) [ ] o.a.s.SolrTestCaseJ4 ###deleteCore
[junit4] 2> 2006740 INFO (SUITE-MBeansHandlerTest-seed#[7D3E9F50E0EB9A2C]-worker) [ ] o.a.s.c.CoreContainer Shutting down CoreContainer instance=27265930
[junit4] 2> 2006741 INFO (coreCloseExecutor-7077-thread-1) [ x:collection1] o.a.s.c.SolrCore [collection1] CLOSING SolrCore org.apache.solr.core.SolrCore@604687
[junit4] 2> 2006763 INFO (coreCloseExecutor-7077-thread-1) [ x:collection1] o.a.s.m.SolrMetricManager Closing metric reporters for: solr.core.collection1
[junit4] 2> 2006766 INFO (SUITE-MBeansHandlerTest-seed#[7D3E9F50E0EB9A2C]-worker) [ ] o.a.s.m.SolrMetricManager Closing metric reporters for: solr.node
[junit4] 2> NOTE: leaving temporary files on disk at: C:\Users\jenkins\workspace\Lucene-Solr-6.x-Windows\solr\build\solr-core\test\J0\temp\solr.handler.admin.MBeansHandlerTest_7D3E9F50E0EB9A2C-001
[junit4] 2> NOTE: test params are: codec=Asserting(Lucene62): {}, docValues:{}, maxPointsInLeafNode=1368, maxMBSortInHeap=5.695685838921941, sim=RandomSimilarity(queryNorm=true,coord=no): {}, locale=es-PY, timezone=AET
[junit4] 2> NOTE: Windows 10 10.0 x86/Oracle Corporation 1.8.0_121 (32-bit)/cpus=3,threads=1,free=209966768,total=433061888
[junit4] 2> NOTE: All tests run in this JVM: [TestRemoteStreaming, TestAddFieldRealTimeGet, TestFieldSortValues, TestSolrQueryParserDefaultOperatorResource, TestHashPartitioner, TestBlobHandler, CursorMarkTest, TestSolrDeletionPolicy1, DistributedDebugComponentTest, SuggesterFSTTest, TestLFUCache, AddBlockUpdateTest, DocValuesMultiTest, LeaderFailureAfterFreshStartTest, RestartWhileUpdatingTest, ClassificationUpdateProcessorTest, TestConfigSetImmutable, JavabinLoaderTest, TestSolrIndexConfig, SimpleMLTQParserTest, CoreAdminCreateDiscoverTest, TestExtendedDismaxParser, TestStressVersions, CachingDirectoryFactoryTest, TestCloudDeleteByQuery, UUIDUpdateProcessorFallbackTest, VMParamsZkACLAndCredentialsProvidersTest, DisMaxRequestHandlerTest, TestSolrJ, TestHighFrequencyDictionaryFactory, TestGraphMLResponseWriter, TestNumericTerms64, TlogReplayBufferedWhileIndexingTest, TestElisionMultitermQuery, DocExpirationUpdateProcessorFactoryTest, TestUseDocValuesAsStored, TestCharFilters, OutputWriterTest, IndexBasedSpellCheckerTest, DirectUpdateHandlerTest, SpatialFilterTest, SSLMigrationTest, HdfsSyncSliceTest, AddSchemaFieldsUpdateProcessorFactoryTest, DistributedQueryElevationComponentTest, TestGraphTermsQParserPlugin, PreAnalyzedFieldManagedSchemaCloudTest, ResponseHeaderTest, FileUtilsTest, TestSubQueryTransformerCrossCore, TestPerFieldSimilarityClassic, TestDocBasedVersionConstraints, SolrGangliaReporterTest, RecoveryAfterSoftCommitTest, TestInitQParser, BasicDistributedZkTest, HLLUtilTest, TestUniqueKeyFieldResource, CurrencyFieldXmlFileTest, RequiredFieldsTest, JsonValidatorTest, TestSolrCoreSnapshots, TestNamedUpdateProcessors, TestLockTree, TestJsonFacetRefinement, TestSolr4Spatial2, TestImplicitCoreProperties, TestReloadDeadlock, SoftAutoCommitTest, TestSegmentSorting, TestHdfsBackupRestoreCore, DocValuesTest, TestReplicaProperties, TestPseudoReturnFields, TestDistribIDF, FastVectorHighlighterTest, QueryElevationComponentTest, TestBinaryResponseWriter, HighlighterTest, MetricsHandlerTest, TestRTGBase, TestSolrFieldCacheMBean, ZkCLITest, DocumentBuilderTest, PrimitiveFieldTypeTest, TestComponentsName, TestEmbeddedSolrServerConstructors, PolyFieldTest, SegmentsInfoRequestHandlerTest, DistribJoinFromCollectionTest, TestCollapseQParserPlugin, OverseerTest, TestExportWriter, TestUnifiedSolrHighlighter, TestBulkSchemaConcurrent, SolrRequestParserTest, BlockDirectoryTest, DistributedSuggestComponentTest, OutOfBoxZkACLAndCredentialsProvidersTest, TestMissingGroups, FullHLLTest, TestRandomDVFaceting, TermsComponentTest, TestDynamicFieldResource, TestSimpleQParserPlugin, TestSystemCollAutoCreate, StatelessScriptUpdateProcessorFactoryTest, TestSchemaResource, TestStressUserVersions, TestChildDocTransformer, TestHighlightDedupGrouping, TestCollationField, TestSolrCloudWithHadoopAuthPlugin, TestComplexPhraseQParserPlugin, CdcrReplicationHandlerTest, LeaderElectionContextKeyTest, BlobRepositoryCloudTest, DistributedFacetExistsSmallTest, ResponseLogComponentTest, DocumentAnalysisRequestHandlerTest, TestPhraseSuggestions, TestBM25SimilarityFactory, TestFaceting, TestLazyCores, TestXmlQParser, PeerSyncWithIndexFingerprintCachingTest, AliasIntegrationTest, CleanupOldIndexTest, SuggestComponentContextFilterQueryTest, SyncSliceTest, TestDistributedStatsComponentCardinality, TestXIncludeConfig, EnumFieldTest, WrapperMergePolicyFactoryTest, InfixSuggestersTest, TestIBSimilarityFactory, TestSchemaManager, MoreLikeThisHandlerTest, TestWordDelimiterFilterFactory, TestReqParamsAPI, SolrJmxReporterTest, TestSortByMinMaxFunction, SolrXmlInZkTest, TimeZoneUtilsTest, SolrCoreTest, TestReloadAndDeleteDocs, HardAutoCommitTest, ForceLeaderTest, RecoveryZkTest, StandardRequestHandlerTest, BlockJoinFacetDistribTest, HdfsBasicDistributedZkTest, TestPostingsSolrHighlighter, TestJsonRequest, ParsingFieldUpdateProcessorsTest, TestSort, CreateCollectionCleanupTest, TestConfigsApi, HdfsDirectoryTest, ShardRoutingTest, ReplaceNodeTest, TestSchemaVersionResource, DirectSolrConnectionTest, TestRTimerTree, MultiTermTest, OverseerTaskQueueTest, SolrTestCaseJ4Test, CollectionReloadTest, ChaosMonkeySafeLeaderTest, BasicDistributedZk2Test, UnloadDistributedZkTest, CollectionsAPIDistributedZkTest, LeaderElectionIntegrationTest, TestReplicationHandler, ClusterStateUpdateTest, LeaderElectionTest, TestDistributedSearch, TestCoreContainer, TestSolr4Spatial, TestGroupingSearch, SolrCmdDistributorTest, PeerSyncTest, ShowFileRequestHandlerTest, SimplePostToolTest, AnalysisAfterCoreReloadTest, SuggesterTest, TestCSVLoader, WordBreakSolrSpellCheckerTest, TestUpdate, FieldMutatingUpdateProcessorTest, TestAtomicUpdateErrorCases, XsltUpdateRequestHandlerTest, TestQueryUtils, DirectSolrSpellCheckerTest, XmlUpdateRequestHandlerTest, TestValueSourceCache, TermVectorComponentTest, TestSolrQueryParser, RegexBoostProcessorTest, TestJmxIntegration, JSONWriterTest, MBeansHandlerTest]
[junit4] Completed [412/691 (1!)] on J0 in 0.97s, 3 tests, 1 failure <<< FAILURES!
[...truncated 54057 lines...]
-ecj-javadoc-lint-src:
[mkdir] Created dir: C:\Users\jenkins\AppData\Local\Temp\ecj435021465
[ecj-lint] Compiling 1033 source files to C:\Users\jenkins\AppData\Local\Temp\ecj435021465
[ecj-lint] invalid Class-Path header in manifest of jar file: C:\Users\jenkins\workspace\Lucene-Solr-6.x-Windows\solr\core\lib\org.restlet-2.3.0.jar
[ecj-lint] invalid Class-Path header in manifest of jar file: C:\Users\jenkins\workspace\Lucene-Solr-6.x-Windows\solr\core\lib\org.restlet.ext.servlet-2.3.0.jar
[ecj-lint] ----------
[ecj-lint] 1. WARNING in C:\Users\jenkins\workspace\Lucene-Solr-6.x-Windows\solr\core\src\java\org\apache\solr\client\solrj\embedded\EmbeddedSolrServer.java (at line 203)
[ecj-lint] new JavaBinCodec(resolver) {
[ecj-lint]
[ecj-lint] @Override
[ecj-lint] public void writeSolrDocument(SolrDocument doc) {
[ecj-lint] callback.streamSolrDocument(doc);
[ecj-lint] //super.writeSolrDocument( doc, fields );
[ecj-lint] }
[ecj-lint]
[ecj-lint] @Override
[ecj-lint] public void writeSolrDocumentList(SolrDocumentList docs) throws IOException {
[ecj-lint] if (docs.size() > 0) {
[ecj-lint] SolrDocumentList tmp = new SolrDocumentList();
[ecj-lint] tmp.setMaxScore(docs.getMaxScore());
[ecj-lint] tmp.setNumFound(docs.getNumFound());
[ecj-lint] tmp.setStart(docs.getStart());
[ecj-lint] docs = tmp;
[ecj-lint] }
[ecj-lint] callback.streamDocListInfo(docs.getNumFound(), docs.getStart(), docs.getMaxScore());
[ecj-lint] super.writeSolrDocumentList(docs);
[ecj-lint] }
[ecj-lint]
[ecj-lint] }.setWritableDocFields(resolver). marshal(rsp.getValues(), out);
[ecj-lint] ^^^^^^^^^^^^^^^^^^^^^^^^^^^^^^^^^^^^^^^^^^^^^^^^^^^^^^^^^^^^^^^^^^^^^^^^^^^^^^^^^^^^^^^^^^^^^^^^^^^^^^^^^^^^^^^^^^^^^^^^^^^^^^^^^^^^^^^^^^^^^^^^^^^^^^^^^^^^^^^^^^^^^^^^^^^^^^^^^^^^^^^^^^^^^^^^^^^^^^^^^^^^^^^^^^^^^^^^^^^^^^^^^^^^^^^^^^^^^^^^^^^^^^^^^^^^^^^^^^^^^^^^^^^^^^^^^^^^^^^^^^^^^^^^^^^^^^^^^^^^^^^^^^^^^^^^^^^^^^^^^^^^^^^^^^^^^^^^^^^^^^^^^^^^^^^^^^^^^^^^^^^^^^^^^^^^^^^^^^^^^^^^^^^^^^^^^^^^^^^^^^^^^^^^^^^^^^^^^^^^^^^^^^^^^^^^^^^^^^^^^^^^^^^^^^^^^^^^^^^^^^^^^^^^^^^^^^^^^^^^^^^^^^^^^^^^^^^^^^^^^^^^^^^^^^^^^^^^^^^^^^^^^^^^^^^^^^^^^^^^^^^^^^^^^^^^^^^^^^^^^^^^^^^^^^^^^^^^^^^^^^^^^^^^^^^^^^^^^^^^^^^^^^^^^^^^^^^^^^^^^^^^^^^^^^^^^^^^^^^^^^^^^^^^^^^^^^^^^^^^^^^^^^^^^^^^^^^^^^^^^^^^^^^^^^^^^^^^^^^^^^^^^^^^^^^^^^^^^^^^^^^^^^^^^^^^^^^^^^^^^^^^^^^^^^^^^^^^^^^^^^^^^^^^^^^^^^^^^^^^^^^^^^^^^^^^^^^^^^^^^^^^^^^^^^^^^^^^
[ecj-lint] Resource leak: '<unassigned Closeable value>' is never closed
[ecj-lint] ----------
[ecj-lint] 2. WARNING in C:\Users\jenkins\workspace\Lucene-Solr-6.x-Windows\solr\core\src\java\org\apache\solr\client\solrj\embedded\EmbeddedSolrServer.java (at line 227)
[ecj-lint] return (NamedList<Object>) new JavaBinCodec(resolver).unmarshal(in);
[ecj-lint] ^^^^^^^^^^^^^^^^^^^^^^^^^^
[ecj-lint] Resource leak: '<unassigned Closeable value>' is never closed
[ecj-lint] ----------
[ecj-lint] ----------
[ecj-lint] 3. WARNING in C:\Users\jenkins\workspace\Lucene-Solr-6.x-Windows\solr\core\src\java\org\apache\solr\cloud\Assign.java (at line 101)
[ecj-lint] Collections.sort(shardIdNames, (o1, o2) -> {
[ecj-lint] ^^^^^^^^^^^
[ecj-lint] (Recovered) Internal inconsistency detected during lambda shape analysis
[ecj-lint] ----------
[ecj-lint] 4. WARNING in C:\Users\jenkins\workspace\Lucene-Solr-6.x-Windows\solr\core\src\java\org\apache\solr\cloud\Assign.java (at line 101)
[ecj-lint] Collections.sort(shardIdNames, (o1, o2) -> {
[ecj-lint] ^^^^^^^^^^^
[ecj-lint] (Recovered) Internal inconsistency detected during lambda shape analysis
[ecj-lint] ----------
[ecj-lint] 5. WARNING in C:\Users\jenkins\workspace\Lucene-Solr-6.x-Windows\solr\core\src\java\org\apache\solr\cloud\Assign.java (at line 101)
[ecj-lint] Collections.sort(shardIdNames, (o1, o2) -> {
[ecj-lint] ^^^^^^^^^^^
[ecj-lint] (Recovered) Internal inconsistency detected during lambda shape analysis
[ecj-lint] ----------
[ecj-lint] ----------
[ecj-lint] 6. WARNING in C:\Users\jenkins\workspace\Lucene-Solr-6.x-Windows\solr\core\src\java\org\apache\solr\cloud\rule\ReplicaAssigner.java (at line 212)
[ecj-lint] Collections.sort(sortedLiveNodes, (n1, n2) -> {
[ecj-lint] ^^^^^^^^^^^
[ecj-lint] (Recovered) Internal inconsistency detected during lambda shape analysis
[ecj-lint] ----------
[ecj-lint] 7. WARNING in C:\Users\jenkins\workspace\Lucene-Solr-6.x-Windows\solr\core\src\java\org\apache\solr\cloud\rule\ReplicaAssigner.java (at line 212)
[ecj-lint] Collections.sort(sortedLiveNodes, (n1, n2) -> {
[ecj-lint] ^^^^^^^^^^^
[ecj-lint] (Recovered) Internal inconsistency detected during lambda shape analysis
[ecj-lint] ----------
[ecj-lint] 8. WARNING in C:\Users\jenkins\workspace\Lucene-Solr-6.x-Windows\solr\core\src\java\org\apache\solr\cloud\rule\ReplicaAssigner.java (at line 212)
[ecj-lint] Collections.sort(sortedLiveNodes, (n1, n2) -> {
[ecj-lint] ^^^^^^^^^^^
[ecj-lint] (Recovered) Internal inconsistency detected during lambda shape analysis
[ecj-lint] ----------
[ecj-lint] ----------
[ecj-lint] 9. WARNING in C:\Users\jenkins\workspace\Lucene-Solr-6.x-Windows\solr\core\src\java\org\apache\solr\core\CoreContainer.java (at line 904)
[ecj-lint] core = new SolrCore(dcore, coreConfig);
[ecj-lint] ^^^^^^^^^^^^^^^^^^^^^^^^^^^^^^^^^^^^^^
[ecj-lint] Resource leak: 'core' is never closed
[ecj-lint] ----------
[ecj-lint] ----------
[ecj-lint] 10. WARNING in C:\Users\jenkins\workspace\Lucene-Solr-6.x-Windows\solr\core\src\java\org\apache\solr\core\HdfsDirectoryFactory.java (at line 230)
[ecj-lint] dir = new BlockDirectory(path, hdfsDir, cache, null, blockCacheReadEnabled, false, cacheMerges, cacheReadOnce);
[ecj-lint] ^^^^^^^^^^^^^^^^^^^^^^^^^^^^^^^^^^^^^^^^^^^^^^^^^^^^^^^^^^^^^^^^^^^^^^^^^^^^^^^^^^^^^^^^^^^^^^^^^^^^^^^^^^^^^^
[ecj-lint] Resource leak: 'dir' is never closed
[ecj-lint] ----------
[ecj-lint] ----------
[ecj-lint] 11. WARNING in C:\Users\jenkins\workspace\Lucene-Solr-6.x-Windows\solr\core\src\java\org\apache\solr\handler\AnalysisRequestHandlerBase.java (at line 120)
[ecj-lint] reader = cfiltfac.create(reader);
[ecj-lint] ^^^^^^^^^^^^^^^^^^^^^^^^^^^^^^^^
[ecj-lint] Resource leak: 'reader' is not closed at this location
[ecj-lint] ----------
[ecj-lint] 12. WARNING in C:\Users\jenkins\workspace\Lucene-Solr-6.x-Windows\solr\core\src\java\org\apache\solr\handler\AnalysisRequestHandlerBase.java (at line 144)
[ecj-lint] return namedList;
[ecj-lint] ^^^^^^^^^^^^^^^^^
[ecj-lint] Resource leak: 'listBasedTokenStream' is not closed at this location
[ecj-lint] ----------
[ecj-lint] ----------
[ecj-lint] 13. WARNING in C:\Users\jenkins\workspace\Lucene-Solr-6.x-Windows\solr\core\src\java\org\apache\solr\handler\ClassifyStream.java (at line 88)
[ecj-lint] SolrCore solrCore = (SolrCore) solrCoreObj;
[ecj-lint] ^^^^^^^^
[ecj-lint] Resource leak: 'solrCore' is never closed
[ecj-lint] ----------
[ecj-lint] ----------
[ecj-lint] 14. WARNING in C:\Users\jenkins\workspace\Lucene-Solr-6.x-Windows\solr\core\src\java\org\apache\solr\handler\ReplicationHandler.java (at line 1236)
[ecj-lint] DirectoryReader reader = s==null ? null : s.get().getIndexReader();
[ecj-lint] ^^^^^^
[ecj-lint] Resource leak: 'reader' is never closed
[ecj-lint] ----------
[ecj-lint] ----------
[ecj-lint] 15. WARNING in C:\Users\jenkins\workspace\Lucene-Solr-6.x-Windows\solr\core\src\java\org\apache\solr\handler\SQLHandler.java (at line 255)
[ecj-lint] ParallelStream parallelStream = new ParallelStream(workerZkHost, workerCollection, tupleStream, numWorkers, comp);
[ecj-lint] ^^^^^^^^^^^^^^
[ecj-lint] Resource leak: 'parallelStream' is never closed
[ecj-lint] ----------
[ecj-lint] 16. WARNING in C:\Users\jenkins\workspace\Lucene-Solr-6.x-Windows\solr\core\src\java\org\apache\solr\handler\SQLHandler.java (at line 394)
[ecj-lint] ParallelStream parallelStream = new ParallelStream(workerZkHost, workerCollection, tupleStream, numWorkers, comp);
[ecj-lint] ^^^^^^^^^^^^^^
[ecj-lint] Resource leak: 'parallelStream' is never closed
[ecj-lint] ----------
[ecj-lint] ----------
[ecj-lint] 17. WARNING in C:\Users\jenkins\workspace\Lucene-Solr-6.x-Windows\solr\core\src\java\org\apache\solr\handler\component\ExpandComponent.java (at line 222)
[ecj-lint] UninvertingReader uninvertingReader = new UninvertingReader(new ReaderWrapper(searcher.getSlowAtomicReader(), field), mapping);
[ecj-lint] ^^^^^^^^^^^^^^^^^
[ecj-lint] Resource leak: 'uninvertingReader' is never closed
[ecj-lint] ----------
[ecj-lint] ----------
[ecj-lint] 18. WARNING in C:\Users\jenkins\workspace\Lucene-Solr-6.x-Windows\solr\core\src\java\org\apache\solr\highlight\DefaultSolrHighlighter.java (at line 554)
[ecj-lint] tvWindowStream = new OffsetWindowTokenFilter(tvStream);
[ecj-lint] ^^^^^^^^^^^^^^^^^^^^^^^^^^^^^^^^^^^^^^^^^^^^^^^^^^^^^^
[ecj-lint] Resource leak: 'tvWindowStream' is never closed
[ecj-lint] ----------
[ecj-lint] ----------
[ecj-lint] 19. ERROR in C:\Users\jenkins\workspace\Lucene-Solr-6.x-Windows\solr\core\src\java\org\apache\solr\request\SimpleFacets.java (at line 26)
[ecj-lint] import java.util.LinkedList;
[ecj-lint] ^^^^^^^^^^^^^^^^^^^^
[ecj-lint] The import java.util.LinkedList is never used
[ecj-lint] ----------
[ecj-lint] 20. ERROR in C:\Users\jenkins\workspace\Lucene-Solr-6.x-Windows\solr\core\src\java\org\apache\solr\request\SimpleFacets.java (at line 41)
[ecj-lint] import org.apache.commons.lang.StringUtils;
[ecj-lint] ^^^^^^^^^^^^^^^^^^^^^^^^^^^^^^^^^^^
[ecj-lint] The import org.apache.commons.lang.StringUtils is never used
[ecj-lint] ----------
[ecj-lint] 21. WARNING in C:\Users\jenkins\workspace\Lucene-Solr-6.x-Windows\solr\core\src\java\org\apache\solr\request\SimpleFacets.java (at line 904)
[ecj-lint] fastForRandomSet = new HashDocSet(sset.getDocs(), 0, sset.size());
[ecj-lint] ^^^^^^^^^^^^^^^^^^^^^^^^^^^^^^^^^^^^^^^^^^^^^^^^^^^^^^^^^^^^^^^^^
[ecj-lint] Resource leak: 'fastForRandomSet' is never closed
[ecj-lint] ----------
[ecj-lint] ----------
[ecj-lint] 22. WARNING in C:\Users\jenkins\workspace\Lucene-Solr-6.x-Windows\solr\core\src\java\org\apache\solr\response\BinaryResponseWriter.java (at line 51)
[ecj-lint] new JavaBinCodec(resolver).setWritableDocFields(resolver).marshal(response.getValues(), out);
[ecj-lint] ^^^^^^^^^^^^^^^^^^^^^^^^^^
[ecj-lint] Resource leak: '<unassigned Closeable value>' is never closed
[ecj-lint] ----------
[ecj-lint] 23. WARNING in C:\Users\jenkins\workspace\Lucene-Solr-6.x-Windows\solr\core\src\java\org\apache\solr\response\BinaryResponseWriter.java (at line 163)
[ecj-lint] new JavaBinCodec(resolver).setWritableDocFields(resolver).marshal(rsp.getValues(), out);
[ecj-lint] ^^^^^^^^^^^^^^^^^^^^^^^^^^
[ecj-lint] Resource leak: '<unassigned Closeable value>' is never closed
[ecj-lint] ----------
[ecj-lint] 24. WARNING in C:\Users\jenkins\workspace\Lucene-Solr-6.x-Windows\solr\core\src\java\org\apache\solr\response\BinaryResponseWriter.java (at line 166)
[ecj-lint] return (NamedList<Object>) new JavaBinCodec(resolver).unmarshal(in);
[ecj-lint] ^^^^^^^^^^^^^^^^^^^^^^^^^^
[ecj-lint] Resource leak: '<unassigned Closeable value>' is never closed
[ecj-lint] ----------
[ecj-lint] ----------
[ecj-lint] 25. WARNING in C:\Users\jenkins\workspace\Lucene-Solr-6.x-Windows\solr\core\src\java\org\apache\solr\response\SmileResponseWriter.java (at line 33)
[ecj-lint] new SmileWriter(out, request, response).writeResponse();
[ecj-lint] ^^^^^^^^^^^^^^^^^^^^^^^^^^^^^^^^^^^^^^^
[ecj-lint] Resource leak: '<unassigned Closeable value>' is never closed
[ecj-lint] ----------
[ecj-lint] ----------
[ecj-lint] 26. WARNING in C:\Users\jenkins\workspace\Lucene-Solr-6.x-Windows\solr\core\src\java\org\apache\solr\schema\OpenExchangeRatesOrgProvider.java (at line 146)
[ecj-lint] ratesJsonStream = resourceLoader.openResource(ratesFileLocation);
[ecj-lint] ^^^^^^^^^^^^^^^^^^^^^^^^^^^^^^^^^^^^^^^^^^^^^^^^^^^^^^^^^^^^^^^^
[ecj-lint] Resource leak: 'ratesJsonStream' is not closed at this location
[ecj-lint] ----------
[ecj-lint] ----------
[ecj-lint] 27. WARNING in C:\Users\jenkins\workspace\Lucene-Solr-6.x-Windows\solr\core\src\java\org\apache\solr\search\CollapsingQParserPlugin.java (at line 1185)
[ecj-lint] UninvertingReader uninvertingReader = new UninvertingReader(new ReaderWrapper(searcher.getSlowAtomicReader(), collapseField), mapping);
[ecj-lint] ^^^^^^^^^^^^^^^^^
[ecj-lint] Resource leak: 'uninvertingReader' is never closed
[ecj-lint] ----------
[ecj-lint] ----------
[ecj-lint] 28. WARNING in C:\Users\jenkins\workspace\Lucene-Solr-6.x-Windows\solr\core\src\java\org\apache\solr\search\CursorMark.java (at line 188)
[ecj-lint] pieces = (List<Object>) new JavaBinCodec().unmarshal(in);
[ecj-lint] ^^^^^^^^^^^^^^^^^^
[ecj-lint] Resource leak: '<unassigned Closeable value>' is never closed
[ecj-lint] ----------
[ecj-lint] 29. WARNING in C:\Users\jenkins\workspace\Lucene-Solr-6.x-Windows\solr\core\src\java\org\apache\solr\search\CursorMark.java (at line 265)
[ecj-lint] new JavaBinCodec().marshal(marshalledValues, out);
[ecj-lint] ^^^^^^^^^^^^^^^^^^
[ecj-lint] Resource leak: '<unassigned Closeable value>' is never closed
[ecj-lint] ----------
[ecj-lint] ----------
[ecj-lint] 30. WARNING in C:\Users\jenkins\workspace\Lucene-Solr-6.x-Windows\solr\core\src\java\org\apache\solr\search\DocSlice.java (at line 145)
[ecj-lint] HashDocSet h = new HashDocSet(docs,offset,len);
[ecj-lint] ^
[ecj-lint] Resource leak: 'h' is never closed
[ecj-lint] ----------
[ecj-lint] 31. WARNING in C:\Users\jenkins\workspace\Lucene-Solr-6.x-Windows\solr\core\src\java\org\apache\solr\search\DocSlice.java (at line 154)
[ecj-lint] HashDocSet h = new HashDocSet(docs,offset,len);
[ecj-lint] ^
[ecj-lint] Resource leak: 'h' is never closed
[ecj-lint] ----------
[ecj-lint] 32. WARNING in C:\Users\jenkins\workspace\Lucene-Solr-6.x-Windows\solr\core\src\java\org\apache\solr\search\DocSlice.java (at line 163)
[ecj-lint] HashDocSet h = new HashDocSet(docs,offset,len);
[ecj-lint] ^
[ecj-lint] Resource leak: 'h' is never closed
[ecj-lint] ----------
[ecj-lint] ----------
[ecj-lint] 33. WARNING in C:\Users\jenkins\workspace\Lucene-Solr-6.x-Windows\solr\core\src\java\org\apache\solr\search\function\OrdFieldSource.java (at line 78)
[ecj-lint] SolrIndexSearcher is = (SolrIndexSearcher) o;
[ecj-lint] ^^
[ecj-lint] Resource leak: 'is' is never closed
[ecj-lint] ----------
[ecj-lint] ----------
[ecj-lint] 34. WARNING in C:\Users\jenkins\workspace\Lucene-Solr-6.x-Windows\solr\core\src\java\org\apache\solr\search\function\ReverseOrdFieldSource.java (at line 78)
[ecj-lint] SolrIndexSearcher is = (SolrIndexSearcher) o;
[ecj-lint] ^^
[ecj-lint] Resource leak: 'is' is never closed
[ecj-lint] ----------
[ecj-lint] ----------
[ecj-lint] 35. WARNING in C:\Users\jenkins\workspace\Lucene-Solr-6.x-Windows\solr\core\src\java\org\apache\solr\servlet\SolrDispatchFilter.java (at line 263)
[ecj-lint] throw new SolrException(ErrorCode.SERVER_ERROR, "Error occurred while loading solr.xml from zookeeper", e);
[ecj-lint] ^^^^^^^^^^^^^^^^^^^^^^^^^^^^^^^^^^^^^^^^^^^^^^^^^^^^^^^^^^^^^^^^^^^^^^^^^^^^^^^^^^^^^^^^^^^^^^^^^^^^^^^^^^^
[ecj-lint] Resource leak: 'loader' is not closed at this location
[ecj-lint] ----------
[ecj-lint] ----------
[ecj-lint] 36. WARNING in C:\Users\jenkins\workspace\Lucene-Solr-6.x-Windows\solr\core\src\java\org\apache\solr\update\CdcrTransactionLog.java (at line 98)
[ecj-lint] ChannelFastInputStream is = new ChannelFastInputStream(channel, pos);
[ecj-lint] ^^
[ecj-lint] Resource leak: 'is' is never closed
[ecj-lint] ----------
[ecj-lint] ----------
[ecj-lint] 37. WARNING in C:\Users\jenkins\workspace\Lucene-Solr-6.x-Windows\solr\core\src\java\org\apache\solr\update\HdfsTransactionLog.java (at line 188)
[ecj-lint] LogCodec codec = new LogCodec(resolver);
[ecj-lint] ^^^^^
[ecj-lint] Resource leak: 'codec' is never closed
[ecj-lint] ----------
[ecj-lint] 38. WARNING in C:\Users\jenkins\workspace\Lucene-Solr-6.x-Windows\solr\core\src\java\org\apache\solr\update\HdfsTransactionLog.java (at line 258)
[ecj-lint] LogCodec codec = new LogCodec(resolver);
[ecj-lint] ^^^^^
[ecj-lint] Resource leak: 'codec' is never closed
[ecj-lint] ----------
[ecj-lint] ----------
[ecj-lint] 39. WARNING in C:\Users\jenkins\workspace\Lucene-Solr-6.x-Windows\solr\core\src\java\org\apache\solr\update\TransactionLog.java (at line 226)
[ecj-lint] ChannelFastInputStream is = new ChannelFastInputStream(channel, pos);
[ecj-lint] ^^
[ecj-lint] Resource leak: 'is' is never closed
[ecj-lint] ----------
[ecj-lint] 40. WARNING in C:\Users\jenkins\workspace\Lucene-Solr-6.x-Windows\solr\core\src\java\org\apache\solr\update\TransactionLog.java (at line 226)
[ecj-lint] ChannelFastInputStream is = new ChannelFastInputStream(channel, pos);
[ecj-lint] ^^
[ecj-lint] Resource leak: 'is' is never closed
[ecj-lint] ----------
[ecj-lint] 41. WARNING in C:\Users\jenkins\workspace\Lucene-Solr-6.x-Windows\solr\core\src\java\org\apache\solr\update\TransactionLog.java (at line 258)
[ecj-lint] LogCodec codec = new LogCodec(resolver);
[ecj-lint] ^^^^^
[ecj-lint] Resource leak: 'codec' is never closed
[ecj-lint] ----------
[ecj-lint] 42. WARNING in C:\Users\jenkins\workspace\Lucene-Solr-6.x-Windows\solr\core\src\java\org\apache\solr\update\TransactionLog.java (at line 273)
[ecj-lint] LogCodec codec = new LogCodec(resolver);
[ecj-lint] ^^^^^
[ecj-lint] Resource leak: 'codec' is never closed
[ecj-lint] ----------
[ecj-lint] 43. WARNING in C:\Users\jenkins\workspace\Lucene-Solr-6.x-Windows\solr\core\src\java\org\apache\solr\update\TransactionLog.java (at line 492)
[ecj-lint] LogCodec codec = new LogCodec(resolver);
[ecj-lint] ^^^^^
[ecj-lint] Resource leak: 'codec' is never closed
[ecj-lint] ----------
[ecj-lint] ----------
[ecj-lint] 44. WARNING in C:\Users\jenkins\workspace\Lucene-Solr-6.x-Windows\solr\core\src\java\org\apache\solr\util\SimplePostTool.java (at line 655)
[ecj-lint] BAOS bos = new BAOS();
[ecj-lint] ^^^
[ecj-lint] Resource leak: 'bos' is never closed
[ecj-lint] ----------
[ecj-lint] 45. WARNING in C:\Users\jenkins\workspace\Lucene-Solr-6.x-Windows\solr\core\src\java\org\apache\solr\util\SimplePostTool.java (at line 655)
[ecj-lint] BAOS bos = new BAOS();
[ecj-lint] ^^^
[ecj-lint] Resource leak: 'bos' is never closed
[ecj-lint] ----------
[ecj-lint] ----------
[ecj-lint] 46. WARNING in C:\Users\jenkins\workspace\Lucene-Solr-6.x-Windows\solr\core\src\java\org\apache\solr\util\SolrLogLayout.java (at line 149)
[ecj-lint] SolrQueryRequest req = requestInfo == null ? null : requestInfo.getReq();
[ecj-lint] ^^^
[ecj-lint] Resource leak: 'req' is never closed
[ecj-lint] ----------
[ecj-lint] 46 problems (2 errors, 44 warnings)
BUILD FAILED
C:\Users\jenkins\workspace\Lucene-Solr-6.x-Windows\build.xml:775: The following error occurred while executing this line:
C:\Users\jenkins\workspace\Lucene-Solr-6.x-Windows\build.xml:101: The following error occurred while executing this line:
C:\Users\jenkins\workspace\Lucene-Solr-6.x-Windows\solr\build.xml:674: The following error occurred while executing this line:
C:\Users\jenkins\workspace\Lucene-Solr-6.x-Windows\lucene\common-build.xml:2001: The following error occurred while executing this line:
C:\Users\jenkins\workspace\Lucene-Solr-6.x-Windows\lucene\common-build.xml:2040: Compile failed; see the compiler error output for details.
Total time: 99 minutes 45 seconds
Build step 'Invoke Ant' marked build as failure
Archiving artifacts
[WARNINGS] Skipping publisher since build result is FAILURE
Recording test results
Email was triggered for: Failure - Any
Sending email for trigger: Failure - Any
[JENKINS] Lucene-Solr-6.x-Windows (64bit/jdk1.8.0_121) - Build #
717 - Still Unstable!
Posted by Policeman Jenkins Server <je...@thetaphi.de>.
Build: https://jenkins.thetaphi.de/job/Lucene-Solr-6.x-Windows/717/
Java: 64bit/jdk1.8.0_121 -XX:+UseCompressedOops -XX:+UseParallelGC
1 tests failed.
FAILED: org.apache.solr.handler.admin.MBeansHandlerTest.testDiff
Error Message:
expected:<Was: [1, Now: 2], Delta: 1> but was:<Was: [4, Now: 5], Delta: 1>
Stack Trace:
org.junit.ComparisonFailure: expected:<Was: [1, Now: 2], Delta: 1> but was:<Was: [4, Now: 5], Delta: 1>
at __randomizedtesting.SeedInfo.seed([EE1D4CF11451C5A4:2B0B886A04E7FDC4]:0)
at org.junit.Assert.assertEquals(Assert.java:125)
at org.junit.Assert.assertEquals(Assert.java:147)
at org.apache.solr.handler.admin.MBeansHandlerTest.testDiff(MBeansHandlerTest.java:63)
at sun.reflect.NativeMethodAccessorImpl.invoke0(Native Method)
at sun.reflect.NativeMethodAccessorImpl.invoke(NativeMethodAccessorImpl.java:62)
at sun.reflect.DelegatingMethodAccessorImpl.invoke(DelegatingMethodAccessorImpl.java:43)
at java.lang.reflect.Method.invoke(Method.java:498)
at com.carrotsearch.randomizedtesting.RandomizedRunner.invoke(RandomizedRunner.java:1713)
at com.carrotsearch.randomizedtesting.RandomizedRunner$8.evaluate(RandomizedRunner.java:907)
at com.carrotsearch.randomizedtesting.RandomizedRunner$9.evaluate(RandomizedRunner.java:943)
at com.carrotsearch.randomizedtesting.RandomizedRunner$10.evaluate(RandomizedRunner.java:957)
at com.carrotsearch.randomizedtesting.rules.SystemPropertiesRestoreRule$1.evaluate(SystemPropertiesRestoreRule.java:57)
at org.apache.lucene.util.TestRuleSetupTeardownChained$1.evaluate(TestRuleSetupTeardownChained.java:49)
at org.apache.lucene.util.AbstractBeforeAfterRule$1.evaluate(AbstractBeforeAfterRule.java:45)
at org.apache.lucene.util.TestRuleThreadAndTestName$1.evaluate(TestRuleThreadAndTestName.java:48)
at org.apache.lucene.util.TestRuleIgnoreAfterMaxFailures$1.evaluate(TestRuleIgnoreAfterMaxFailures.java:64)
at org.apache.lucene.util.TestRuleMarkFailure$1.evaluate(TestRuleMarkFailure.java:47)
at com.carrotsearch.randomizedtesting.rules.StatementAdapter.evaluate(StatementAdapter.java:36)
at com.carrotsearch.randomizedtesting.ThreadLeakControl$StatementRunner.run(ThreadLeakControl.java:368)
at com.carrotsearch.randomizedtesting.ThreadLeakControl.forkTimeoutingTask(ThreadLeakControl.java:817)
at com.carrotsearch.randomizedtesting.ThreadLeakControl$3.evaluate(ThreadLeakControl.java:468)
at com.carrotsearch.randomizedtesting.RandomizedRunner.runSingleTest(RandomizedRunner.java:916)
at com.carrotsearch.randomizedtesting.RandomizedRunner$5.evaluate(RandomizedRunner.java:802)
at com.carrotsearch.randomizedtesting.RandomizedRunner$6.evaluate(RandomizedRunner.java:852)
at com.carrotsearch.randomizedtesting.RandomizedRunner$7.evaluate(RandomizedRunner.java:863)
at com.carrotsearch.randomizedtesting.rules.StatementAdapter.evaluate(StatementAdapter.java:36)
at com.carrotsearch.randomizedtesting.rules.SystemPropertiesRestoreRule$1.evaluate(SystemPropertiesRestoreRule.java:57)
at org.apache.lucene.util.AbstractBeforeAfterRule$1.evaluate(AbstractBeforeAfterRule.java:45)
at com.carrotsearch.randomizedtesting.rules.StatementAdapter.evaluate(StatementAdapter.java:36)
at org.apache.lucene.util.TestRuleStoreClassName$1.evaluate(TestRuleStoreClassName.java:41)
at com.carrotsearch.randomizedtesting.rules.NoShadowingOrOverridesOnMethodsRule$1.evaluate(NoShadowingOrOverridesOnMethodsRule.java:40)
at com.carrotsearch.randomizedtesting.rules.NoShadowingOrOverridesOnMethodsRule$1.evaluate(NoShadowingOrOverridesOnMethodsRule.java:40)
at com.carrotsearch.randomizedtesting.rules.StatementAdapter.evaluate(StatementAdapter.java:36)
at com.carrotsearch.randomizedtesting.rules.StatementAdapter.evaluate(StatementAdapter.java:36)
at com.carrotsearch.randomizedtesting.rules.StatementAdapter.evaluate(StatementAdapter.java:36)
at org.apache.lucene.util.TestRuleAssertionsRequired$1.evaluate(TestRuleAssertionsRequired.java:53)
at org.apache.lucene.util.TestRuleMarkFailure$1.evaluate(TestRuleMarkFailure.java:47)
at org.apache.lucene.util.TestRuleIgnoreAfterMaxFailures$1.evaluate(TestRuleIgnoreAfterMaxFailures.java:64)
at org.apache.lucene.util.TestRuleIgnoreTestSuites$1.evaluate(TestRuleIgnoreTestSuites.java:54)
at com.carrotsearch.randomizedtesting.rules.StatementAdapter.evaluate(StatementAdapter.java:36)
at com.carrotsearch.randomizedtesting.ThreadLeakControl$StatementRunner.run(ThreadLeakControl.java:368)
at java.lang.Thread.run(Thread.java:745)
Build Log:
[...truncated 11695 lines...]
[junit4] Suite: org.apache.solr.handler.admin.MBeansHandlerTest
[junit4] 2> Creating dataDir: C:\Users\jenkins\workspace\Lucene-Solr-6.x-Windows\solr\build\solr-core\test\J1\temp\solr.handler.admin.MBeansHandlerTest_EE1D4CF11451C5A4-001\init-core-data-001
[junit4] 2> 1117855 INFO (SUITE-MBeansHandlerTest-seed#[EE1D4CF11451C5A4]-worker) [ ] o.a.s.SolrTestCaseJ4 Randomized ssl (true) and clientAuth (false) via: @org.apache.solr.util.RandomizeSSL(reason=, value=NaN, ssl=NaN, clientAuth=NaN)
[junit4] 2> 1117857 INFO (SUITE-MBeansHandlerTest-seed#[EE1D4CF11451C5A4]-worker) [ ] o.a.s.SolrTestCaseJ4 ####initCore
[junit4] 2> 1117860 INFO (SUITE-MBeansHandlerTest-seed#[EE1D4CF11451C5A4]-worker) [ ] o.a.s.c.SolrResourceLoader [null] Added 2 libs to classloader, from paths: [/C:/Users/jenkins/workspace/Lucene-Solr-6.x-Windows/solr/core/src/test-files/solr/collection1/lib, /C:/Users/jenkins/workspace/Lucene-Solr-6.x-Windows/solr/core/src/test-files/solr/collection1/lib/classes]
[junit4] 2> 1117933 WARN (SUITE-MBeansHandlerTest-seed#[EE1D4CF11451C5A4]-worker) [ ] o.a.s.c.Config Beginning with Solr 5.5, <mergePolicy> is deprecated, use <mergePolicyFactory> instead.
[junit4] 2> 1117934 INFO (SUITE-MBeansHandlerTest-seed#[EE1D4CF11451C5A4]-worker) [ ] o.a.s.c.SolrConfig Using Lucene MatchVersion: 6.5.0
[junit4] 2> 1117952 INFO (SUITE-MBeansHandlerTest-seed#[EE1D4CF11451C5A4]-worker) [ ] o.a.s.s.IndexSchema [null] Schema name=test
[junit4] 2> 1118029 WARN (SUITE-MBeansHandlerTest-seed#[EE1D4CF11451C5A4]-worker) [ ] o.a.s.s.IndexSchema [null] default search field in schema is text. WARNING: Deprecated, please use 'df' on request instead.
[junit4] 2> 1118030 INFO (SUITE-MBeansHandlerTest-seed#[EE1D4CF11451C5A4]-worker) [ ] o.a.s.s.IndexSchema Loaded schema test/1.0 with uniqueid field id
[junit4] 2> 1118043 INFO (SUITE-MBeansHandlerTest-seed#[EE1D4CF11451C5A4]-worker) [ ] o.a.s.u.UpdateShardHandler Creating UpdateShardHandler HTTP client with params: socketTimeout=30000&connTimeout=30000&retry=true
[junit4] 2> 1118132 WARN (SUITE-MBeansHandlerTest-seed#[EE1D4CF11451C5A4]-worker) [ ] o.a.s.m.r.SolrJmxReporter No serviceUrl or agentId was configured, using first MBeanServer.
[junit4] 2> 1118134 INFO (SUITE-MBeansHandlerTest-seed#[EE1D4CF11451C5A4]-worker) [ ] o.a.s.m.r.SolrJmxReporter JMX monitoring enabled at server: com.sun.jmx.mbeanserver.JmxMBeanServer@56637929
[junit4] 2> 1118134 WARN (SUITE-MBeansHandlerTest-seed#[EE1D4CF11451C5A4]-worker) [ ] o.a.s.m.r.SolrJmxReporter No serviceUrl or agentId was configured, using first MBeanServer.
[junit4] 2> 1118136 INFO (SUITE-MBeansHandlerTest-seed#[EE1D4CF11451C5A4]-worker) [ ] o.a.s.m.r.SolrJmxReporter JMX monitoring enabled at server: com.sun.jmx.mbeanserver.JmxMBeanServer@56637929
[junit4] 2> 1118136 WARN (SUITE-MBeansHandlerTest-seed#[EE1D4CF11451C5A4]-worker) [ ] o.a.s.m.r.SolrJmxReporter No serviceUrl or agentId was configured, using first MBeanServer.
[junit4] 2> 1118137 INFO (SUITE-MBeansHandlerTest-seed#[EE1D4CF11451C5A4]-worker) [ ] o.a.s.m.r.SolrJmxReporter JMX monitoring enabled at server: com.sun.jmx.mbeanserver.JmxMBeanServer@56637929
[junit4] 2> 1118139 INFO (coreLoadExecutor-4198-thread-1) [ x:collection1] o.a.s.c.SolrResourceLoader [null] Added 2 libs to classloader, from paths: [/C:/Users/jenkins/workspace/Lucene-Solr-6.x-Windows/solr/core/src/test-files/solr/collection1/lib, /C:/Users/jenkins/workspace/Lucene-Solr-6.x-Windows/solr/core/src/test-files/solr/collection1/lib/classes]
[junit4] 2> 1118199 WARN (coreLoadExecutor-4198-thread-1) [ x:collection1] o.a.s.c.Config Beginning with Solr 5.5, <mergePolicy> is deprecated, use <mergePolicyFactory> instead.
[junit4] 2> 1118200 INFO (coreLoadExecutor-4198-thread-1) [ x:collection1] o.a.s.c.SolrConfig Using Lucene MatchVersion: 6.5.0
[junit4] 2> 1118217 INFO (coreLoadExecutor-4198-thread-1) [ x:collection1] o.a.s.s.IndexSchema [collection1] Schema name=test
[junit4] 2> 1118283 WARN (coreLoadExecutor-4198-thread-1) [ x:collection1] o.a.s.s.IndexSchema [collection1] default search field in schema is text. WARNING: Deprecated, please use 'df' on request instead.
[junit4] 2> 1118286 INFO (coreLoadExecutor-4198-thread-1) [ x:collection1] o.a.s.s.IndexSchema Loaded schema test/1.0 with uniqueid field id
[junit4] 2> 1118301 INFO (coreLoadExecutor-4198-thread-1) [ x:collection1] o.a.s.c.CoreContainer Creating SolrCore 'collection1' using configuration from instancedir C:\Users\jenkins\workspace\Lucene-Solr-6.x-Windows\solr\core\src\test-files\solr\collection1
[junit4] 2> 1118301 WARN (coreLoadExecutor-4198-thread-1) [ x:collection1] o.a.s.m.r.SolrJmxReporter No serviceUrl or agentId was configured, using first MBeanServer.
[junit4] 2> 1118301 INFO (coreLoadExecutor-4198-thread-1) [ x:collection1] o.a.s.m.r.SolrJmxReporter JMX monitoring enabled at server: com.sun.jmx.mbeanserver.JmxMBeanServer@56637929
[junit4] 2> 1118301 INFO (coreLoadExecutor-4198-thread-1) [ x:collection1] o.a.s.c.SolrCore [[collection1] ] Opening new SolrCore at [C:\Users\jenkins\workspace\Lucene-Solr-6.x-Windows\solr\core\src\test-files\solr\collection1], dataDir=[C:\Users\jenkins\workspace\Lucene-Solr-6.x-Windows\solr\build\solr-core\test\J1\temp\solr.handler.admin.MBeansHandlerTest_EE1D4CF11451C5A4-001\init-core-data-001\]
[junit4] 2> 1118301 INFO (coreLoadExecutor-4198-thread-1) [ x:collection1] o.a.s.c.JmxMonitoredMap JMX monitoring is enabled. Adding Solr mbeans to JMX Server: com.sun.jmx.mbeanserver.JmxMBeanServer@56637929
[junit4] 2> 1118302 INFO (coreLoadExecutor-4198-thread-1) [ x:collection1] o.a.s.u.RandomMergePolicy RandomMergePolicy wrapping class org.apache.lucene.index.LogByteSizeMergePolicy: [LogByteSizeMergePolicy: minMergeSize=1677721, mergeFactor=41, maxMergeSize=2147483648, maxMergeSizeForForcedMerge=9223372036854775807, calibrateSizeByDeletes=true, maxMergeDocs=2147483647, maxCFSSegmentSizeMB=8.796093022207999E12, noCFSRatio=0.0]
[junit4] 2> 1118420 INFO (coreLoadExecutor-4198-thread-1) [ x:collection1] o.a.s.u.UpdateHandler Using UpdateLog implementation: org.apache.solr.update.UpdateLog
[junit4] 2> 1118420 INFO (coreLoadExecutor-4198-thread-1) [ x:collection1] o.a.s.u.UpdateLog Initializing UpdateLog: dataDir= defaultSyncLevel=FLUSH numRecordsToKeep=100 maxNumLogsToKeep=10 numVersionBuckets=65536
[junit4] 2> 1118421 INFO (coreLoadExecutor-4198-thread-1) [ x:collection1] o.a.s.u.CommitTracker Hard AutoCommit: disabled
[junit4] 2> 1118421 INFO (coreLoadExecutor-4198-thread-1) [ x:collection1] o.a.s.u.CommitTracker Soft AutoCommit: disabled
[junit4] 2> 1118421 INFO (coreLoadExecutor-4198-thread-1) [ x:collection1] o.a.s.u.RandomMergePolicy RandomMergePolicy wrapping class org.apache.lucene.index.LogByteSizeMergePolicy: [LogByteSizeMergePolicy: minMergeSize=1677721, mergeFactor=31, maxMergeSize=2147483648, maxMergeSizeForForcedMerge=9223372036854775807, calibrateSizeByDeletes=true, maxMergeDocs=2147483647, maxCFSSegmentSizeMB=8.796093022207999E12, noCFSRatio=0.21372534277257485]
[junit4] 2> 1118422 INFO (coreLoadExecutor-4198-thread-1) [ x:collection1] o.a.s.s.SolrIndexSearcher Opening [Searcher@79e64eef[collection1] main]
[junit4] 2> 1118422 INFO (coreLoadExecutor-4198-thread-1) [ x:collection1] o.a.s.h.c.SpellCheckComponent Initializing spell checkers
[junit4] 2> 1118454 INFO (coreLoadExecutor-4198-thread-1) [ x:collection1] o.a.s.s.DirectSolrSpellChecker init: {name=direct,classname=DirectSolrSpellChecker,field=lowerfilt,minQueryLength=3}
[junit4] 2> 1118541 INFO (coreLoadExecutor-4198-thread-1) [ x:collection1] o.a.s.h.ReplicationHandler Commits will be reserved for 10000
[junit4] 2> 1118541 INFO (searcherExecutor-4199-thread-1-processing-x:collection1) [ x:collection1] o.a.s.h.c.SpellCheckComponent Loading spell index for spellchecker: default
[junit4] 2> 1118542 INFO (searcherExecutor-4199-thread-1-processing-x:collection1) [ x:collection1] o.a.s.h.c.SpellCheckComponent Loading spell index for spellchecker: direct
[junit4] 2> 1118542 INFO (searcherExecutor-4199-thread-1-processing-x:collection1) [ x:collection1] o.a.s.h.c.SpellCheckComponent Loading spell index for spellchecker: wordbreak
[junit4] 2> 1118542 INFO (searcherExecutor-4199-thread-1-processing-x:collection1) [ x:collection1] o.a.s.h.c.SpellCheckComponent Loading spell index for spellchecker: multipleFields
[junit4] 2> 1118543 INFO (searcherExecutor-4199-thread-1-processing-x:collection1) [ x:collection1] o.a.s.h.c.SpellCheckComponent Loading spell index for spellchecker: jarowinkler
[junit4] 2> 1118543 INFO (searcherExecutor-4199-thread-1-processing-x:collection1) [ x:collection1] o.a.s.h.c.SpellCheckComponent Loading spell index for spellchecker: external
[junit4] 2> 1118544 INFO (coreLoadExecutor-4198-thread-1) [ x:collection1] o.a.s.u.UpdateLog Could not find max version in index or recent updates, using new clock 1558827618494578688
[junit4] 2> 1118545 INFO (searcherExecutor-4199-thread-1-processing-x:collection1) [ x:collection1] o.a.s.h.c.SpellCheckComponent Loading spell index for spellchecker: freq
[junit4] 2> 1118550 INFO (searcherExecutor-4199-thread-1-processing-x:collection1) [ x:collection1] o.a.s.h.c.SpellCheckComponent Loading spell index for spellchecker: fqcn
[junit4] 2> 1118550 INFO (searcherExecutor-4199-thread-1-processing-x:collection1) [ x:collection1] o.a.s.h.c.SpellCheckComponent Loading spell index for spellchecker: perDict
[junit4] 2> 1118551 INFO (searcherExecutor-4199-thread-1-processing-x:collection1) [ x:collection1] o.a.s.c.SolrCore [collection1] Registered new searcher Searcher@79e64eef[collection1] main{ExitableDirectoryReader(UninvertingDirectoryReader())}
[junit4] 2> 1118552 INFO (SUITE-MBeansHandlerTest-seed#[EE1D4CF11451C5A4]-worker) [ ] o.a.s.SolrTestCaseJ4 ####initCore end
[junit4] 2> 1118554 INFO (TEST-MBeansHandlerTest.testXMLDiffWithExternalEntity-seed#[EE1D4CF11451C5A4]) [ ] o.a.s.SolrTestCaseJ4 ###Starting testXMLDiffWithExternalEntity
[junit4] 2> 1118689 INFO (TEST-MBeansHandlerTest.testXMLDiffWithExternalEntity-seed#[EE1D4CF11451C5A4]) [ ] o.a.s.SolrTestCaseJ4 ###Ending testXMLDiffWithExternalEntity
[junit4] 2> 1118690 INFO (TEST-MBeansHandlerTest.testBackCompatNames-seed#[EE1D4CF11451C5A4]) [ ] o.a.s.SolrTestCaseJ4 ###Starting testBackCompatNames
[junit4] 2> 1118691 INFO (TEST-MBeansHandlerTest.testBackCompatNames-seed#[EE1D4CF11451C5A4]) [ ] o.a.s.c.S.Request [collection1] webapp=null path=null params={qt=/admin/mbeans&wt=xml} status=0 QTime=1
[junit4] 2> 1118705 INFO (TEST-MBeansHandlerTest.testBackCompatNames-seed#[EE1D4CF11451C5A4]) [ ] o.a.s.c.S.Request [collection1] webapp=null path=null params={qt=/admin/mbeans&cat=QUERYHANDLER&wt=xml} status=0 QTime=3
[junit4] 2> 1118706 INFO (TEST-MBeansHandlerTest.testBackCompatNames-seed#[EE1D4CF11451C5A4]) [ ] o.a.s.c.S.Request [collection1] webapp=null path=null params={qt=/admin/mbeans&cat=UPDATE&wt=xml} status=0 QTime=0
[junit4] 2> 1118706 INFO (TEST-MBeansHandlerTest.testBackCompatNames-seed#[EE1D4CF11451C5A4]) [ ] o.a.s.SolrTestCaseJ4 ###Ending testBackCompatNames
[junit4] 2> 1118711 INFO (TEST-MBeansHandlerTest.testDiff-seed#[EE1D4CF11451C5A4]) [ ] o.a.s.SolrTestCaseJ4 ###Starting testDiff
[junit4] 2> 1118717 INFO (TEST-MBeansHandlerTest.testDiff-seed#[EE1D4CF11451C5A4]) [ ] o.a.s.c.S.Request [collection1] webapp=null path=null params={qt=/admin/mbeans&stats=true&wt=xml} status=0 QTime=6
[junit4] 2> 1118768 INFO (TEST-MBeansHandlerTest.testDiff-seed#[EE1D4CF11451C5A4]) [ ] o.a.s.c.S.Request [collection1] webapp=null path=null params={qt=/admin/mbeans&stats=true&diff=true&wt=xml} status=0 QTime=35
[junit4] 2> 1118770 INFO (TEST-MBeansHandlerTest.testDiff-seed#[EE1D4CF11451C5A4]) [ ] o.a.s.SolrTestCaseJ4 ###Ending testDiff
[junit4] 2> NOTE: reproduce with: ant test -Dtestcase=MBeansHandlerTest -Dtests.method=testDiff -Dtests.seed=EE1D4CF11451C5A4 -Dtests.slow=true -Dtests.locale=da-DK -Dtests.timezone=Pacific/Johnston -Dtests.asserts=true -Dtests.file.encoding=UTF-8
[junit4] FAILURE 0.07s J1 | MBeansHandlerTest.testDiff <<<
[junit4] > Throwable #1: org.junit.ComparisonFailure: expected:<Was: [1, Now: 2], Delta: 1> but was:<Was: [4, Now: 5], Delta: 1>
[junit4] > at __randomizedtesting.SeedInfo.seed([EE1D4CF11451C5A4:2B0B886A04E7FDC4]:0)
[junit4] > at org.apache.solr.handler.admin.MBeansHandlerTest.testDiff(MBeansHandlerTest.java:63)
[junit4] > at java.lang.Thread.run(Thread.java:745)
[junit4] 2> 1118776 INFO (SUITE-MBeansHandlerTest-seed#[EE1D4CF11451C5A4]-worker) [ ] o.a.s.SolrTestCaseJ4 ###deleteCore
[junit4] 2> 1118776 INFO (SUITE-MBeansHandlerTest-seed#[EE1D4CF11451C5A4]-worker) [ ] o.a.s.c.CoreContainer Shutting down CoreContainer instance=163626722
[junit4] 2> 1118777 INFO (coreCloseExecutor-4204-thread-1) [ x:collection1] o.a.s.c.SolrCore [collection1] CLOSING SolrCore org.apache.solr.core.SolrCore@6cf6418a
[junit4] 2> 1118801 INFO (coreCloseExecutor-4204-thread-1) [ x:collection1] o.a.s.m.SolrMetricManager Closing metric reporters for: solr.core.collection1
[junit4] 2> 1118802 INFO (SUITE-MBeansHandlerTest-seed#[EE1D4CF11451C5A4]-worker) [ ] o.a.s.m.SolrMetricManager Closing metric reporters for: solr.node
[junit4] 2> NOTE: leaving temporary files on disk at: C:\Users\jenkins\workspace\Lucene-Solr-6.x-Windows\solr\build\solr-core\test\J1\temp\solr.handler.admin.MBeansHandlerTest_EE1D4CF11451C5A4-001
[junit4] 2> Feb 09, 2017 4:17:43 AM com.carrotsearch.randomizedtesting.ThreadLeakControl checkThreadLeaks
[junit4] 2> WARNING: Will linger awaiting termination of 1 leaked thread(s).
[junit4] 2> NOTE: test params are: codec=Lucene62, sim=RandomSimilarity(queryNorm=false,coord=crazy): {}, locale=da-DK, timezone=Pacific/Johnston
[junit4] 2> NOTE: Windows 10 10.0 amd64/Oracle Corporation 1.8.0_121 (64-bit)/cpus=3,threads=1,free=256722016,total=412090368
[junit4] 2> NOTE: All tests run in this JVM: [HLLUtilTest, SolrCoreCheckLockOnStartupTest, LeaderInitiatedRecoveryOnCommitTest, LeaderFailoverAfterPartitionTest, BadIndexSchemaTest, TestDelegationWithHadoopAuth, UpdateRequestProcessorFactoryTest, CdcrRequestHandlerTest, TestShortCircuitedRequests, SpellCheckComponentTest, CollectionsAPIDistributedZkTest, TestRuleBasedAuthorizationPlugin, TestNumericTerms64, AddBlockUpdateTest, TestValueSourceCache, TestJsonRequest, DirectUpdateHandlerOptimizeTest, CheckHdfsIndexTest, TestDocTermOrds, TestQuerySenderNoQuery, ClusterStateTest, RequestHandlersTest, TestDFRSimilarityFactory, ConcurrentDeleteAndCreateCollectionTest, TestRecovery, RollingRestartTest, TestMiniSolrCloudCluster, DeleteLastCustomShardedReplicaTest, TermVectorComponentDistributedTest, UUIDUpdateProcessorFallbackTest, SuggesterTSTTest, TestCorePropertiesReload, BasicDistributedZk2Test, OverriddenZkACLAndCredentialsProvidersTest, TestCollectionAPIs, SecurityConfHandlerTest, PeerSyncReplicationTest, TestPathTrie, TestIndexSearcher, AnalyticsMergeStrategyTest, TestDynamicFieldResource, TestReplicationHandlerBackup, HdfsCollectionsAPIDistributedZkTest, TestCodecSupport, TestConfig, TestHighFrequencyDictionaryFactory, SuggesterWFSTTest, TestSolrCloudWithDelegationTokens, SimpleCollectionCreateDeleteTest, TestPHPSerializedResponseWriter, ZkStateReaderTest, DistributedQueueTest, DistributedFacetPivotLargeTest, TestBinaryResponseWriter, TestRealTimeGet, SearchHandlerTest, BinaryUpdateRequestHandlerTest, TestFileDictionaryLookup, TestSystemIdResolver, ShardRoutingCustomTest, TestExpandComponent, RulesTest, TestRestManager, TestFieldCacheSort, LukeRequestHandlerTest, JvmMetricsTest, EchoParamsTest, DistribDocExpirationUpdateProcessorTest, TestFoldingMultitermQuery, TestDFISimilarityFactory, IndexSchemaTest, CurrencyFieldOpenExchangeTest, TestLMDirichletSimilarityFactory, SimpleMLTQParserTest, TestMiniSolrCloudClusterSSL, TestComplexPhraseQParserPlugin, TestDistributedMissingSort, TestDownShardTolerantSearch, TestManagedResource, TestJsonFacetRefinement, TestReload, TestCloudInspectUtil, RequestLoggingTest, TestSlowCompositeReaderWrapper, MetricUtilsTest, TestFieldSortValues, TestSolrCloudSnapshots, DateRangeFieldTest, TestSolrDeletionPolicy2, CSVRequestHandlerTest, ResourceLoaderTest, BooleanFieldTest, TestCloudPseudoReturnFields, JSONWriterTest, MultiThreadedOCPTest, SolrCmdDistributorTest, TestQueryUtils, SolrGraphiteReporterTest, TestReloadDeadlock, TestExportWriter, ConvertedLegacyTest, PreAnalyzedFieldTest, TestSimpleQParserPlugin, TestAuthorizationFramework, TestSuggestSpellingConverter, SolrMetricManagerTest, BlockDirectoryTest, BasicZkTest, TestBulkSchemaConcurrent, V2ApiIntegrationTest, ClassificationUpdateProcessorTest, FileBasedSpellCheckerTest, TestStressUserVersions, SpellPossibilityIteratorTest, TestQueryTypes, TestRawTransformer, TestFuzzyAnalyzedSuggestions, PeerSyncWithIndexFingerprintCachingTest, HighlighterConfigTest, TestCrossCoreJoin, TestDefaultSearchFieldResource, CollectionsAPIAsyncDistributedZkTest, ExternalFileFieldSortTest, ReplicationFactorTest, UpdateParamsTest, MBeansHandlerTest]
[junit4] Completed [252/690 (1!)] on J1 in 1.22s, 3 tests, 1 failure <<< FAILURES!
[...truncated 63928 lines...]
[JENKINS] Lucene-Solr-6.x-Windows (32bit/jdk1.8.0_121) - Build #
716 - Still Unstable!
Posted by Policeman Jenkins Server <je...@thetaphi.de>.
Build: https://jenkins.thetaphi.de/job/Lucene-Solr-6.x-Windows/716/
Java: 32bit/jdk1.8.0_121 -client -XX:+UseG1GC
1 tests failed.
FAILED: org.apache.solr.handler.admin.MBeansHandlerTest.testDiff
Error Message:
expected:<Was: [1, Now: 2], Delta: 1> but was:<Was: [4, Now: 5], Delta: 1>
Stack Trace:
org.junit.ComparisonFailure: expected:<Was: [1, Now: 2], Delta: 1> but was:<Was: [4, Now: 5], Delta: 1>
at __randomizedtesting.SeedInfo.seed([92E3B00F43178456:57F5749453A1BC36]:0)
at org.junit.Assert.assertEquals(Assert.java:125)
at org.junit.Assert.assertEquals(Assert.java:147)
at org.apache.solr.handler.admin.MBeansHandlerTest.testDiff(MBeansHandlerTest.java:63)
at sun.reflect.NativeMethodAccessorImpl.invoke0(Native Method)
at sun.reflect.NativeMethodAccessorImpl.invoke(NativeMethodAccessorImpl.java:62)
at sun.reflect.DelegatingMethodAccessorImpl.invoke(DelegatingMethodAccessorImpl.java:43)
at java.lang.reflect.Method.invoke(Method.java:498)
at com.carrotsearch.randomizedtesting.RandomizedRunner.invoke(RandomizedRunner.java:1713)
at com.carrotsearch.randomizedtesting.RandomizedRunner$8.evaluate(RandomizedRunner.java:907)
at com.carrotsearch.randomizedtesting.RandomizedRunner$9.evaluate(RandomizedRunner.java:943)
at com.carrotsearch.randomizedtesting.RandomizedRunner$10.evaluate(RandomizedRunner.java:957)
at com.carrotsearch.randomizedtesting.rules.SystemPropertiesRestoreRule$1.evaluate(SystemPropertiesRestoreRule.java:57)
at org.apache.lucene.util.TestRuleSetupTeardownChained$1.evaluate(TestRuleSetupTeardownChained.java:49)
at org.apache.lucene.util.AbstractBeforeAfterRule$1.evaluate(AbstractBeforeAfterRule.java:45)
at org.apache.lucene.util.TestRuleThreadAndTestName$1.evaluate(TestRuleThreadAndTestName.java:48)
at org.apache.lucene.util.TestRuleIgnoreAfterMaxFailures$1.evaluate(TestRuleIgnoreAfterMaxFailures.java:64)
at org.apache.lucene.util.TestRuleMarkFailure$1.evaluate(TestRuleMarkFailure.java:47)
at com.carrotsearch.randomizedtesting.rules.StatementAdapter.evaluate(StatementAdapter.java:36)
at com.carrotsearch.randomizedtesting.ThreadLeakControl$StatementRunner.run(ThreadLeakControl.java:368)
at com.carrotsearch.randomizedtesting.ThreadLeakControl.forkTimeoutingTask(ThreadLeakControl.java:817)
at com.carrotsearch.randomizedtesting.ThreadLeakControl$3.evaluate(ThreadLeakControl.java:468)
at com.carrotsearch.randomizedtesting.RandomizedRunner.runSingleTest(RandomizedRunner.java:916)
at com.carrotsearch.randomizedtesting.RandomizedRunner$5.evaluate(RandomizedRunner.java:802)
at com.carrotsearch.randomizedtesting.RandomizedRunner$6.evaluate(RandomizedRunner.java:852)
at com.carrotsearch.randomizedtesting.RandomizedRunner$7.evaluate(RandomizedRunner.java:863)
at com.carrotsearch.randomizedtesting.rules.StatementAdapter.evaluate(StatementAdapter.java:36)
at com.carrotsearch.randomizedtesting.rules.SystemPropertiesRestoreRule$1.evaluate(SystemPropertiesRestoreRule.java:57)
at org.apache.lucene.util.AbstractBeforeAfterRule$1.evaluate(AbstractBeforeAfterRule.java:45)
at com.carrotsearch.randomizedtesting.rules.StatementAdapter.evaluate(StatementAdapter.java:36)
at org.apache.lucene.util.TestRuleStoreClassName$1.evaluate(TestRuleStoreClassName.java:41)
at com.carrotsearch.randomizedtesting.rules.NoShadowingOrOverridesOnMethodsRule$1.evaluate(NoShadowingOrOverridesOnMethodsRule.java:40)
at com.carrotsearch.randomizedtesting.rules.NoShadowingOrOverridesOnMethodsRule$1.evaluate(NoShadowingOrOverridesOnMethodsRule.java:40)
at com.carrotsearch.randomizedtesting.rules.StatementAdapter.evaluate(StatementAdapter.java:36)
at com.carrotsearch.randomizedtesting.rules.StatementAdapter.evaluate(StatementAdapter.java:36)
at com.carrotsearch.randomizedtesting.rules.StatementAdapter.evaluate(StatementAdapter.java:36)
at org.apache.lucene.util.TestRuleAssertionsRequired$1.evaluate(TestRuleAssertionsRequired.java:53)
at org.apache.lucene.util.TestRuleMarkFailure$1.evaluate(TestRuleMarkFailure.java:47)
at org.apache.lucene.util.TestRuleIgnoreAfterMaxFailures$1.evaluate(TestRuleIgnoreAfterMaxFailures.java:64)
at org.apache.lucene.util.TestRuleIgnoreTestSuites$1.evaluate(TestRuleIgnoreTestSuites.java:54)
at com.carrotsearch.randomizedtesting.rules.StatementAdapter.evaluate(StatementAdapter.java:36)
at com.carrotsearch.randomizedtesting.ThreadLeakControl$StatementRunner.run(ThreadLeakControl.java:368)
at java.lang.Thread.run(Thread.java:745)
Build Log:
[...truncated 11426 lines...]
[junit4] Suite: org.apache.solr.handler.admin.MBeansHandlerTest
[junit4] 2> Creating dataDir: C:\Users\jenkins\workspace\Lucene-Solr-6.x-Windows\solr\build\solr-core\test\J1\temp\solr.handler.admin.MBeansHandlerTest_92E3B00F43178456-001\init-core-data-001
[junit4] 2> 927541 INFO (SUITE-MBeansHandlerTest-seed#[92E3B00F43178456]-worker) [ ] o.a.s.SolrTestCaseJ4 Randomized ssl (false) and clientAuth (false) via: @org.apache.solr.util.RandomizeSSL(reason=, value=NaN, ssl=NaN, clientAuth=NaN)
[junit4] 2> 927542 INFO (SUITE-MBeansHandlerTest-seed#[92E3B00F43178456]-worker) [ ] o.a.s.SolrTestCaseJ4 ####initCore
[junit4] 2> 927543 INFO (SUITE-MBeansHandlerTest-seed#[92E3B00F43178456]-worker) [ ] o.a.s.c.SolrResourceLoader [null] Added 2 libs to classloader, from paths: [/C:/Users/jenkins/workspace/Lucene-Solr-6.x-Windows/solr/core/src/test-files/solr/collection1/lib, /C:/Users/jenkins/workspace/Lucene-Solr-6.x-Windows/solr/core/src/test-files/solr/collection1/lib/classes]
[junit4] 2> 927637 WARN (SUITE-MBeansHandlerTest-seed#[92E3B00F43178456]-worker) [ ] o.a.s.c.Config Beginning with Solr 5.5, <mergePolicy> is deprecated, use <mergePolicyFactory> instead.
[junit4] 2> 927640 INFO (SUITE-MBeansHandlerTest-seed#[92E3B00F43178456]-worker) [ ] o.a.s.c.SolrConfig Using Lucene MatchVersion: 6.5.0
[junit4] 2> 927673 INFO (SUITE-MBeansHandlerTest-seed#[92E3B00F43178456]-worker) [ ] o.a.s.s.IndexSchema [null] Schema name=test
[junit4] 2> 927783 WARN (SUITE-MBeansHandlerTest-seed#[92E3B00F43178456]-worker) [ ] o.a.s.s.IndexSchema [null] default search field in schema is text. WARNING: Deprecated, please use 'df' on request instead.
[junit4] 2> 927787 INFO (SUITE-MBeansHandlerTest-seed#[92E3B00F43178456]-worker) [ ] o.a.s.s.IndexSchema Loaded schema test/1.0 with uniqueid field id
[junit4] 2> 927807 INFO (SUITE-MBeansHandlerTest-seed#[92E3B00F43178456]-worker) [ ] o.a.s.u.UpdateShardHandler Creating UpdateShardHandler HTTP client with params: socketTimeout=30000&connTimeout=30000&retry=true
[junit4] 2> 927946 WARN (SUITE-MBeansHandlerTest-seed#[92E3B00F43178456]-worker) [ ] o.a.s.m.r.SolrJmxReporter No serviceUrl or agentId was configured, using first MBeanServer.
[junit4] 2> 927953 INFO (SUITE-MBeansHandlerTest-seed#[92E3B00F43178456]-worker) [ ] o.a.s.m.r.SolrJmxReporter JMX monitoring enabled at server: com.sun.jmx.mbeanserver.JmxMBeanServer@fdd77
[junit4] 2> 927953 WARN (SUITE-MBeansHandlerTest-seed#[92E3B00F43178456]-worker) [ ] o.a.s.m.r.SolrJmxReporter No serviceUrl or agentId was configured, using first MBeanServer.
[junit4] 2> 927961 INFO (SUITE-MBeansHandlerTest-seed#[92E3B00F43178456]-worker) [ ] o.a.s.m.r.SolrJmxReporter JMX monitoring enabled at server: com.sun.jmx.mbeanserver.JmxMBeanServer@fdd77
[junit4] 2> 927962 WARN (SUITE-MBeansHandlerTest-seed#[92E3B00F43178456]-worker) [ ] o.a.s.m.r.SolrJmxReporter No serviceUrl or agentId was configured, using first MBeanServer.
[junit4] 2> 927962 INFO (SUITE-MBeansHandlerTest-seed#[92E3B00F43178456]-worker) [ ] o.a.s.m.r.SolrJmxReporter JMX monitoring enabled at server: com.sun.jmx.mbeanserver.JmxMBeanServer@fdd77
[junit4] 2> 927965 INFO (coreLoadExecutor-2182-thread-1) [ x:collection1] o.a.s.c.SolrResourceLoader [null] Added 2 libs to classloader, from paths: [/C:/Users/jenkins/workspace/Lucene-Solr-6.x-Windows/solr/core/src/test-files/solr/collection1/lib, /C:/Users/jenkins/workspace/Lucene-Solr-6.x-Windows/solr/core/src/test-files/solr/collection1/lib/classes]
[junit4] 2> 928058 WARN (coreLoadExecutor-2182-thread-1) [ x:collection1] o.a.s.c.Config Beginning with Solr 5.5, <mergePolicy> is deprecated, use <mergePolicyFactory> instead.
[junit4] 2> 928061 INFO (coreLoadExecutor-2182-thread-1) [ x:collection1] o.a.s.c.SolrConfig Using Lucene MatchVersion: 6.5.0
[junit4] 2> 928097 INFO (coreLoadExecutor-2182-thread-1) [ x:collection1] o.a.s.s.IndexSchema [collection1] Schema name=test
[junit4] 2> 928229 WARN (coreLoadExecutor-2182-thread-1) [ x:collection1] o.a.s.s.IndexSchema [collection1] default search field in schema is text. WARNING: Deprecated, please use 'df' on request instead.
[junit4] 2> 928235 INFO (coreLoadExecutor-2182-thread-1) [ x:collection1] o.a.s.s.IndexSchema Loaded schema test/1.0 with uniqueid field id
[junit4] 2> 928271 INFO (coreLoadExecutor-2182-thread-1) [ x:collection1] o.a.s.c.CoreContainer Creating SolrCore 'collection1' using configuration from instancedir C:\Users\jenkins\workspace\Lucene-Solr-6.x-Windows\solr\core\src\test-files\solr\collection1
[junit4] 2> 928272 WARN (coreLoadExecutor-2182-thread-1) [ x:collection1] o.a.s.m.r.SolrJmxReporter No serviceUrl or agentId was configured, using first MBeanServer.
[junit4] 2> 928272 INFO (coreLoadExecutor-2182-thread-1) [ x:collection1] o.a.s.m.r.SolrJmxReporter JMX monitoring enabled at server: com.sun.jmx.mbeanserver.JmxMBeanServer@fdd77
[junit4] 2> 928273 INFO (coreLoadExecutor-2182-thread-1) [ x:collection1] o.a.s.c.SolrCore [[collection1] ] Opening new SolrCore at [C:\Users\jenkins\workspace\Lucene-Solr-6.x-Windows\solr\core\src\test-files\solr\collection1], dataDir=[C:\Users\jenkins\workspace\Lucene-Solr-6.x-Windows\solr\build\solr-core\test\J1\temp\solr.handler.admin.MBeansHandlerTest_92E3B00F43178456-001\init-core-data-001\]
[junit4] 2> 928274 INFO (coreLoadExecutor-2182-thread-1) [ x:collection1] o.a.s.c.JmxMonitoredMap JMX monitoring is enabled. Adding Solr mbeans to JMX Server: com.sun.jmx.mbeanserver.JmxMBeanServer@fdd77
[junit4] 2> 928276 INFO (coreLoadExecutor-2182-thread-1) [ x:collection1] o.a.s.u.RandomMergePolicy RandomMergePolicy wrapping class org.apache.lucene.index.TieredMergePolicy: [TieredMergePolicy: maxMergeAtOnce=25, maxMergeAtOnceExplicit=15, maxMergedSegmentMB=87.248046875, floorSegmentMB=1.552734375, forceMergeDeletesPctAllowed=21.61208071894073, segmentsPerTier=34.0, maxCFSSegmentSizeMB=0.9736328125, noCFSRatio=0.12939059020069943
[junit4] 2> 928470 INFO (coreLoadExecutor-2182-thread-1) [ x:collection1] o.a.s.u.UpdateHandler Using UpdateLog implementation: org.apache.solr.update.UpdateLog
[junit4] 2> 928471 INFO (coreLoadExecutor-2182-thread-1) [ x:collection1] o.a.s.u.UpdateLog Initializing UpdateLog: dataDir= defaultSyncLevel=FLUSH numRecordsToKeep=100 maxNumLogsToKeep=10 numVersionBuckets=65536
[junit4] 2> 928472 INFO (coreLoadExecutor-2182-thread-1) [ x:collection1] o.a.s.u.CommitTracker Hard AutoCommit: disabled
[junit4] 2> 928472 INFO (coreLoadExecutor-2182-thread-1) [ x:collection1] o.a.s.u.CommitTracker Soft AutoCommit: disabled
[junit4] 2> 928474 INFO (coreLoadExecutor-2182-thread-1) [ x:collection1] o.a.s.u.RandomMergePolicy RandomMergePolicy wrapping class org.apache.lucene.index.LogDocMergePolicy: [LogDocMergePolicy: minMergeSize=1000, mergeFactor=16, maxMergeSize=9223372036854775807, maxMergeSizeForForcedMerge=9223372036854775807, calibrateSizeByDeletes=false, maxMergeDocs=2147483647, maxCFSSegmentSizeMB=8.796093022207999E12, noCFSRatio=1.0]
[junit4] 2> 928475 INFO (coreLoadExecutor-2182-thread-1) [ x:collection1] o.a.s.s.SolrIndexSearcher Opening [Searcher@1e934c4[collection1] main]
[junit4] 2> 928476 INFO (coreLoadExecutor-2182-thread-1) [ x:collection1] o.a.s.h.c.SpellCheckComponent Initializing spell checkers
[junit4] 2> 928484 INFO (coreLoadExecutor-2182-thread-1) [ x:collection1] o.a.s.s.DirectSolrSpellChecker init: {name=direct,classname=DirectSolrSpellChecker,field=lowerfilt,minQueryLength=3}
[junit4] 2> 928524 INFO (coreLoadExecutor-2182-thread-1) [ x:collection1] o.a.s.h.ReplicationHandler Commits will be reserved for 10000
[junit4] 2> 928524 INFO (searcherExecutor-2183-thread-1-processing-x:collection1) [ x:collection1] o.a.s.h.c.SpellCheckComponent Loading spell index for spellchecker: default
[junit4] 2> 928525 INFO (searcherExecutor-2183-thread-1-processing-x:collection1) [ x:collection1] o.a.s.h.c.SpellCheckComponent Loading spell index for spellchecker: direct
[junit4] 2> 928525 INFO (searcherExecutor-2183-thread-1-processing-x:collection1) [ x:collection1] o.a.s.h.c.SpellCheckComponent Loading spell index for spellchecker: wordbreak
[junit4] 2> 928525 INFO (searcherExecutor-2183-thread-1-processing-x:collection1) [ x:collection1] o.a.s.h.c.SpellCheckComponent Loading spell index for spellchecker: multipleFields
[junit4] 2> 928526 INFO (searcherExecutor-2183-thread-1-processing-x:collection1) [ x:collection1] o.a.s.h.c.SpellCheckComponent Loading spell index for spellchecker: jarowinkler
[junit4] 2> 928526 INFO (coreLoadExecutor-2182-thread-1) [ x:collection1] o.a.s.u.UpdateLog Could not find max version in index or recent updates, using new clock 1558782794084122624
[junit4] 2> 928527 INFO (searcherExecutor-2183-thread-1-processing-x:collection1) [ x:collection1] o.a.s.h.c.SpellCheckComponent Loading spell index for spellchecker: external
[junit4] 2> 928528 INFO (searcherExecutor-2183-thread-1-processing-x:collection1) [ x:collection1] o.a.s.h.c.SpellCheckComponent Loading spell index for spellchecker: freq
[junit4] 2> 928528 INFO (searcherExecutor-2183-thread-1-processing-x:collection1) [ x:collection1] o.a.s.h.c.SpellCheckComponent Loading spell index for spellchecker: fqcn
[junit4] 2> 928529 INFO (searcherExecutor-2183-thread-1-processing-x:collection1) [ x:collection1] o.a.s.h.c.SpellCheckComponent Loading spell index for spellchecker: perDict
[junit4] 2> 928534 INFO (searcherExecutor-2183-thread-1-processing-x:collection1) [ x:collection1] o.a.s.c.SolrCore [collection1] Registered new searcher Searcher@1e934c4[collection1] main{ExitableDirectoryReader(UninvertingDirectoryReader())}
[junit4] 2> 928536 INFO (SUITE-MBeansHandlerTest-seed#[92E3B00F43178456]-worker) [ ] o.a.s.SolrTestCaseJ4 ####initCore end
[junit4] 2> 928539 INFO (TEST-MBeansHandlerTest.testBackCompatNames-seed#[92E3B00F43178456]) [ ] o.a.s.SolrTestCaseJ4 ###Starting testBackCompatNames
[junit4] 2> 928540 INFO (TEST-MBeansHandlerTest.testBackCompatNames-seed#[92E3B00F43178456]) [ ] o.a.s.c.S.Request [collection1] webapp=null path=null params={qt=/admin/mbeans&wt=xml} status=0 QTime=1
[junit4] 2> 928560 INFO (TEST-MBeansHandlerTest.testBackCompatNames-seed#[92E3B00F43178456]) [ ] o.a.s.c.S.Request [collection1] webapp=null path=null params={qt=/admin/mbeans&cat=QUERYHANDLER&wt=xml} status=0 QTime=0
[junit4] 2> 928562 INFO (TEST-MBeansHandlerTest.testBackCompatNames-seed#[92E3B00F43178456]) [ ] o.a.s.c.S.Request [collection1] webapp=null path=null params={qt=/admin/mbeans&cat=UPDATE&wt=xml} status=0 QTime=0
[junit4] 2> 928563 INFO (TEST-MBeansHandlerTest.testBackCompatNames-seed#[92E3B00F43178456]) [ ] o.a.s.SolrTestCaseJ4 ###Ending testBackCompatNames
[junit4] 2> 928567 INFO (TEST-MBeansHandlerTest.testDiff-seed#[92E3B00F43178456]) [ ] o.a.s.SolrTestCaseJ4 ###Starting testDiff
[junit4] 2> 928570 INFO (TEST-MBeansHandlerTest.testDiff-seed#[92E3B00F43178456]) [ ] o.a.s.c.S.Request [collection1] webapp=null path=null params={qt=/admin/mbeans&stats=true&wt=xml} status=0 QTime=2
[junit4] 2> 928653 INFO (TEST-MBeansHandlerTest.testDiff-seed#[92E3B00F43178456]) [ ] o.a.s.c.S.Request [collection1] webapp=null path=null params={qt=/admin/mbeans&stats=true&diff=true&wt=xml} status=0 QTime=78
[junit4] 2> 928654 INFO (TEST-MBeansHandlerTest.testDiff-seed#[92E3B00F43178456]) [ ] o.a.s.SolrTestCaseJ4 ###Ending testDiff
[junit4] 2> NOTE: reproduce with: ant test -Dtestcase=MBeansHandlerTest -Dtests.method=testDiff -Dtests.seed=92E3B00F43178456 -Dtests.slow=true -Dtests.locale=ro -Dtests.timezone=America/Dawson -Dtests.asserts=true -Dtests.file.encoding=ISO-8859-1
[junit4] FAILURE 0.10s J1 | MBeansHandlerTest.testDiff <<<
[junit4] > Throwable #1: org.junit.ComparisonFailure: expected:<Was: [1, Now: 2], Delta: 1> but was:<Was: [4, Now: 5], Delta: 1>
[junit4] > at __randomizedtesting.SeedInfo.seed([92E3B00F43178456:57F5749453A1BC36]:0)
[junit4] > at org.apache.solr.handler.admin.MBeansHandlerTest.testDiff(MBeansHandlerTest.java:63)
[junit4] > at java.lang.Thread.run(Thread.java:745)
[junit4] 2> 928665 INFO (TEST-MBeansHandlerTest.testXMLDiffWithExternalEntity-seed#[92E3B00F43178456]) [ ] o.a.s.SolrTestCaseJ4 ###Starting testXMLDiffWithExternalEntity
[junit4] 2> 928760 INFO (TEST-MBeansHandlerTest.testXMLDiffWithExternalEntity-seed#[92E3B00F43178456]) [ ] o.a.s.SolrTestCaseJ4 ###Ending testXMLDiffWithExternalEntity
[junit4] 2> 928761 INFO (SUITE-MBeansHandlerTest-seed#[92E3B00F43178456]-worker) [ ] o.a.s.SolrTestCaseJ4 ###deleteCore
[junit4] 2> 928761 INFO (SUITE-MBeansHandlerTest-seed#[92E3B00F43178456]-worker) [ ] o.a.s.c.CoreContainer Shutting down CoreContainer instance=6739869
[junit4] 2> 928761 INFO (coreCloseExecutor-2188-thread-1) [ x:collection1] o.a.s.c.SolrCore [collection1] CLOSING SolrCore org.apache.solr.core.SolrCore@11e86f5
[junit4] 2> 928830 INFO (coreCloseExecutor-2188-thread-1) [ x:collection1] o.a.s.m.SolrMetricManager Closing metric reporters for: solr.core.collection1
[junit4] 2> 928834 INFO (SUITE-MBeansHandlerTest-seed#[92E3B00F43178456]-worker) [ ] o.a.s.m.SolrMetricManager Closing metric reporters for: solr.node
[junit4] 2> NOTE: leaving temporary files on disk at: C:\Users\jenkins\workspace\Lucene-Solr-6.x-Windows\solr\build\solr-core\test\J1\temp\solr.handler.admin.MBeansHandlerTest_92E3B00F43178456-001
[junit4] 2> NOTE: test params are: codec=HighCompressionCompressingStoredFields(storedFieldsFormat=CompressingStoredFieldsFormat(compressionMode=HIGH_COMPRESSION, chunkSize=10, maxDocsPerChunk=436, blockSize=8), termVectorsFormat=CompressingTermVectorsFormat(compressionMode=HIGH_COMPRESSION, chunkSize=10, blockSize=8)), sim=RandomSimilarity(queryNorm=false,coord=crazy): {}, locale=ro, timezone=America/Dawson
[junit4] 2> NOTE: Windows 10 10.0 x86/Oracle Corporation 1.8.0_121 (32-bit)/cpus=3,threads=1,free=184164624,total=472907776
[junit4] 2> NOTE: All tests run in this JVM: [TestDistributedMissingSort, AddSchemaFieldsUpdateProcessorFactoryTest, AnalyticsMergeStrategyTest, TestClusterProperties, TestSchemaManager, TestDocTermOrds, CircularListTest, TestSystemIdResolver, MetricUtilsTest, RequestLoggingTest, CoreAdminHandlerTest, TestSSLRandomization, ConvertedLegacyTest, QueryParsingTest, BasicFunctionalityTest, LeaderFailoverAfterPartitionTest, PeerSyncWithIndexFingerprintCachingTest, TestSolr4Spatial, TestJmxMonitoredMap, TestSolrConfigHandlerConcurrent, CdcrUpdateLogTest, TestXmlQParser, UUIDUpdateProcessorFallbackTest, TestConfigSetProperties, ClassificationUpdateProcessorTest, TestSQLHandlerNonCloud, TestLegacyFieldCache, BlockJoinFacetSimpleTest, NotRequiredUniqueKeyTest, TestRawTransformer, TestQuerySenderListener, TestAtomicUpdateErrorCases, SecurityConfHandlerTest, SolrGraphiteReporterTest, TestJsonFacetRefinement, TestCodecSupport, HttpPartitionTest, CacheHeaderTest, TestNRTOpen, ConcurrentDeleteAndCreateCollectionTest, TestSchemaResource, LukeRequestHandlerTest, SaslZkACLProviderTest, TestDistribIDF, TestSlowCompositeReaderWrapper, MigrateRouteKeyTest, TestJoin, TestRandomFlRTGCloud, BinaryUpdateRequestHandlerTest, CollectionsAPIDistributedZkTest, InfoHandlerTest, CoreSorterTest, HdfsRecoverLeaseTest, HdfsRestartWhileUpdatingTest, CursorMarkTest, DistributedQueueTest, HdfsThreadLeakTest, PreAnalyzedFieldManagedSchemaCloudTest, TestShardHandlerFactory, PeerSyncReplicationTest, TestCollapseQParserPlugin, AutoCommitTest, TestAddFieldRealTimeGet, WordBreakSolrSpellCheckerTest, LeaderElectionIntegrationTest, TestDownShardTolerantSearch, ChaosMonkeySafeLeaderTest, SliceStateTest, TestCoreAdminApis, JsonValidatorTest, DistributedFacetPivotWhiteBoxTest, TestLMJelinekMercerSimilarityFactory, TestCrossCoreJoin, MBeansHandlerTest]
[junit4] Completed [170/690 (1!)] on J1 in 1.35s, 3 tests, 1 failure <<< FAILURES!
[...truncated 56387 lines...]
[JENKINS] Lucene-Solr-6.x-Windows (32bit/jdk1.8.0_121) - Build #
715 - Still Unstable!
Posted by Policeman Jenkins Server <je...@thetaphi.de>.
Build: https://jenkins.thetaphi.de/job/Lucene-Solr-6.x-Windows/715/
Java: 32bit/jdk1.8.0_121 -server -XX:+UseSerialGC
1 tests failed.
FAILED: org.apache.solr.handler.admin.MBeansHandlerTest.testDiff
Error Message:
expected:<Was: [1, Now: 2], Delta: 1> but was:<Was: [4, Now: 5], Delta: 1>
Stack Trace:
org.junit.ComparisonFailure: expected:<Was: [1, Now: 2], Delta: 1> but was:<Was: [4, Now: 5], Delta: 1>
at __randomizedtesting.SeedInfo.seed([54C2D8E813518DCD:91D41C7303E7B5AD]:0)
at org.junit.Assert.assertEquals(Assert.java:125)
at org.junit.Assert.assertEquals(Assert.java:147)
at org.apache.solr.handler.admin.MBeansHandlerTest.testDiff(MBeansHandlerTest.java:63)
at sun.reflect.NativeMethodAccessorImpl.invoke0(Native Method)
at sun.reflect.NativeMethodAccessorImpl.invoke(NativeMethodAccessorImpl.java:62)
at sun.reflect.DelegatingMethodAccessorImpl.invoke(DelegatingMethodAccessorImpl.java:43)
at java.lang.reflect.Method.invoke(Method.java:498)
at com.carrotsearch.randomizedtesting.RandomizedRunner.invoke(RandomizedRunner.java:1713)
at com.carrotsearch.randomizedtesting.RandomizedRunner$8.evaluate(RandomizedRunner.java:907)
at com.carrotsearch.randomizedtesting.RandomizedRunner$9.evaluate(RandomizedRunner.java:943)
at com.carrotsearch.randomizedtesting.RandomizedRunner$10.evaluate(RandomizedRunner.java:957)
at com.carrotsearch.randomizedtesting.rules.SystemPropertiesRestoreRule$1.evaluate(SystemPropertiesRestoreRule.java:57)
at org.apache.lucene.util.TestRuleSetupTeardownChained$1.evaluate(TestRuleSetupTeardownChained.java:49)
at org.apache.lucene.util.AbstractBeforeAfterRule$1.evaluate(AbstractBeforeAfterRule.java:45)
at org.apache.lucene.util.TestRuleThreadAndTestName$1.evaluate(TestRuleThreadAndTestName.java:48)
at org.apache.lucene.util.TestRuleIgnoreAfterMaxFailures$1.evaluate(TestRuleIgnoreAfterMaxFailures.java:64)
at org.apache.lucene.util.TestRuleMarkFailure$1.evaluate(TestRuleMarkFailure.java:47)
at com.carrotsearch.randomizedtesting.rules.StatementAdapter.evaluate(StatementAdapter.java:36)
at com.carrotsearch.randomizedtesting.ThreadLeakControl$StatementRunner.run(ThreadLeakControl.java:368)
at com.carrotsearch.randomizedtesting.ThreadLeakControl.forkTimeoutingTask(ThreadLeakControl.java:817)
at com.carrotsearch.randomizedtesting.ThreadLeakControl$3.evaluate(ThreadLeakControl.java:468)
at com.carrotsearch.randomizedtesting.RandomizedRunner.runSingleTest(RandomizedRunner.java:916)
at com.carrotsearch.randomizedtesting.RandomizedRunner$5.evaluate(RandomizedRunner.java:802)
at com.carrotsearch.randomizedtesting.RandomizedRunner$6.evaluate(RandomizedRunner.java:852)
at com.carrotsearch.randomizedtesting.RandomizedRunner$7.evaluate(RandomizedRunner.java:863)
at com.carrotsearch.randomizedtesting.rules.StatementAdapter.evaluate(StatementAdapter.java:36)
at com.carrotsearch.randomizedtesting.rules.SystemPropertiesRestoreRule$1.evaluate(SystemPropertiesRestoreRule.java:57)
at org.apache.lucene.util.AbstractBeforeAfterRule$1.evaluate(AbstractBeforeAfterRule.java:45)
at com.carrotsearch.randomizedtesting.rules.StatementAdapter.evaluate(StatementAdapter.java:36)
at org.apache.lucene.util.TestRuleStoreClassName$1.evaluate(TestRuleStoreClassName.java:41)
at com.carrotsearch.randomizedtesting.rules.NoShadowingOrOverridesOnMethodsRule$1.evaluate(NoShadowingOrOverridesOnMethodsRule.java:40)
at com.carrotsearch.randomizedtesting.rules.NoShadowingOrOverridesOnMethodsRule$1.evaluate(NoShadowingOrOverridesOnMethodsRule.java:40)
at com.carrotsearch.randomizedtesting.rules.StatementAdapter.evaluate(StatementAdapter.java:36)
at com.carrotsearch.randomizedtesting.rules.StatementAdapter.evaluate(StatementAdapter.java:36)
at com.carrotsearch.randomizedtesting.rules.StatementAdapter.evaluate(StatementAdapter.java:36)
at org.apache.lucene.util.TestRuleAssertionsRequired$1.evaluate(TestRuleAssertionsRequired.java:53)
at org.apache.lucene.util.TestRuleMarkFailure$1.evaluate(TestRuleMarkFailure.java:47)
at org.apache.lucene.util.TestRuleIgnoreAfterMaxFailures$1.evaluate(TestRuleIgnoreAfterMaxFailures.java:64)
at org.apache.lucene.util.TestRuleIgnoreTestSuites$1.evaluate(TestRuleIgnoreTestSuites.java:54)
at com.carrotsearch.randomizedtesting.rules.StatementAdapter.evaluate(StatementAdapter.java:36)
at com.carrotsearch.randomizedtesting.ThreadLeakControl$StatementRunner.run(ThreadLeakControl.java:368)
at java.lang.Thread.run(Thread.java:745)
Build Log:
[...truncated 11233 lines...]
[junit4] Suite: org.apache.solr.handler.admin.MBeansHandlerTest
[junit4] 2> Creating dataDir: C:\Users\jenkins\workspace\Lucene-Solr-6.x-Windows\solr\build\solr-core\test\J1\temp\solr.handler.admin.MBeansHandlerTest_54C2D8E813518DCD-001\init-core-data-001
[junit4] 2> 458877 INFO (SUITE-MBeansHandlerTest-seed#[54C2D8E813518DCD]-worker) [ ] o.a.s.SolrTestCaseJ4 Randomized ssl (false) and clientAuth (true) via: @org.apache.solr.util.RandomizeSSL(reason=, value=NaN, ssl=NaN, clientAuth=NaN)
[junit4] 2> 458878 INFO (SUITE-MBeansHandlerTest-seed#[54C2D8E813518DCD]-worker) [ ] o.a.s.SolrTestCaseJ4 ####initCore
[junit4] 2> 458881 INFO (SUITE-MBeansHandlerTest-seed#[54C2D8E813518DCD]-worker) [ ] o.a.s.c.SolrResourceLoader [null] Added 2 libs to classloader, from paths: [/C:/Users/jenkins/workspace/Lucene-Solr-6.x-Windows/solr/core/src/test-files/solr/collection1/lib, /C:/Users/jenkins/workspace/Lucene-Solr-6.x-Windows/solr/core/src/test-files/solr/collection1/lib/classes]
[junit4] 2> 458999 INFO (SUITE-MBeansHandlerTest-seed#[54C2D8E813518DCD]-worker) [ ] o.a.s.c.SolrConfig Using Lucene MatchVersion: 6.5.0
[junit4] 2> 459036 INFO (SUITE-MBeansHandlerTest-seed#[54C2D8E813518DCD]-worker) [ ] o.a.s.s.IndexSchema [null] Schema name=test
[junit4] 2> 459222 WARN (SUITE-MBeansHandlerTest-seed#[54C2D8E813518DCD]-worker) [ ] o.a.s.s.IndexSchema [null] default search field in schema is text. WARNING: Deprecated, please use 'df' on request instead.
[junit4] 2> 459232 INFO (SUITE-MBeansHandlerTest-seed#[54C2D8E813518DCD]-worker) [ ] o.a.s.s.IndexSchema Loaded schema test/1.0 with uniqueid field id
[junit4] 2> 459256 INFO (SUITE-MBeansHandlerTest-seed#[54C2D8E813518DCD]-worker) [ ] o.a.s.u.UpdateShardHandler Creating UpdateShardHandler HTTP client with params: socketTimeout=30000&connTimeout=30000&retry=true
[junit4] 2> 459436 WARN (SUITE-MBeansHandlerTest-seed#[54C2D8E813518DCD]-worker) [ ] o.a.s.m.r.SolrJmxReporter No serviceUrl or agentId was configured, using first MBeanServer.
[junit4] 2> 459439 INFO (SUITE-MBeansHandlerTest-seed#[54C2D8E813518DCD]-worker) [ ] o.a.s.m.r.SolrJmxReporter JMX monitoring enabled at server: com.sun.jmx.mbeanserver.JmxMBeanServer@486d50
[junit4] 2> 459439 WARN (SUITE-MBeansHandlerTest-seed#[54C2D8E813518DCD]-worker) [ ] o.a.s.m.r.SolrJmxReporter No serviceUrl or agentId was configured, using first MBeanServer.
[junit4] 2> 459442 INFO (SUITE-MBeansHandlerTest-seed#[54C2D8E813518DCD]-worker) [ ] o.a.s.m.r.SolrJmxReporter JMX monitoring enabled at server: com.sun.jmx.mbeanserver.JmxMBeanServer@486d50
[junit4] 2> 459442 WARN (SUITE-MBeansHandlerTest-seed#[54C2D8E813518DCD]-worker) [ ] o.a.s.m.r.SolrJmxReporter No serviceUrl or agentId was configured, using first MBeanServer.
[junit4] 2> 459443 INFO (SUITE-MBeansHandlerTest-seed#[54C2D8E813518DCD]-worker) [ ] o.a.s.m.r.SolrJmxReporter JMX monitoring enabled at server: com.sun.jmx.mbeanserver.JmxMBeanServer@486d50
[junit4] 2> 459511 INFO (coreLoadExecutor-1233-thread-1) [ x:collection1] o.a.s.c.SolrResourceLoader [null] Added 2 libs to classloader, from paths: [/C:/Users/jenkins/workspace/Lucene-Solr-6.x-Windows/solr/core/src/test-files/solr/collection1/lib, /C:/Users/jenkins/workspace/Lucene-Solr-6.x-Windows/solr/core/src/test-files/solr/collection1/lib/classes]
[junit4] 2> 459617 INFO (coreLoadExecutor-1233-thread-1) [ x:collection1] o.a.s.c.SolrConfig Using Lucene MatchVersion: 6.5.0
[junit4] 2> 459680 INFO (coreLoadExecutor-1233-thread-1) [ x:collection1] o.a.s.s.IndexSchema [collection1] Schema name=test
[junit4] 2> 459793 WARN (coreLoadExecutor-1233-thread-1) [ x:collection1] o.a.s.s.IndexSchema [collection1] default search field in schema is text. WARNING: Deprecated, please use 'df' on request instead.
[junit4] 2> 459797 INFO (coreLoadExecutor-1233-thread-1) [ x:collection1] o.a.s.s.IndexSchema Loaded schema test/1.0 with uniqueid field id
[junit4] 2> 459853 INFO (coreLoadExecutor-1233-thread-1) [ x:collection1] o.a.s.c.CoreContainer Creating SolrCore 'collection1' using configuration from instancedir C:\Users\jenkins\workspace\Lucene-Solr-6.x-Windows\solr\core\src\test-files\solr\collection1
[junit4] 2> 459853 WARN (coreLoadExecutor-1233-thread-1) [ x:collection1] o.a.s.m.r.SolrJmxReporter No serviceUrl or agentId was configured, using first MBeanServer.
[junit4] 2> 459853 INFO (coreLoadExecutor-1233-thread-1) [ x:collection1] o.a.s.m.r.SolrJmxReporter JMX monitoring enabled at server: com.sun.jmx.mbeanserver.JmxMBeanServer@486d50
[junit4] 2> 459854 INFO (coreLoadExecutor-1233-thread-1) [ x:collection1] o.a.s.c.SolrCore [[collection1] ] Opening new SolrCore at [C:\Users\jenkins\workspace\Lucene-Solr-6.x-Windows\solr\core\src\test-files\solr\collection1], dataDir=[C:\Users\jenkins\workspace\Lucene-Solr-6.x-Windows\solr\build\solr-core\test\J1\temp\solr.handler.admin.MBeansHandlerTest_54C2D8E813518DCD-001\init-core-data-001\]
[junit4] 2> 459854 INFO (coreLoadExecutor-1233-thread-1) [ x:collection1] o.a.s.c.JmxMonitoredMap JMX monitoring is enabled. Adding Solr mbeans to JMX Server: com.sun.jmx.mbeanserver.JmxMBeanServer@486d50
[junit4] 2> 459856 INFO (coreLoadExecutor-1233-thread-1) [ x:collection1] o.a.s.u.RandomMergePolicy RandomMergePolicy wrapping class org.apache.lucene.index.TieredMergePolicy: [TieredMergePolicy: maxMergeAtOnce=12, maxMergeAtOnceExplicit=25, maxMergedSegmentMB=4.240234375, floorSegmentMB=2.15625, forceMergeDeletesPctAllowed=28.650799959984845, segmentsPerTier=31.0, maxCFSSegmentSizeMB=8.796093022207999E12, noCFSRatio=0.18807088358010962
[junit4] 2> 460001 INFO (coreLoadExecutor-1233-thread-1) [ x:collection1] o.a.s.u.UpdateHandler Using UpdateLog implementation: org.apache.solr.update.UpdateLog
[junit4] 2> 460001 INFO (coreLoadExecutor-1233-thread-1) [ x:collection1] o.a.s.u.UpdateLog Initializing UpdateLog: dataDir= defaultSyncLevel=FLUSH numRecordsToKeep=100 maxNumLogsToKeep=10 numVersionBuckets=65536
[junit4] 2> 460003 INFO (coreLoadExecutor-1233-thread-1) [ x:collection1] o.a.s.u.CommitTracker Hard AutoCommit: disabled
[junit4] 2> 460003 INFO (coreLoadExecutor-1233-thread-1) [ x:collection1] o.a.s.u.CommitTracker Soft AutoCommit: disabled
[junit4] 2> 460005 INFO (coreLoadExecutor-1233-thread-1) [ x:collection1] o.a.s.u.RandomMergePolicy RandomMergePolicy wrapping class org.apache.lucene.index.AlcoholicMergePolicy: [AlcoholicMergePolicy: minMergeSize=0, mergeFactor=10, maxMergeSize=1041453003, maxMergeSizeForForcedMerge=9223372036854775807, calibrateSizeByDeletes=true, maxMergeDocs=2147483647, maxCFSSegmentSizeMB=8.796093022207999E12, noCFSRatio=0.1]
[junit4] 2> 460006 INFO (coreLoadExecutor-1233-thread-1) [ x:collection1] o.a.s.s.SolrIndexSearcher Opening [Searcher@8038e9[collection1] main]
[junit4] 2> 460007 INFO (coreLoadExecutor-1233-thread-1) [ x:collection1] o.a.s.h.c.SpellCheckComponent Initializing spell checkers
[junit4] 2> 460024 INFO (coreLoadExecutor-1233-thread-1) [ x:collection1] o.a.s.s.DirectSolrSpellChecker init: {name=direct,classname=DirectSolrSpellChecker,field=lowerfilt,minQueryLength=3}
[junit4] 2> 460082 INFO (coreLoadExecutor-1233-thread-1) [ x:collection1] o.a.s.h.ReplicationHandler Commits will be reserved for 10000
[junit4] 2> 460083 INFO (searcherExecutor-1234-thread-1-processing-x:collection1) [ x:collection1] o.a.s.h.c.SpellCheckComponent Loading spell index for spellchecker: default
[junit4] 2> 460084 INFO (searcherExecutor-1234-thread-1-processing-x:collection1) [ x:collection1] o.a.s.h.c.SpellCheckComponent Loading spell index for spellchecker: direct
[junit4] 2> 460084 INFO (searcherExecutor-1234-thread-1-processing-x:collection1) [ x:collection1] o.a.s.h.c.SpellCheckComponent Loading spell index for spellchecker: wordbreak
[junit4] 2> 460084 INFO (searcherExecutor-1234-thread-1-processing-x:collection1) [ x:collection1] o.a.s.h.c.SpellCheckComponent Loading spell index for spellchecker: multipleFields
[junit4] 2> 460085 INFO (searcherExecutor-1234-thread-1-processing-x:collection1) [ x:collection1] o.a.s.h.c.SpellCheckComponent Loading spell index for spellchecker: jarowinkler
[junit4] 2> 460085 INFO (searcherExecutor-1234-thread-1-processing-x:collection1) [ x:collection1] o.a.s.h.c.SpellCheckComponent Loading spell index for spellchecker: external
[junit4] 2> 460086 INFO (searcherExecutor-1234-thread-1-processing-x:collection1) [ x:collection1] o.a.s.h.c.SpellCheckComponent Loading spell index for spellchecker: freq
[junit4] 2> 460086 INFO (searcherExecutor-1234-thread-1-processing-x:collection1) [ x:collection1] o.a.s.h.c.SpellCheckComponent Loading spell index for spellchecker: fqcn
[junit4] 2> 460087 INFO (searcherExecutor-1234-thread-1-processing-x:collection1) [ x:collection1] o.a.s.h.c.SpellCheckComponent Loading spell index for spellchecker: perDict
[junit4] 2> 460089 INFO (searcherExecutor-1234-thread-1-processing-x:collection1) [ x:collection1] o.a.s.c.SolrCore [collection1] Registered new searcher Searcher@8038e9[collection1] main{ExitableDirectoryReader(UninvertingDirectoryReader())}
[junit4] 2> 460091 INFO (coreLoadExecutor-1233-thread-1) [ x:collection1] o.a.s.u.UpdateLog Could not find max version in index or recent updates, using new clock 1558733911404576768
[junit4] 2> 460106 INFO (SUITE-MBeansHandlerTest-seed#[54C2D8E813518DCD]-worker) [ ] o.a.s.SolrTestCaseJ4 ####initCore end
[junit4] 2> 460108 INFO (TEST-MBeansHandlerTest.testBackCompatNames-seed#[54C2D8E813518DCD]) [ ] o.a.s.SolrTestCaseJ4 ###Starting testBackCompatNames
[junit4] 2> 460110 INFO (TEST-MBeansHandlerTest.testBackCompatNames-seed#[54C2D8E813518DCD]) [ ] o.a.s.c.S.Request [collection1] webapp=null path=null params={qt=/admin/mbeans&wt=xml} status=0 QTime=0
[junit4] 2> 460124 INFO (TEST-MBeansHandlerTest.testBackCompatNames-seed#[54C2D8E813518DCD]) [ ] o.a.s.c.S.Request [collection1] webapp=null path=null params={qt=/admin/mbeans&cat=QUERYHANDLER&wt=xml} status=0 QTime=0
[junit4] 2> 460125 INFO (TEST-MBeansHandlerTest.testBackCompatNames-seed#[54C2D8E813518DCD]) [ ] o.a.s.c.S.Request [collection1] webapp=null path=null params={qt=/admin/mbeans&cat=UPDATE&wt=xml} status=0 QTime=0
[junit4] 2> 460125 INFO (TEST-MBeansHandlerTest.testBackCompatNames-seed#[54C2D8E813518DCD]) [ ] o.a.s.SolrTestCaseJ4 ###Ending testBackCompatNames
[junit4] 2> 460127 INFO (TEST-MBeansHandlerTest.testDiff-seed#[54C2D8E813518DCD]) [ ] o.a.s.SolrTestCaseJ4 ###Starting testDiff
[junit4] 2> 460129 INFO (TEST-MBeansHandlerTest.testDiff-seed#[54C2D8E813518DCD]) [ ] o.a.s.c.S.Request [collection1] webapp=null path=null params={qt=/admin/mbeans&stats=true&wt=xml} status=0 QTime=1
[junit4] 2> 460139 INFO (TEST-MBeansHandlerTest.testDiff-seed#[54C2D8E813518DCD]) [ ] o.a.s.c.S.Request [collection1] webapp=null path=null params={qt=/admin/mbeans&stats=true&diff=true&wt=xml} status=0 QTime=6
[junit4] 2> 460140 INFO (TEST-MBeansHandlerTest.testDiff-seed#[54C2D8E813518DCD]) [ ] o.a.s.SolrTestCaseJ4 ###Ending testDiff
[junit4] 2> NOTE: reproduce with: ant test -Dtestcase=MBeansHandlerTest -Dtests.method=testDiff -Dtests.seed=54C2D8E813518DCD -Dtests.slow=true -Dtests.locale=en-ZA -Dtests.timezone=America/Whitehorse -Dtests.asserts=true -Dtests.file.encoding=Cp1252
[junit4] FAILURE 0.02s J1 | MBeansHandlerTest.testDiff <<<
[junit4] > Throwable #1: org.junit.ComparisonFailure: expected:<Was: [1, Now: 2], Delta: 1> but was:<Was: [4, Now: 5], Delta: 1>
[junit4] > at __randomizedtesting.SeedInfo.seed([54C2D8E813518DCD:91D41C7303E7B5AD]:0)
[junit4] > at org.apache.solr.handler.admin.MBeansHandlerTest.testDiff(MBeansHandlerTest.java:63)
[junit4] > at java.lang.Thread.run(Thread.java:745)
[junit4] 2> 460149 INFO (TEST-MBeansHandlerTest.testXMLDiffWithExternalEntity-seed#[54C2D8E813518DCD]) [ ] o.a.s.SolrTestCaseJ4 ###Starting testXMLDiffWithExternalEntity
[junit4] 2> 460256 INFO (TEST-MBeansHandlerTest.testXMLDiffWithExternalEntity-seed#[54C2D8E813518DCD]) [ ] o.a.s.SolrTestCaseJ4 ###Ending testXMLDiffWithExternalEntity
[junit4] 2> 460257 INFO (SUITE-MBeansHandlerTest-seed#[54C2D8E813518DCD]-worker) [ ] o.a.s.SolrTestCaseJ4 ###deleteCore
[junit4] 2> 460257 INFO (SUITE-MBeansHandlerTest-seed#[54C2D8E813518DCD]-worker) [ ] o.a.s.c.CoreContainer Shutting down CoreContainer instance=31820476
[junit4] 2> 460257 INFO (coreCloseExecutor-1239-thread-1) [ x:collection1] o.a.s.c.SolrCore [collection1] CLOSING SolrCore org.apache.solr.core.SolrCore@167a016
[junit4] 2> 460314 INFO (coreCloseExecutor-1239-thread-1) [ x:collection1] o.a.s.m.SolrMetricManager Closing metric reporters for: solr.core.collection1
[junit4] 2> 460318 INFO (SUITE-MBeansHandlerTest-seed#[54C2D8E813518DCD]-worker) [ ] o.a.s.m.SolrMetricManager Closing metric reporters for: solr.node
[junit4] 2> NOTE: leaving temporary files on disk at: C:\Users\jenkins\workspace\Lucene-Solr-6.x-Windows\solr\build\solr-core\test\J1\temp\solr.handler.admin.MBeansHandlerTest_54C2D8E813518DCD-001
[junit4] 2> NOTE: test params are: codec=Asserting(Lucene62): {}, docValues:{}, maxPointsInLeafNode=1612, maxMBSortInHeap=5.944045798879608, sim=RandomSimilarity(queryNorm=false,coord=yes): {}, locale=en-ZA, timezone=America/Whitehorse
[junit4] 2> NOTE: Windows 10 10.0 x86/Oracle Corporation 1.8.0_121 (32-bit)/cpus=3,threads=1,free=93969840,total=217174016
[junit4] 2> NOTE: All tests run in this JVM: [TestTestInjection, TestLeaderElectionZkExpiry, SharedFSAutoReplicaFailoverTest, AssignTest, HighlighterMaxOffsetTest, TestRandomFaceting, StressHdfsTest, TestQuerySenderNoQuery, FieldAnalysisRequestHandlerTest, TestQuerySenderListener, HdfsRestartWhileUpdatingTest, TestJoin, TestIndexingPerformance, DocExpirationUpdateProcessorFactoryTest, HdfsBasicDistributedZk2Test, ConcurrentDeleteAndCreateCollectionTest, TestFieldSortValues, SuggesterTSTTest, HdfsUnloadDistributedZkTest, TestDistributedGrouping, LukeRequestHandlerTest, CollectionsAPIDistributedZkTest, FieldMutatingUpdateProcessorTest, TestComplexPhraseQParserPlugin, BlockJoinFacetSimpleTest, StatsReloadRaceTest, TestSolrQueryParser, UpdateRequestProcessorFactoryTest, TestSimpleQParserPlugin, SpellPossibilityIteratorTest, TestSolrDeletionPolicy2, TestPushWriter, JvmMetricsTest, SolrMetricManagerTest, TestDynamicFieldResource, TestReRankQParserPlugin, FacetPivotSmallTest, RemoteQueryErrorTest, SuggesterTest, SuggestComponentTest, PreAnalyzedFieldTest, TestHighFrequencyDictionaryFactory, SpellCheckComponentTest, CopyFieldTest, TestManagedSchemaAPI, SecurityConfHandlerTest, DistributedTermsComponentTest, UUIDUpdateProcessorFallbackTest, TestSolrCloudWithSecureImpersonation, DistributedFacetPivotLargeTest, HdfsRecoverLeaseTest, TestDFRSimilarityFactory, TestSolrCloudWithHadoopAuthPlugin, MBeansHandlerTest]
[junit4] Completed [123/690 (1!)] on J1 in 1.49s, 3 tests, 1 failure <<< FAILURES!
[...truncated 56589 lines...]