You are viewing a plain text version of this content. The canonical link for it is here.
Posted to builds@solr.apache.org by Apache Jenkins Server <je...@builds.apache.org> on 2026/10/15 09:25:40 UTC

[JENKINS] Solr » Solr-Lint-9.x - Build # 699 - Still Failing!

Build: https://ci-builds.apache.org/job/Solr/job/Solr-Lint-9.x/699/

No tests ran.

Build Log:
[...truncated 1617 lines...]
BUILD FAILED in 11m 38s
649 actionable tasks: 649 executed

Publishing build scan...

The Develocity server (develocity.apache.org) rejected the access key with prefix '7x3jzizm4zpygv7psbkg6byvm4'.
Your credential has expired.

Build step 'Invoke Gradle script' changed build result to FAILURE
Build step 'Invoke Gradle script' marked build as failure
Email was triggered for: Failure - Any
Sending email for trigger: Failure - Any

[JENKINS] Solr » Solr-Lint-9.x - Build # 703 - Still Failing!

Posted by Apache Jenkins Server <je...@builds.apache.org>.
Build: https://ci-builds.apache.org/job/Solr/job/Solr-Lint-9.x/703/

No tests ran.

Build Log:
[...truncated 1680 lines...]
BUILD FAILED in 10m 55s
649 actionable tasks: 649 executed

Publishing build scan...
https://develocity.apache.org/s/fbunvclzvhg7e

Build step 'Invoke Gradle script' changed build result to FAILURE
Build step 'Invoke Gradle script' marked build as failure
Email was triggered for: Failure - Any
Sending email for trigger: Failure - Any

[JENKINS] Solr » Solr-Lint-9.x - Build # 702 - Still Failing!

Posted by Apache Jenkins Server <je...@builds.apache.org>.
Build: https://ci-builds.apache.org/job/Solr/job/Solr-Lint-9.x/702/

No tests ran.

Build Log:
[...truncated 1617 lines...]
BUILD FAILED in 10m 48s
649 actionable tasks: 649 executed

Publishing build scan...
https://develocity.apache.org/s/emey4la6i7j6w

Build step 'Invoke Gradle script' changed build result to FAILURE
Build step 'Invoke Gradle script' marked build as failure
Email was triggered for: Failure - Any
Sending email for trigger: Failure - Any

[JENKINS] Solr » Solr-Lint-9.x - Build # 701 - Still Failing!

Posted by Apache Jenkins Server <je...@builds.apache.org>.
Build: https://ci-builds.apache.org/job/Solr/job/Solr-Lint-9.x/701/

No tests ran.

Build Log:
[...truncated 1618 lines...]
BUILD FAILED in 11m 9s
649 actionable tasks: 649 executed

Publishing build scan...

The Develocity server (develocity.apache.org) rejected the access key with prefix '7x3jzizm4zpygv7psbkg6byvm4'.
Your credential has expired.

Build step 'Invoke Gradle script' changed build result to FAILURE
Build step 'Invoke Gradle script' marked build as failure
Email was triggered for: Failure - Any
Sending email for trigger: Failure - Any

[JENKINS] Solr » Solr-Lint-9.x - Build # 700 - Still Failing!

Posted by Apache Jenkins Server <je...@builds.apache.org>.
Build: https://ci-builds.apache.org/job/Solr/job/Solr-Lint-9.x/700/

No tests ran.

Build Log:
[...truncated 1679 lines...]
BUILD FAILED in 11m 12s
649 actionable tasks: 649 executed

Publishing build scan...

The Develocity server (develocity.apache.org) rejected the access key with prefix '7x3jzizm4zpygv7psbkg6byvm4'.
Your credential has expired.

Build step 'Invoke Gradle script' changed build result to FAILURE
Build step 'Invoke Gradle script' marked build as failure
Email was triggered for: Failure - Any
Sending email for trigger: Failure - Any