You are viewing a plain text version of this content. The canonical link for it is here.
Posted to builds@beam.apache.org by Apache Jenkins Server <je...@builds.apache.org> on 2022/03/06 18:10:46 UTC
Build failed in Jenkins: beam_PostCommit_Python_Examples_Flink #108
See <https://ci-beam.apache.org/job/beam_PostCommit_Python_Examples_Flink/108/display/redirect>
Changes:
------------------------------------------
[...truncated 55.22 KB...]
Collecting google-cloud-vision<2,>=0.38.0
Using cached google_cloud_vision-1.0.0-py2.py3-none-any.whl (435 kB)
Collecting google-cloud-recommendations-ai<=0.2.0,>=0.1.0
Using cached google_cloud_recommendations_ai-0.2.0-py2.py3-none-any.whl (180 kB)
Collecting boto3>=1.9
Using cached boto3-1.21.13-py3-none-any.whl (132 kB)
Requirement already satisfied: six>=1.11.0 in <https://ci-beam.apache.org/job/beam_PostCommit_Python_Examples_Flink/ws/src/build/gradleenv/2022703443/lib/python3.9/site-packages> (from azure-core>=1.7.0->apache-beam==2.38.0.dev0) (1.16.0)
Collecting msrest>=0.6.21
Using cached msrest-0.6.21-py2.py3-none-any.whl (85 kB)
Collecting jmespath<1.0.0,>=0.7.1
Using cached jmespath-0.10.0-py2.py3-none-any.whl (24 kB)
Collecting botocore<1.25.0,>=1.24.13
Using cached botocore-1.24.13-py3-none-any.whl (8.6 MB)
Collecting s3transfer<0.6.0,>=0.5.0
Using cached s3transfer-0.5.2-py3-none-any.whl (79 kB)
Collecting cffi>=1.12
Using cached cffi-1.15.0-cp39-cp39-manylinux_2_12_x86_64.manylinux2010_x86_64.whl (444 kB)
Collecting fasteners>=0.14
Using cached fasteners-0.17.3-py3-none-any.whl (18 kB)
Collecting rsa<5,>=3.1.4
Using cached rsa-4.8-py3-none-any.whl (39 kB)
Collecting pyasn1-modules>=0.2.1
Using cached pyasn1_modules-0.2.8-py2.py3-none-any.whl (155 kB)
Collecting google-api-core[grpc]<3.0.0dev,>=1.29.0
Using cached google_api_core-2.6.0-py2.py3-none-any.whl (114 kB)
Collecting google-resumable-media<3.0dev,>=0.6.0
Using cached google_resumable_media-2.3.1-py2.py3-none-any.whl (76 kB)
Requirement already satisfied: packaging>=14.3 in <https://ci-beam.apache.org/job/beam_PostCommit_Python_Examples_Flink/ws/src/build/gradleenv/2022703443/lib/python3.9/site-packages> (from google-cloud-bigquery<3,>=1.6.0->apache-beam==2.38.0.dev0) (21.3)
Collecting grpc-google-iam-v1<0.13dev,>=0.12.3
Using cached grpc_google_iam_v1-0.12.3-py3-none-any.whl
Collecting google-api-core[grpc]<3.0.0dev,>=1.29.0
Using cached google_api_core-1.31.5-py2.py3-none-any.whl (93 kB)
Collecting google-auth<3,>=1.18.0
Using cached google_auth-1.35.0-py2.py3-none-any.whl (152 kB)
Requirement already satisfied: setuptools>=40.3.0 in <https://ci-beam.apache.org/job/beam_PostCommit_Python_Examples_Flink/ws/src/build/gradleenv/2022703443/lib/python3.9/site-packages> (from google-auth<3,>=1.18.0->apache-beam==2.38.0.dev0) (60.9.3)
Collecting grpcio-status>=1.16.0
Using cached grpcio_status-1.44.0-py3-none-any.whl (10.0 kB)
Collecting overrides<7.0.0,>=6.0.1
Using cached overrides-6.1.0-py3-none-any.whl (14 kB)
Collecting docopt
Using cached docopt-0.6.2-py2.py3-none-any.whl
Collecting pyparsing<3,>=2.4.2
Using cached pyparsing-2.4.7-py2.py3-none-any.whl (67 kB)
Collecting pbr>=0.11
Using cached pbr-5.8.1-py2.py3-none-any.whl (113 kB)
Collecting pyasn1>=0.1.7
Using cached pyasn1-0.4.8-py2.py3-none-any.whl (77 kB)
Collecting attrs>=17.4.0
Using cached attrs-21.4.0-py2.py3-none-any.whl (60 kB)
Collecting more-itertools>=4.0.0
Using cached more_itertools-8.12.0-py3-none-any.whl (54 kB)
Collecting atomicwrites>=1.0
Using cached atomicwrites-1.4.0-py2.py3-none-any.whl (6.8 kB)
Collecting wcwidth
Using cached wcwidth-0.2.5-py2.py3-none-any.whl (30 kB)
Collecting pluggy<1.0,>=0.12
Using cached pluggy-0.13.1-py2.py3-none-any.whl (18 kB)
Requirement already satisfied: py>=1.5.0 in <https://ci-beam.apache.org/job/beam_PostCommit_Python_Examples_Flink/ws/src/build/gradleenv/2022703443/lib/python3.9/site-packages> (from pytest<5.0,>=4.4.0->apache-beam==2.38.0.dev0) (1.11.0)
Collecting execnet>=1.1
Using cached execnet-1.9.0-py2.py3-none-any.whl (39 kB)
Collecting pytest-forked
Using cached pytest_forked-1.4.0-py3-none-any.whl (4.9 kB)
Collecting charset-normalizer~=2.0.0
Using cached charset_normalizer-2.0.12-py3-none-any.whl (39 kB)
Collecting urllib3<1.27,>=1.21.1
Using cached urllib3-1.26.8-py2.py3-none-any.whl (138 kB)
Collecting idna<4,>=2.5
Using cached idna-3.3-py3-none-any.whl (61 kB)
Collecting certifi>=2017.4.17
Using cached certifi-2021.10.8-py2.py3-none-any.whl (149 kB)
Collecting greenlet!=0.4.17
Using cached greenlet-1.1.2-cp39-cp39-manylinux_2_17_x86_64.manylinux2014_x86_64.whl (153 kB)
Collecting deprecation
Using cached deprecation-2.1.0-py2.py3-none-any.whl (11 kB)
Collecting wrapt
Using cached wrapt-1.13.3-cp39-cp39-manylinux_2_5_x86_64.manylinux1_x86_64.manylinux_2_12_x86_64.manylinux2010_x86_64.whl (81 kB)
Collecting docker
Using cached docker-5.0.3-py2.py3-none-any.whl (146 kB)
Collecting pymysql
Using cached PyMySQL-1.0.2-py3-none-any.whl (43 kB)
Collecting pycparser
Using cached pycparser-2.21-py2.py3-none-any.whl (118 kB)
Collecting googleapis-common-protos<2.0dev,>=1.6.0
Using cached googleapis_common_protos-1.55.0-py2.py3-none-any.whl (212 kB)
Collecting google-crc32c<2.0dev,>=1.0
Using cached google_crc32c-1.3.0-cp39-cp39-manylinux_2_12_x86_64.manylinux2010_x86_64.whl (36 kB)
Collecting isodate>=0.6.0
Using cached isodate-0.6.1-py2.py3-none-any.whl (41 kB)
Collecting requests-oauthlib>=0.5.0
Using cached requests_oauthlib-1.3.1-py2.py3-none-any.whl (23 kB)
Collecting typing-utils>=0.0.3
Using cached typing_utils-0.1.0-py3-none-any.whl (10 kB)
Collecting websocket-client>=0.32.0
Using cached websocket_client-1.3.1-py3-none-any.whl (54 kB)
> Task :sdks:python:test-suites:portable:py37:installGcpTest
Collecting botocore<1.25.0,>=1.24.13
Using cached botocore-1.24.13-py3-none-any.whl (8.6 MB)
Collecting cffi>=1.12
Using cached cffi-1.15.0-cp37-cp37m-manylinux_2_12_x86_64.manylinux2010_x86_64.whl (427 kB)
Collecting fasteners>=0.14
Using cached fasteners-0.17.3-py3-none-any.whl (18 kB)
Collecting rsa<5,>=3.1.4
Using cached rsa-4.8-py3-none-any.whl (39 kB)
Collecting pyasn1-modules>=0.2.1
Using cached pyasn1_modules-0.2.8-py2.py3-none-any.whl (155 kB)
Collecting google-api-core[grpc]<3.0.0dev,>=1.29.0
Using cached google_api_core-2.6.0-py2.py3-none-any.whl (114 kB)
Collecting google-resumable-media<3.0dev,>=0.6.0
Using cached google_resumable_media-2.3.1-py2.py3-none-any.whl (76 kB)
Requirement already satisfied: packaging>=14.3 in <https://ci-beam.apache.org/job/beam_PostCommit_Python_Examples_Flink/ws/src/build/gradleenv/2022703441/lib/python3.7/site-packages> (from google-cloud-bigquery<3,>=1.6.0->apache-beam==2.38.0.dev0) (21.3)
Collecting grpc-google-iam-v1<0.13dev,>=0.12.3
Using cached grpc_google_iam_v1-0.12.3-py3-none-any.whl
Collecting google-api-core[grpc]<3.0.0dev,>=1.29.0
Using cached google_api_core-1.31.5-py2.py3-none-any.whl (93 kB)
Collecting google-auth<3,>=1.18.0
Using cached google_auth-1.35.0-py2.py3-none-any.whl (152 kB)
Requirement already satisfied: setuptools>=40.3.0 in <https://ci-beam.apache.org/job/beam_PostCommit_Python_Examples_Flink/ws/src/build/gradleenv/2022703441/lib/python3.7/site-packages> (from google-auth<3,>=1.18.0->apache-beam==2.38.0.dev0) (60.9.3)
Collecting grpcio-status>=1.16.0
Using cached grpcio_status-1.44.0-py3-none-any.whl (10.0 kB)
Collecting overrides<7.0.0,>=6.0.1
Using cached overrides-6.1.0-py3-none-any.whl (14 kB)
Collecting docopt
Using cached docopt-0.6.2-py2.py3-none-any.whl
Collecting pyparsing<3,>=2.4.2
Using cached pyparsing-2.4.7-py2.py3-none-any.whl (67 kB)
Collecting pbr>=0.11
Using cached pbr-5.8.1-py2.py3-none-any.whl (113 kB)
Collecting pyasn1>=0.1.7
Using cached pyasn1-0.4.8-py2.py3-none-any.whl (77 kB)
Collecting pluggy<1.0,>=0.12
Using cached pluggy-0.13.1-py2.py3-none-any.whl (18 kB)
Requirement already satisfied: py>=1.5.0 in <https://ci-beam.apache.org/job/beam_PostCommit_Python_Examples_Flink/ws/src/build/gradleenv/2022703441/lib/python3.7/site-packages> (from pytest<5.0,>=4.4.0->apache-beam==2.38.0.dev0) (1.11.0)
Requirement already satisfied: importlib-metadata>=0.12 in <https://ci-beam.apache.org/job/beam_PostCommit_Python_Examples_Flink/ws/src/build/gradleenv/2022703441/lib/python3.7/site-packages> (from pytest<5.0,>=4.4.0->apache-beam==2.38.0.dev0) (2.1.3)
Collecting more-itertools>=4.0.0
Using cached more_itertools-8.12.0-py3-none-any.whl (54 kB)
Collecting atomicwrites>=1.0
Using cached atomicwrites-1.4.0-py2.py3-none-any.whl (6.8 kB)
Collecting wcwidth
Using cached wcwidth-0.2.5-py2.py3-none-any.whl (30 kB)
Collecting attrs>=17.4.0
Using cached attrs-21.4.0-py2.py3-none-any.whl (60 kB)
Collecting pytest-forked
Using cached pytest_forked-1.4.0-py3-none-any.whl (4.9 kB)
Collecting execnet>=1.1
Using cached execnet-1.9.0-py2.py3-none-any.whl (39 kB)
Collecting charset-normalizer~=2.0.0
Using cached charset_normalizer-2.0.12-py3-none-any.whl (39 kB)
Collecting idna<4,>=2.5
Using cached idna-3.3-py3-none-any.whl (61 kB)
Collecting certifi>=2017.4.17
Using cached certifi-2021.10.8-py2.py3-none-any.whl (149 kB)
Collecting urllib3<1.27,>=1.21.1
Using cached urllib3-1.26.8-py2.py3-none-any.whl (138 kB)
Collecting greenlet!=0.4.17
Using cached greenlet-1.1.2-cp37-cp37m-manylinux_2_17_x86_64.manylinux2014_x86_64.whl (150 kB)
Collecting wrapt
Using cached wrapt-1.13.3-cp37-cp37m-manylinux_2_5_x86_64.manylinux1_x86_64.manylinux_2_12_x86_64.manylinux2010_x86_64.whl (79 kB)
Collecting deprecation
Using cached deprecation-2.1.0-py2.py3-none-any.whl (11 kB)
Collecting docker
Using cached docker-5.0.3-py2.py3-none-any.whl (146 kB)
Collecting pymysql
Using cached PyMySQL-1.0.2-py3-none-any.whl (43 kB)
Collecting pycparser
Using cached pycparser-2.21-py2.py3-none-any.whl (118 kB)
Collecting googleapis-common-protos<2.0dev,>=1.6.0
Using cached googleapis_common_protos-1.55.0-py2.py3-none-any.whl (212 kB)
Collecting google-crc32c<2.0dev,>=1.0
Using cached google_crc32c-1.3.0-cp37-cp37m-manylinux_2_12_x86_64.manylinux2010_x86_64.whl (38 kB)
Requirement already satisfied: zipp>=0.5 in <https://ci-beam.apache.org/job/beam_PostCommit_Python_Examples_Flink/ws/src/build/gradleenv/2022703441/lib/python3.7/site-packages> (from importlib-metadata>=0.12->pytest<5.0,>=4.4.0->apache-beam==2.38.0.dev0) (3.7.0)
Collecting requests-oauthlib>=0.5.0
Using cached requests_oauthlib-1.3.1-py2.py3-none-any.whl (23 kB)
Collecting isodate>=0.6.0
Using cached isodate-0.6.1-py2.py3-none-any.whl (41 kB)
Collecting typing-utils>=0.0.3
Using cached typing_utils-0.1.0-py3-none-any.whl (10 kB)
Collecting websocket-client>=0.32.0
Using cached websocket_client-1.3.1-py3-none-any.whl (54 kB)
Collecting oauthlib>=3.0.0
Using cached oauthlib-3.2.0-py3-none-any.whl (151 kB)
Building wheels for collected packages: apache-beam
Building wheel for apache-beam (setup.py): started
Building wheel for apache-beam (setup.py): finished with status 'done'
Created wheel for apache-beam: filename=apache_beam-2.38.0.dev0-py3-none-any.whl size=2680293 sha256=b2b3cfe1754a943eb402f6743eafd247e805d73b1770b0c0047ae2398ca8dbf3
Stored in directory: /home/jenkins/.cache/pip/wheels/10/b4/27/7d96b78e09ec6d19300417526d02da6e93160092b24dd97e0d
Successfully built apache-beam
Installing collected packages: wcwidth, pytz, pyasn1, parameterized, docopt, crcmod, certifi, wrapt, websocket-client, urllib3, typing-utils, typing-extensions, tenacity, rsa, pyyaml, python-dateutil, pyparsing, pymysql, pymongo, pyhamcrest, pycparser, pyasn1-modules, psycopg2-binary, proto-plus, pbr, orjson, oauthlib, numpy, more-itertools, jmespath, isodate, idna, greenlet, googleapis-common-protos, google-crc32c, fasteners, fastavro, execnet, dill, cloudpickle, charset-normalizer, cachetools, attrs, atomicwrites, sqlalchemy, requests, pydot, pyarrow, pluggy, pandas, overrides, mock, httplib2, grpcio-status, grpcio-gcp, google-resumable-media, google-auth, freezegun, cffi, botocore, s3transfer, requests-oauthlib, requests_mock, pytest, oauth2client, hdfs, grpc-google-iam-v1, google-api-core, docker, deprecation, cryptography, azure-core, testcontainers, pytest-timeout, pytest-forked, msrest, google-cloud-core, google-apitools, boto3, apache-beam, pytest-xdist, google-cloud-vision, google-cloud-videointelligence, google-cloud-spanner, google-cloud-recommendations-ai, google-cloud-pubsub, google-cloud-language, google-cloud-dlp, google-cloud-datastore, google-cloud-bigtable, google-cloud-bigquery-storage, google-cloud-bigquery, azure-storage-blob, google-cloud-pubsublite
> Task :sdks:python:test-suites:portable:py39:installGcpTest
Collecting oauthlib>=3.0.0
Using cached oauthlib-3.2.0-py3-none-any.whl (151 kB)
Building wheels for collected packages: apache-beam
Building wheel for apache-beam (setup.py): started
Building wheel for apache-beam (setup.py): finished with status 'done'
Created wheel for apache-beam: filename=apache_beam-2.38.0.dev0-py3-none-any.whl size=2680293 sha256=ea23a829896e3d2310ed937a2e28b572269defd653c01b5481c71af9a670f371
Stored in directory: /home/jenkins/.cache/pip/wheels/22/e3/9e/7f201404104c8b845c1b47985b4fc6dcc0a9e8e4b1d1f30e21
Successfully built apache-beam
Installing collected packages: wcwidth, pytz, pyasn1, parameterized, docopt, crcmod, certifi, wrapt, websocket-client, urllib3, typing-utils, typing-extensions, tenacity, rsa, pyyaml, python-dateutil, pyparsing, pymysql, pymongo, pyhamcrest, pycparser, pyasn1-modules, psycopg2-binary, proto-plus, pluggy, pbr, orjson, oauthlib, numpy, more-itertools, jmespath, isodate, idna, greenlet, googleapis-common-protos, google-crc32c, fasteners, fastavro, execnet, dill, cloudpickle, charset-normalizer, cachetools, attrs, atomicwrites, sqlalchemy, requests, pydot, pyarrow, pandas, overrides, mock, httplib2, grpcio-status, grpcio-gcp, google-resumable-media, google-auth, freezegun, cffi, botocore, s3transfer, requests-oauthlib, requests_mock, pytest, oauth2client, hdfs, grpc-google-iam-v1, google-api-core, docker, deprecation, cryptography, azure-core, testcontainers, pytest-timeout, pytest-forked, msrest, google-cloud-core, google-apitools, boto3, apache-beam, pytest-xdist, google-cloud-vision, google-cloud-videointelligence, google-cloud-spanner, google-cloud-recommendations-ai, google-cloud-pubsub, google-cloud-language, google-cloud-dlp, google-cloud-datastore, google-cloud-bigtable, google-cloud-bigquery-storage, google-cloud-bigquery, azure-storage-blob, google-cloud-pubsublite
Attempting uninstall: pyparsing
Found existing installation: pyparsing 3.0.7
Uninstalling pyparsing-3.0.7:
Successfully uninstalled pyparsing-3.0.7
Attempting uninstall: pluggy
Found existing installation: pluggy 1.0.0
Uninstalling pluggy-1.0.0:
Successfully uninstalled pluggy-1.0.0
> Task :sdks:python:test-suites:portable:py37:installGcpTest
Attempting uninstall: pyparsing
Found existing installation: pyparsing 3.0.7
Uninstalling pyparsing-3.0.7:
Successfully uninstalled pyparsing-3.0.7
Attempting uninstall: pluggy
Found existing installation: pluggy 1.0.0
Uninstalling pluggy-1.0.0:
Successfully uninstalled pluggy-1.0.0
Successfully installed apache-beam-2.38.0.dev0 atomicwrites-1.4.0 attrs-21.4.0 azure-core-1.23.0 azure-storage-blob-12.9.0 boto3-1.21.13 botocore-1.24.13 cachetools-4.2.4 certifi-2021.10.8 cffi-1.15.0 charset-normalizer-2.0.12 cloudpickle-2.0.0 crcmod-1.7 cryptography-36.0.1 deprecation-2.1.0 dill-0.3.1.1 docker-5.0.3 docopt-0.6.2 execnet-1.9.0 fastavro-1.4.10 fasteners-0.17.3 freezegun-1.2.0 google-api-core-1.31.5 google-apitools-0.5.31 google-auth-1.35.0 google-cloud-bigquery-2.34.1 google-cloud-bigquery-storage-2.12.0 google-cloud-bigtable-1.7.0 google-cloud-core-1.7.2 google-cloud-datastore-1.15.3 google-cloud-dlp-3.6.1 google-cloud-language-1.3.0 google-cloud-pubsub-2.10.0 google-cloud-pubsublite-1.4.0 google-cloud-recommendations-ai-0.2.0 google-cloud-spanner-1.19.1 google-cloud-videointelligence-1.16.1 google-cloud-vision-1.0.0 google-crc32c-1.3.0 google-resumable-media-2.3.1 googleapis-common-protos-1.55.0 greenlet-1.1.2 grpc-google-iam-v1-0.12.3 grpcio-gcp-0.2.2 grpcio-status-1.44.0 hdfs-2.6.0 httplib2-0.19.1 idna-3.3 isodate-0.6.1 jmespath-0.10.0 mock-2.0.0 more-itertools-8.12.0 msrest-0.6.21 numpy-1.21.5 oauth2client-4.1.3 oauthlib-3.2.0 orjson-3.6.7 overrides-6.1.0 pandas-1.3.5 parameterized-0.7.5 pbr-5.8.1 pluggy-0.13.1 proto-plus-1.20.3 psycopg2-binary-2.9.3 pyarrow-6.0.1 pyasn1-0.4.8 pyasn1-modules-0.2.8 pycparser-2.21 pydot-1.4.2 pyhamcrest-1.10.1 pymongo-3.12.3 pymysql-1.0.2 pyparsing-2.4.7 pytest-4.6.11 pytest-forked-1.4.0 pytest-timeout-1.4.2 pytest-xdist-1.34.0 python-dateutil-2.8.2 pytz-2021.3 pyyaml-6.0 requests-2.27.1 requests-oauthlib-1.3.1 requests_mock-1.9.3 rsa-4.8 s3transfer-0.5.2 sqlalchemy-1.4.31 tenacity-5.1.5 testcontainers-3.4.2 typing-extensions-4.1.1 typing-utils-0.1.0 urllib3-1.26.8 wcwidth-0.2.5 websocket-client-1.3.1 wrapt-1.13.3
> Task :sdks:python:test-suites:portable:py39:installGcpTest
Successfully installed apache-beam-2.38.0.dev0 atomicwrites-1.4.0 attrs-21.4.0 azure-core-1.23.0 azure-storage-blob-12.9.0 boto3-1.21.13 botocore-1.24.13 cachetools-4.2.4 certifi-2021.10.8 cffi-1.15.0 charset-normalizer-2.0.12 cloudpickle-2.0.0 crcmod-1.7 cryptography-36.0.1 deprecation-2.1.0 dill-0.3.1.1 docker-5.0.3 docopt-0.6.2 execnet-1.9.0 fastavro-1.4.10 fasteners-0.17.3 freezegun-1.2.0 google-api-core-1.31.5 google-apitools-0.5.31 google-auth-1.35.0 google-cloud-bigquery-2.34.1 google-cloud-bigquery-storage-2.12.0 google-cloud-bigtable-1.7.0 google-cloud-core-1.7.2 google-cloud-datastore-1.15.3 google-cloud-dlp-3.6.1 google-cloud-language-1.3.0 google-cloud-pubsub-2.10.0 google-cloud-pubsublite-1.4.0 google-cloud-recommendations-ai-0.2.0 google-cloud-spanner-1.19.1 google-cloud-videointelligence-1.16.1 google-cloud-vision-1.0.0 google-crc32c-1.3.0 google-resumable-media-2.3.1 googleapis-common-protos-1.55.0 greenlet-1.1.2 grpc-google-iam-v1-0.12.3 grpcio-gcp-0.2.2 grpcio-status-1.44.0 hdfs-2.6.0 httplib2-0.19.1 idna-3.3 isodate-0.6.1 jmespath-0.10.0 mock-2.0.0 more-itertools-8.12.0 msrest-0.6.21 numpy-1.22.2 oauth2client-4.1.3 oauthlib-3.2.0 orjson-3.6.7 overrides-6.1.0 pandas-1.4.1 parameterized-0.7.5 pbr-5.8.1 pluggy-0.13.1 proto-plus-1.20.3 psycopg2-binary-2.9.3 pyarrow-6.0.1 pyasn1-0.4.8 pyasn1-modules-0.2.8 pycparser-2.21 pydot-1.4.2 pyhamcrest-1.10.1 pymongo-3.12.3 pymysql-1.0.2 pyparsing-2.4.7 pytest-4.6.11 pytest-forked-1.4.0 pytest-timeout-1.4.2 pytest-xdist-1.34.0 python-dateutil-2.8.2 pytz-2021.3 pyyaml-6.0 requests-2.27.1 requests-oauthlib-1.3.1 requests_mock-1.9.3 rsa-4.8 s3transfer-0.5.2 sqlalchemy-1.4.31 tenacity-5.1.5 testcontainers-3.4.2 typing-extensions-4.1.1 typing-utils-0.1.0 urllib3-1.26.8 wcwidth-0.2.5 websocket-client-1.3.1 wrapt-1.13.3
FAILURE: Build failed with an exception.
* What went wrong:
Execution failed for task ':model:pipeline:generateProto'.
> Failed to load cache entry for task ':model:pipeline:generateProto'
* Try:
> Run with --stacktrace option to get the stack trace.
> Run with --info or --debug option to get more log output.
> Run with --scan to get full insights.
* Get more help at https://help.gradle.org
Deprecated Gradle features were used in this build, making it incompatible with Gradle 8.0.
You can use '--warning-mode all' to show the individual deprecation warnings and determine if they come from your own scripts or plugins.
See https://docs.gradle.org/7.3.2/userguide/command_line_interface.html#sec:command_line_warnings
BUILD FAILED in 6m 49s
69 actionable tasks: 60 executed, 7 from cache, 2 up-to-date
Publishing build scan...
https://gradle.com/s/jqkuqofr3n3pc
Build step 'Invoke Gradle script' changed build result to FAILURE
Build step 'Invoke Gradle script' marked build as failure
---------------------------------------------------------------------
To unsubscribe, e-mail: builds-unsubscribe@beam.apache.org
For additional commands, e-mail: builds-help@beam.apache.org
Jenkins build is back to normal : beam_PostCommit_Python_Examples_Flink #110
Posted by Apache Jenkins Server <je...@builds.apache.org>.
See <https://ci-beam.apache.org/job/beam_PostCommit_Python_Examples_Flink/110/display/redirect?page=changes>
---------------------------------------------------------------------
To unsubscribe, e-mail: builds-unsubscribe@beam.apache.org
For additional commands, e-mail: builds-help@beam.apache.org
Build failed in Jenkins: beam_PostCommit_Python_Examples_Flink #109
Posted by Apache Jenkins Server <je...@builds.apache.org>.
See <https://ci-beam.apache.org/job/beam_PostCommit_Python_Examples_Flink/109/display/redirect>
Changes:
------------------------------------------
[...truncated 21.81 MB...]
INFO apache_beam.utils.subprocess_server:subprocess_server.py:125 b'Mar 07, 2022 12:07:43 AM org.apache.flink.runtime.executiongraph.Execution transitionState'
INFO apache_beam.utils.subprocess_server:subprocess_server.py:125 b'INFO: DataSource (Impulse) (15/16) (32d6cfecbd23d870bd09822e8ecc0b07) switched from CREATED to SCHEDULED.'
INFO apache_beam.utils.subprocess_server:subprocess_server.py:125 b'Mar 07, 2022 12:07:43 AM org.apache.flink.runtime.executiongraph.Execution transitionState'
INFO apache_beam.utils.subprocess_server:subprocess_server.py:125 b'INFO: DataSource (Impulse) (16/16) (98e0c3fc9ccab01197517f8fb5ca8977) switched from CREATED to SCHEDULED.'
INFO apache_beam.utils.subprocess_server:subprocess_server.py:125 b'Mar 07, 2022 12:07:43 AM org.apache.flink.runtime.executiongraph.Execution transitionState'
INFO apache_beam.utils.subprocess_server:subprocess_server.py:125 b'INFO: CHAIN MapPartition (MapPartition at [1]EstimatePiTransform/Initialize/FlatMap(<lambda at core.py:3229>)) -> FlatMap (FlatMap at ExtractOutput[0]) (1/16) (1ebec2f3fdf2b94b80c926809becbc42) switched from CREATED to SCHEDULED.'
INFO apache_beam.utils.subprocess_server:subprocess_server.py:125 b'Mar 07, 2022 12:07:43 AM org.apache.flink.runtime.executiongraph.Execution transitionState'
INFO apache_beam.utils.subprocess_server:subprocess_server.py:125 b'INFO: CHAIN MapPartition (MapPartition at [1]EstimatePiTransform/Initialize/FlatMap(<lambda at core.py:3229>)) -> FlatMap (FlatMap at ExtractOutput[0]) (2/16) (80a56c821ff30f6c4382f0d3cea4cac6) switched from CREATED to SCHEDULED.'
INFO apache_beam.utils.subprocess_server:subprocess_server.py:125 b'Mar 07, 2022 12:07:43 AM org.apache.flink.runtime.executiongraph.Execution transitionState'
INFO apache_beam.utils.subprocess_server:subprocess_server.py:125 b'INFO: CHAIN MapPartition (MapPartition at [1]EstimatePiTransform/Initialize/FlatMap(<lambda at core.py:3229>)) -> FlatMap (FlatMap at ExtractOutput[0]) (3/16) (6fbb440d74051a9bacea3383f2cbf7d5) switched from CREATED to SCHEDULED.'
INFO apache_beam.utils.subprocess_server:subprocess_server.py:125 b'Mar 07, 2022 12:07:43 AM org.apache.flink.runtime.executiongraph.Execution transitionState'
INFO apache_beam.utils.subprocess_server:subprocess_server.py:125 b'INFO: CHAIN MapPartition (MapPartition at [1]EstimatePiTransform/Initialize/FlatMap(<lambda at core.py:3229>)) -> FlatMap (FlatMap at ExtractOutput[0]) (4/16) (5d8599f83cb125cce794474a9e741561) switched from CREATED to SCHEDULED.'
INFO apache_beam.utils.subprocess_server:subprocess_server.py:125 b'Mar 07, 2022 12:07:43 AM org.apache.flink.runtime.executiongraph.Execution transitionState'
INFO apache_beam.utils.subprocess_server:subprocess_server.py:125 b'INFO: CHAIN MapPartition (MapPartition at [1]EstimatePiTransform/Initialize/FlatMap(<lambda at core.py:3229>)) -> FlatMap (FlatMap at ExtractOutput[0]) (5/16) (f6ec85275ab353a23e12e790b7b73a56) switched from CREATED to SCHEDULED.'
INFO apache_beam.utils.subprocess_server:subprocess_server.py:125 b'Mar 07, 2022 12:07:43 AM org.apache.flink.runtime.executiongraph.Execution transitionState'
INFO apache_beam.utils.subprocess_server:subprocess_server.py:125 b'INFO: CHAIN MapPartition (MapPartition at [1]EstimatePiTransform/Initialize/FlatMap(<lambda at core.py:3229>)) -> FlatMap (FlatMap at ExtractOutput[0]) (6/16) (86af83ad3ef5c314de912444873f31dd) switched from CREATED to SCHEDULED.'
INFO apache_beam.utils.subprocess_server:subprocess_server.py:125 b'Mar 07, 2022 12:07:43 AM org.apache.flink.runtime.executiongraph.Execution transitionState'
INFO apache_beam.utils.subprocess_server:subprocess_server.py:125 b'INFO: CHAIN MapPartition (MapPartition at [1]EstimatePiTransform/Initialize/FlatMap(<lambda at core.py:3229>)) -> FlatMap (FlatMap at ExtractOutput[0]) (7/16) (11b6f2ca57f5da4d326d1ceef13e1ade) switched from CREATED to SCHEDULED.'
INFO apache_beam.utils.subprocess_server:subprocess_server.py:125 b'Mar 07, 2022 12:07:43 AM org.apache.flink.runtime.executiongraph.Execution transitionState'
INFO apache_beam.utils.subprocess_server:subprocess_server.py:125 b'INFO: CHAIN MapPartition (MapPartition at [1]EstimatePiTransform/Initialize/FlatMap(<lambda at core.py:3229>)) -> FlatMap (FlatMap at ExtractOutput[0]) (8/16) (7df09213c778dbd42f49d90647d2fbc7) switched from CREATED to SCHEDULED.'
INFO apache_beam.utils.subprocess_server:subprocess_server.py:125 b'Mar 07, 2022 12:07:43 AM org.apache.flink.runtime.executiongraph.Execution transitionState'
INFO apache_beam.utils.subprocess_server:subprocess_server.py:125 b'INFO: CHAIN MapPartition (MapPartition at [1]EstimatePiTransform/Initialize/FlatMap(<lambda at core.py:3229>)) -> FlatMap (FlatMap at ExtractOutput[0]) (9/16) (b49485f2d51229ed92f5d17e183d4e8c) switched from CREATED to SCHEDULED.'
INFO apache_beam.utils.subprocess_server:subprocess_server.py:125 b'Mar 07, 2022 12:07:43 AM org.apache.flink.runtime.executiongraph.Execution transitionState'
INFO apache_beam.utils.subprocess_server:subprocess_server.py:125 b'INFO: CHAIN MapPartition (MapPartition at [1]EstimatePiTransform/Initialize/FlatMap(<lambda at core.py:3229>)) -> FlatMap (FlatMap at ExtractOutput[0]) (10/16) (dc938d516d3fdc3edc37ffa4d8eec8ee) switched from CREATED to SCHEDULED.'
INFO apache_beam.utils.subprocess_server:subprocess_server.py:125 b'Mar 07, 2022 12:07:43 AM org.apache.flink.runtime.executiongraph.Execution transitionState'
INFO apache_beam.utils.subprocess_server:subprocess_server.py:125 b'INFO: CHAIN MapPartition (MapPartition at [1]EstimatePiTransform/Initialize/FlatMap(<lambda at core.py:3229>)) -> FlatMap (FlatMap at ExtractOutput[0]) (11/16) (08c65e9222088bb4015e852f19bae4fe) switched from CREATED to SCHEDULED.'
INFO apache_beam.utils.subprocess_server:subprocess_server.py:125 b'Mar 07, 2022 12:07:43 AM org.apache.flink.runtime.executiongraph.Execution transitionState'
INFO apache_beam.utils.subprocess_server:subprocess_server.py:125 b'INFO: CHAIN MapPartition (MapPartition at [1]EstimatePiTransform/Initialize/FlatMap(<lambda at core.py:3229>)) -> FlatMap (FlatMap at ExtractOutput[0]) (12/16) (c2815fc1cb4f78a7af87418f2d57ede4) switched from CREATED to SCHEDULED.'
INFO apache_beam.utils.subprocess_server:subprocess_server.py:125 b'Mar 07, 2022 12:07:43 AM org.apache.flink.runtime.executiongraph.Execution transitionState'
INFO apache_beam.utils.subprocess_server:subprocess_server.py:125 b'INFO: CHAIN MapPartition (MapPartition at [1]EstimatePiTransform/Initialize/FlatMap(<lambda at core.py:3229>)) -> FlatMap (FlatMap at ExtractOutput[0]) (13/16) (e3af2e0cb0c26f3b244be8869c5d94dc) switched from CREATED to SCHEDULED.'
INFO apache_beam.utils.subprocess_server:subprocess_server.py:125 b'Mar 07, 2022 12:07:43 AM org.apache.flink.runtime.executiongraph.Execution transitionState'
INFO apache_beam.utils.subprocess_server:subprocess_server.py:125 b'INFO: CHAIN MapPartition (MapPartition at [1]EstimatePiTransform/Initialize/FlatMap(<lambda at core.py:3229>)) -> FlatMap (FlatMap at ExtractOutput[0]) (14/16) (1ec7a87357970e0a2c006e01ba295281) switched from CREATED to SCHEDULED.'
INFO apache_beam.utils.subprocess_server:subprocess_server.py:125 b'Mar 07, 2022 12:07:43 AM org.apache.flink.runtime.executiongraph.Execution transitionState'
INFO apache_beam.utils.subprocess_server:subprocess_server.py:125 b'INFO: CHAIN MapPartition (MapPartition at [1]EstimatePiTransform/Initialize/FlatMap(<lambda at core.py:3229>)) -> FlatMap (FlatMap at ExtractOutput[0]) (15/16) (362071bac98352ff424bdb209bd1184e) switched from CREATED to SCHEDULED.'
INFO apache_beam.utils.subprocess_server:subprocess_server.py:125 b'Mar 07, 2022 12:07:43 AM org.apache.flink.runtime.executiongraph.Execution transitionState'
INFO apache_beam.utils.subprocess_server:subprocess_server.py:125 b'INFO: CHAIN MapPartition (MapPartition at [1]EstimatePiTransform/Initialize/FlatMap(<lambda at core.py:3229>)) -> FlatMap (FlatMap at ExtractOutput[0]) (16/16) (4a6f1da7bab792845ed0e0936cd11660) switched from CREATED to SCHEDULED.'
INFO apache_beam.utils.subprocess_server:subprocess_server.py:125 b'Mar 07, 2022 12:07:43 AM org.apache.flink.runtime.executiongraph.Execution transitionState'
INFO apache_beam.utils.subprocess_server:subprocess_server.py:125 b'INFO: Partition (1/16) (51247d6a085e3cdf4d1cba28a4a99980) switched from CREATED to SCHEDULED.'
INFO apache_beam.utils.subprocess_server:subprocess_server.py:125 b'Mar 07, 2022 12:07:43 AM org.apache.flink.runtime.executiongraph.Execution transitionState'
INFO apache_beam.utils.subprocess_server:subprocess_server.py:125 b'INFO: Partition (2/16) (e1cbbf56f28815d9136837a8306e4561) switched from CREATED to SCHEDULED.'
INFO apache_beam.utils.subprocess_server:subprocess_server.py:125 b'Mar 07, 2022 12:07:43 AM org.apache.flink.runtime.executiongraph.Execution transitionState'
INFO apache_beam.utils.subprocess_server:subprocess_server.py:125 b'INFO: Partition (3/16) (450f55da69b1c2a0781ffee0fb982f25) switched from CREATED to SCHEDULED.'
INFO apache_beam.utils.subprocess_server:subprocess_server.py:125 b'Mar 07, 2022 12:07:43 AM org.apache.flink.runtime.executiongraph.Execution transitionState'
INFO apache_beam.utils.subprocess_server:subprocess_server.py:125 b'INFO: Partition (4/16) (63b0d9ab2379d1ee17e65afee8809c25) switched from CREATED to SCHEDULED.'
INFO apache_beam.utils.subprocess_server:subprocess_server.py:125 b'Mar 07, 2022 12:07:43 AM org.apache.flink.runtime.executiongraph.Execution transitionState'
INFO apache_beam.utils.subprocess_server:subprocess_server.py:125 b'INFO: Partition (5/16) (aee05b3fa9eca26936122d1ec30268f1) switched from CREATED to SCHEDULED.'
INFO apache_beam.utils.subprocess_server:subprocess_server.py:125 b'Mar 07, 2022 12:07:43 AM org.apache.flink.runtime.executiongraph.Execution transitionState'
INFO apache_beam.utils.subprocess_server:subprocess_server.py:125 b'INFO: Partition (6/16) (e132d7819f3dcb4dd5d3d224d31c5c95) switched from CREATED to SCHEDULED.'
INFO apache_beam.utils.subprocess_server:subprocess_server.py:125 b'Mar 07, 2022 12:07:43 AM org.apache.flink.runtime.executiongraph.Execution transitionState'
INFO apache_beam.utils.subprocess_server:subprocess_server.py:125 b'INFO: Partition (7/16) (ff3ec3c4431ceb47236211ccc24eec1e) switched from CREATED to SCHEDULED.'
INFO apache_beam.utils.subprocess_server:subprocess_server.py:125 b'Mar 07, 2022 12:07:43 AM org.apache.flink.runtime.executiongraph.Execution transitionState'
INFO apache_beam.utils.subprocess_server:subprocess_server.py:125 b'INFO: Partition (8/16) (f3e0e4f0514e01a4801e6aff9914325c) switched from CREATED to SCHEDULED.'
INFO apache_beam.utils.subprocess_server:subprocess_server.py:125 b'Mar 07, 2022 12:07:43 AM org.apache.flink.runtime.executiongraph.Execution transitionState'
INFO apache_beam.utils.subprocess_server:subprocess_server.py:125 b'INFO: Partition (9/16) (a59ae603610bb5aaf3c15167ca791fe8) switched from CREATED to SCHEDULED.'
INFO apache_beam.utils.subprocess_server:subprocess_server.py:125 b'Mar 07, 2022 12:07:43 AM org.apache.flink.runtime.executiongraph.Execution transitionState'
INFO apache_beam.utils.subprocess_server:subprocess_server.py:125 b'INFO: Partition (10/16) (43a061ba743c30467c943045eecb2768) switched from CREATED to SCHEDULED.'
INFO apache_beam.utils.subprocess_server:subprocess_server.py:125 b'Mar 07, 2022 12:07:43 AM org.apache.flink.runtime.executiongraph.Execution transitionState'
INFO apache_beam.utils.subprocess_server:subprocess_server.py:125 b'INFO: Partition (11/16) (913e538cbae76be6f2c84681d3bdea11) switched from CREATED to SCHEDULED.'
INFO apache_beam.utils.subprocess_server:subprocess_server.py:125 b'Mar 07, 2022 12:07:43 AM org.apache.flink.runtime.executiongraph.Execution transitionState'
INFO apache_beam.utils.subprocess_server:subprocess_server.py:125 b'INFO: Partition (12/16) (209423dc2ce81ea87c56b0028ca0a86d) switched from CREATED to SCHEDULED.'
INFO apache_beam.utils.subprocess_server:subprocess_server.py:125 b'Mar 07, 2022 12:07:43 AM org.apache.flink.runtime.executiongraph.Execution transitionState'
INFO apache_beam.utils.subprocess_server:subprocess_server.py:125 b'INFO: Partition (13/16) (2954c3685fbea2b408c73040d8737b5e) switched from CREATED to SCHEDULED.'
INFO apache_beam.utils.subprocess_server:subprocess_server.py:125 b'Mar 07, 2022 12:07:43 AM org.apache.flink.runtime.executiongraph.Execution transitionState'
INFO apache_beam.utils.subprocess_server:subprocess_server.py:125 b'INFO: Partition (14/16) (18b98a046aff80e5ec00921772289962) switched from CREATED to SCHEDULED.'
INFO apache_beam.utils.subprocess_server:subprocess_server.py:125 b'Mar 07, 2022 12:07:43 AM org.apache.flink.runtime.executiongraph.Execution transitionState'
INFO apache_beam.utils.subprocess_server:subprocess_server.py:125 b'INFO: Partition (15/16) (3437cc8b294d81ae7e1eb0dd215e2c17) switched from CREATED to SCHEDULED.'
INFO apache_beam.utils.subprocess_server:subprocess_server.py:125 b'Mar 07, 2022 12:07:43 AM org.apache.flink.runtime.executiongraph.Execution transitionState'
INFO apache_beam.utils.subprocess_server:subprocess_server.py:125 b'INFO: Partition (16/16) (fc255e143869683b01777eb5dba17a01) switched from CREATED to SCHEDULED.'
INFO apache_beam.utils.subprocess_server:subprocess_server.py:125 b'Mar 07, 2022 12:07:43 AM org.apache.flink.runtime.executiongraph.Execution transitionState'
INFO apache_beam.utils.subprocess_server:subprocess_server.py:125 b'INFO: CHAIN MapPartition (MapPartition at [4]EstimatePiTransform/{Initialize, Run trials, Sum}) -> FlatMap (FlatMap at ExtractOutput[0]) -> Map (Key Extractor) -> GroupCombine (GroupCombine at GroupCombine: EstimatePiTransform/Sum/CombinePerKey/Group) -> Map (Key Extractor) (1/16) (25877063b6dfbbd6e8b99c253014688b) switched from CREATED to SCHEDULED.'
INFO apache_beam.utils.subprocess_server:subprocess_server.py:125 b'Mar 07, 2022 12:07:43 AM org.apache.flink.runtime.executiongraph.Execution transitionState'
INFO apache_beam.utils.subprocess_server:subprocess_server.py:125 b'INFO: CHAIN MapPartition (MapPartition at [4]EstimatePiTransform/{Initialize, Run trials, Sum}) -> FlatMap (FlatMap at ExtractOutput[0]) -> Map (Key Extractor) -> GroupCombine (GroupCombine at GroupCombine: EstimatePiTransform/Sum/CombinePerKey/Group) -> Map (Key Extractor) (2/16) (760a87a4737f438cb2a454e60d5a9a4b) switched from CREATED to SCHEDULED.'
INFO apache_beam.utils.subprocess_server:subprocess_server.py:125 b'Mar 07, 2022 12:07:43 AM org.apache.flink.runtime.executiongraph.Execution transitionState'
INFO apache_beam.utils.subprocess_server:subprocess_server.py:125 b'INFO: CHAIN MapPartition (MapPartition at [4]EstimatePiTransform/{Initialize, Run trials, Sum}) -> FlatMap (FlatMap at ExtractOutput[0]) -> Map (Key Extractor) -> GroupCombine (GroupCombine at GroupCombine: EstimatePiTransform/Sum/CombinePerKey/Group) -> Map (Key Extractor) (3/16) (f1d9755288491810c88215fab443ad8a) switched from CREATED to SCHEDULED.'
INFO apache_beam.utils.subprocess_server:subprocess_server.py:125 b'Mar 07, 2022 12:07:43 AM org.apache.flink.runtime.executiongraph.Execution transitionState'
INFO apache_beam.utils.subprocess_server:subprocess_server.py:125 b'INFO: CHAIN MapPartition (MapPartition at [4]EstimatePiTransform/{Initialize, Run trials, Sum}) -> FlatMap (FlatMap at ExtractOutput[0]) -> Map (Key Extractor) -> GroupCombine (GroupCombine at GroupCombine: EstimatePiTransform/Sum/CombinePerKey/Group) -> Map (Key Extractor) (4/16) (3bf48e7cca356fde4d8bb1041cfc5f02) switched from CREATED to SCHEDULED.'
INFO apache_beam.utils.subprocess_server:subprocess_server.py:125 b'Mar 07, 2022 12:07:43 AM org.apache.flink.runtime.executiongraph.Execution transitionState'
INFO apache_beam.utils.subprocess_server:subprocess_server.py:125 b'INFO: CHAIN MapPartition (MapPartition at [4]EstimatePiTransform/{Initialize, Run trials, Sum}) -> FlatMap (FlatMap at ExtractOutput[0]) -> Map (Key Extractor) -> GroupCombine (GroupCombine at GroupCombine: EstimatePiTransform/Sum/CombinePerKey/Group) -> Map (Key Extractor) (5/16) (d609912c0f3689a358ec00d300e894e9) switched from CREATED to SCHEDULED.'
INFO apache_beam.utils.subprocess_server:subprocess_server.py:125 b'Mar 07, 2022 12:07:43 AM org.apache.flink.runtime.executiongraph.Execution transitionState'
INFO apache_beam.utils.subprocess_server:subprocess_server.py:125 b'INFO: CHAIN MapPartition (MapPartition at [4]EstimatePiTransform/{Initialize, Run trials, Sum}) -> FlatMap (FlatMap at ExtractOutput[0]) -> Map (Key Extractor) -> GroupCombine (GroupCombine at GroupCombine: EstimatePiTransform/Sum/CombinePerKey/Group) -> Map (Key Extractor) (6/16) (d7dfed1eae9558db3f80c33f2ce4962e) switched from CREATED to SCHEDULED.'
INFO apache_beam.utils.subprocess_server:subprocess_server.py:125 b'Mar 07, 2022 12:07:43 AM org.apache.flink.runtime.executiongraph.Execution transitionState'
INFO apache_beam.utils.subprocess_server:subprocess_server.py:125 b'INFO: CHAIN MapPartition (MapPartition at [4]EstimatePiTransform/{Initialize, Run trials, Sum}) -> FlatMap (FlatMap at ExtractOutput[0]) -> Map (Key Extractor) -> GroupCombine (GroupCombine at GroupCombine: EstimatePiTransform/Sum/CombinePerKey/Group) -> Map (Key Extractor) (7/16) (777463b95359d8bb06eebc3846cbf202) switched from CREATED to SCHEDULED.'
INFO apache_beam.utils.subprocess_server:subprocess_server.py:125 b'Mar 07, 2022 12:07:43 AM org.apache.flink.runtime.executiongraph.Execution transitionState'
INFO apache_beam.utils.subprocess_server:subprocess_server.py:125 b'INFO: CHAIN MapPartition (MapPartition at [4]EstimatePiTransform/{Initialize, Run trials, Sum}) -> FlatMap (FlatMap at ExtractOutput[0]) -> Map (Key Extractor) -> GroupCombine (GroupCombine at GroupCombine: EstimatePiTransform/Sum/CombinePerKey/Group) -> Map (Key Extractor) (8/16) (3d1a333be72b2952d66c761c2208db99) switched from CREATED to SCHEDULED.'
INFO apache_beam.utils.subprocess_server:subprocess_server.py:125 b'Mar 07, 2022 12:07:43 AM org.apache.flink.runtime.executiongraph.Execution transitionState'
INFO apache_beam.utils.subprocess_server:subprocess_server.py:125 b'INFO: CHAIN MapPartition (MapPartition at [4]EstimatePiTransform/{Initialize, Run trials, Sum}) -> FlatMap (FlatMap at ExtractOutput[0]) -> Map (Key Extractor) -> GroupCombine (GroupCombine at GroupCombine: EstimatePiTransform/Sum/CombinePerKey/Group) -> Map (Key Extractor) (9/16) (61a741361431daeacc08334871d6fe31) switched from CREATED to SCHEDULED.'
INFO apache_beam.utils.subprocess_server:subprocess_server.py:125 b'Mar 07, 2022 12:07:43 AM org.apache.flink.runtime.executiongraph.Execution transitionState'
INFO apache_beam.utils.subprocess_server:subprocess_server.py:125 b'INFO: CHAIN MapPartition (MapPartition at [4]EstimatePiTransform/{Initialize, Run trials, Sum}) -> FlatMap (FlatMap at ExtractOutput[0]) -> Map (Key Extractor) -> GroupCombine (GroupCombine at GroupCombine: EstimatePiTransform/Sum/CombinePerKey/Group) -> Map (Key Extractor) (10/16) (ab13f83b50490bb46c62e4efb9110d53) switched from CREATED to SCHEDULED.'
INFO apache_beam.utils.subprocess_server:subprocess_server.py:125 b'Mar 07, 2022 12:07:43 AM org.apache.flink.runtime.executiongraph.Execution transitionState'
INFO apache_beam.utils.subprocess_server:subprocess_server.py:125 b'INFO: CHAIN MapPartition (MapPartition at [4]EstimatePiTransform/{Initialize, Run trials, Sum}) -> FlatMap (FlatMap at ExtractOutput[0]) -> Map (Key Extractor) -> GroupCombine (GroupCombine at GroupCombine: EstimatePiTransform/Sum/CombinePerKey/Group) -> Map (Key Extractor) (11/16) (2d4eccd329713ba368233b32e7109558) switched from CREATED to SCHEDULED.'
INFO apache_beam.utils.subprocess_server:subprocess_server.py:125 b'Mar 07, 2022 12:07:43 AM org.apache.flink.runtime.executiongraph.Execution transitionState'
INFO apache_beam.utils.subprocess_server:subprocess_server.py:125 b'INFO: CHAIN MapPartition (MapPartition at [4]EstimatePiTransform/{Initialize, Run trials, Sum}) -> FlatMap (FlatMap at ExtractOutput[0]) -> Map (Key Extractor) -> GroupCombine (GroupCombine at GroupCombine: EstimatePiTransform/Sum/CombinePerKey/Group) -> Map (Key Extractor) (12/16) (dc8e9db65d41fa977b012269039bd02e) switched from CREATED to SCHEDULED.'
INFO apache_beam.utils.subprocess_server:subprocess_server.py:125 b'Mar 07, 2022 12:07:43 AM org.apache.flink.runtime.executiongraph.Execution transitionState'
INFO apache_beam.utils.subprocess_server:subprocess_server.py:125 b'INFO: CHAIN MapPartition (MapPartition at [4]EstimatePiTransform/{Initialize, Run trials, Sum}) -> FlatMap (FlatMap at ExtractOutput[0]) -> Map (Key Extractor) -> GroupCombine (GroupCombine at GroupCombine: EstimatePiTransform/Sum/CombinePerKey/Group) -> Map (Key Extractor) (13/16) (8b6e63364145d4be157b41be8955825b) switched from CREATED to SCHEDULED.'
INFO apache_beam.utils.subprocess_server:subprocess_server.py:125 b'Mar 07, 2022 12:07:43 AM org.apache.flink.runtime.executiongraph.Execution transitionState'
INFO apache_beam.utils.subprocess_server:subprocess_server.py:125 b'INFO: CHAIN MapPartition (MapPartition at [4]EstimatePiTransform/{Initialize, Run trials, Sum}) -> FlatMap (FlatMap at ExtractOutput[0]) -> Map (Key Extractor) -> GroupCombine (GroupCombine at GroupCombine: EstimatePiTransform/Sum/CombinePerKey/Group) -> Map (Key Extractor) (14/16) (24cfe1fbeafe2137894d4f05c2df2442) switched from CREATED to SCHEDULED.'
INFO apache_beam.utils.subprocess_server:subprocess_server.py:125 b'Mar 07, 2022 12:07:43 AM org.apache.flink.runtime.executiongraph.Execution transitionState'
INFO apache_beam.utils.subprocess_server:subprocess_server.py:125 b'INFO: CHAIN MapPartition (MapPartition at [4]EstimatePiTransform/{Initialize, Run trials, Sum}) -> FlatMap (FlatMap at ExtractOutput[0]) -> Map (Key Extractor) -> GroupCombine (GroupCombine at GroupCombine: EstimatePiTransform/Sum/CombinePerKey/Group) -> Map (Key Extractor) (15/16) (072a54f6020296f7dad74bc75b1ddba5) switched from CREATED to SCHEDULED.'
INFO apache_beam.utils.subprocess_server:subprocess_server.py:125 b'Mar 07, 2022 12:07:43 AM org.apache.flink.runtime.executiongraph.Execution transitionState'
INFO apache_beam.utils.subprocess_server:subprocess_server.py:125 b'INFO: CHAIN MapPartition (MapPartition at [4]EstimatePiTransform/{Initialize, Run trials, Sum}) -> FlatMap (FlatMap at ExtractOutput[0]) -> Map (Key Extractor) -> GroupCombine (GroupCombine at GroupCombine: EstimatePiTransform/Sum/CombinePerKey/Group) -> Map (Key Extractor) (16/16) (e7c5428eff8acbf0c412ff99c917096b) switched from CREATED to SCHEDULED.'
INFO apache_beam.utils.subprocess_server:subprocess_server.py:125 b'Mar 07, 2022 12:07:43 AM org.apache.flink.runtime.executiongraph.Execution transitionState'
INFO apache_beam.utils.subprocess_server:subprocess_server.py:125 b'INFO: GroupReduce (GroupReduce at EstimatePiTransform/Sum/CombinePerKey/Group) (1/16) (8faef12102ee026f11b643b6cbe16fa2) switched from CREATED to SCHEDULED.'
INFO apache_beam.utils.subprocess_server:subprocess_server.py:125 b'Mar 07, 2022 12:07:43 AM org.apache.flink.runtime.executiongraph.Execution transitionState'
INFO apache_beam.utils.subprocess_server:subprocess_server.py:125 b'INFO: GroupReduce (GroupReduce at EstimatePiTransform/Sum/CombinePerKey/Group) (2/16) (cd412ea72487e8c555f5f3cc877433c6) switched from CREATED to SCHEDULED.'
INFO apache_beam.utils.subprocess_server:subprocess_server.py:125 b'Mar 07, 2022 12:07:43 AM org.apache.flink.runtime.executiongraph.Execution transitionState'
INFO apache_beam.utils.subprocess_server:subprocess_server.py:125 b'INFO: GroupReduce (GroupReduce at EstimatePiTransform/Sum/CombinePerKey/Group) (3/16) (c2fe5fb706372f290f4698123fed4143) switched from CREATED to SCHEDULED.'
INFO apache_beam.utils.subprocess_server:subprocess_server.py:125 b'Mar 07, 2022 12:07:43 AM org.apache.flink.runtime.executiongraph.Execution transitionState'
INFO apache_beam.utils.subprocess_server:subprocess_server.py:125 b'INFO: GroupReduce (GroupReduce at EstimatePiTransform/Sum/CombinePerKey/Group) (4/16) (2abc09ae249517dd41b51c9b327cd038) switched from CREATED to SCHEDULED.'
INFO apache_beam.utils.subprocess_server:subprocess_server.py:125 b'Mar 07, 2022 12:07:43 AM org.apache.flink.runtime.executiongraph.Execution transitionState'
INFO apache_beam.utils.subprocess_server:subprocess_server.py:125 b'INFO: GroupReduce (GroupReduce at EstimatePiTransform/Sum/CombinePerKey/Group) (5/16) (81af4c2c5c53658e204329eca9bc147d) switched from CREATED to SCHEDULED.'
INFO apache_beam.utils.subprocess_server:subprocess_server.py:125 b'Mar 07, 2022 12:07:43 AM org.apache.flink.runtime.executiongraph.Execution transitionState'
INFO apache_beam.utils.subprocess_server:subprocess_server.py:125 b'INFO: GroupReduce (GroupReduce at EstimatePiTransform/Sum/CombinePerKey/Group) (6/16) (6242fdc316204c009657f2d3731158e7) switched from CREATED to SCHEDULED.'
INFO apache_beam.utils.subprocess_server:subprocess_server.py:125 b'Mar 07, 2022 12:07:43 AM org.apache.flink.runtime.executiongraph.Execution transitionState'
INFO apache_beam.utils.subprocess_server:subprocess_server.py:125 b'INFO: GroupReduce (GroupReduce at EstimatePiTransform/Sum/CombinePerKey/Group) (7/16) (8ae65fea5f4646ea310f8b711c240aca) switched from CREATED to SCHEDULED.'
INFO apache_beam.utils.subprocess_server:subprocess_server.py:125 b'Mar 07, 2022 12:07:43 AM org.apache.flink.runtime.executiongraph.Execution transitionState'
INFO apache_beam.utils.subprocess_server:subprocess_server.py:125 b'INFO: GroupReduce (GroupReduce at EstimatePiTransform/Sum/CombinePerKey/Group) (8/16) (607e9e36c837fb1e52401d996e8779be) switched from CREATED to SCHEDULED.'
INFO apache_beam.utils.subprocess_server:subprocess_server.py:125 b'Mar 07, 2022 12:07:43 AM org.apache.flink.runtime.executiongraph.Execution transitionState'
INFO apache_beam.utils.subprocess_server:subprocess_server.py:125 b'INFO: GroupReduce (GroupReduce at EstimatePiTransform/Sum/CombinePerKey/Group) (9/16) (bf148ccc829685ec8cad8e5c14eb4fa6) switched from CREATED to SCHEDULED.'
INFO apache_beam.utils.subprocess_server:subprocess_server.py:125 b'Mar 07, 2022 12:07:43 AM org.apache.flink.runtime.executiongraph.Execution transitionState'
INFO apache_beam.utils.subprocess_server:subprocess_server.py:125 b'INFO: GroupReduce (GroupReduce at EstimatePiTransform/Sum/CombinePerKey/Group) (10/16) (f6fb5a11d842dec82f5968e40c8d04ee) switched from CREATED to SCHEDULED.'
INFO apache_beam.utils.subprocess_server:subprocess_server.py:125 b'Mar 07, 2022 12:07:43 AM org.apache.flink.runtime.executiongraph.Execution transitionState'
INFO apache_beam.utils.subprocess_server:subprocess_server.py:125 b'INFO: GroupReduce (GroupReduce at EstimatePiTransform/Sum/CombinePerKey/Group) (11/16) (2f4427a48af12f2a16662280df95d513) switched from CREATED to SCHEDULED.'
INFO apache_beam.utils.subprocess_server:subprocess_server.py:125 b'Mar 07, 2022 12:07:43 AM org.apache.flink.runtime.executiongraph.Execution transitionState'
INFO apache_beam.utils.subprocess_server:subprocess_server.py:125 b'INFO: GroupReduce (GroupReduce at EstimatePiTransform/Sum/CombinePerKey/Group) (12/16) (8b1dbe8ef1bf44b5dfe20c00c5c4f767) switched from CREATED to SCHEDULED.'
INFO apache_beam.utils.subprocess_server:subprocess_server.py:125 b'Mar 07, 2022 12:07:43 AM org.apache.flink.runtime.executiongraph.Execution transitionState'
INFO apache_beam.utils.subprocess_server:subprocess_server.py:125 b'INFO: GroupReduce (GroupReduce at EstimatePiTransform/Sum/CombinePerKey/Group) (13/16) (4dfed2b71ebd819b433f8442d87e2016) switched from CREATED to SCHEDULED.'
INFO apache_beam.utils.subprocess_server:subprocess_server.py:125 b'Mar 07, 2022 12:07:43 AM org.apache.flink.runtime.executiongraph.Execution transitionState'
INFO apache_beam.utils.subprocess_server:subprocess_server.py:125 b'INFO: GroupReduce (GroupReduce at EstimatePiTransform/Sum/CombinePerKey/Group) (14/16) (756c899afb6bef3ff885400df2508d63) switched from CREATED to SCHEDULED.'
INFO apache_beam.utils.subprocess_server:subprocess_server.py:125 b'Mar 07, 2022 12:07:43 AM org.apache.flink.runtime.executiongraph.Execution transitionState'
INFO apache_beam.utils.subprocess_server:subprocess_server.py:125 b'INFO: GroupReduce (GroupReduce at EstimatePiTransform/Sum/CombinePerKey/Group) (15/16) (6e16383d0723571be19abb1d888b2537) switched from CREATED to SCHEDULED.'
INFO apache_beam.utils.subprocess_server:subprocess_server.py:125 b'Mar 07, 2022 12:07:43 AM org.apache.flink.runtime.executiongraph.Execution transitionState'
INFO apache_beam.utils.subprocess_server:subprocess_server.py:125 b'INFO: GroupReduce (GroupReduce at EstimatePiTransform/Sum/CombinePerKey/Group) (16/16) (781a8c5a3f7c85e3e1c2267f83b666dc) switched from CREATED to SCHEDULED.'
INFO apache_beam.utils.subprocess_server:subprocess_server.py:125 b'Mar 07, 2022 12:07:43 AM org.apache.flink.runtime.executiongraph.Execution transitionState'
INFO apache_beam.utils.subprocess_server:subprocess_server.py:125 b'INFO: CHAIN MapPartition (MapPartition at [4]{EstimatePiTransform, WriteToText}) -> FlatMap (FlatMap at ExtractOutput[0]) (1/16) (3ad994e127461cea6e92681e8a153505) switched from CREATED to SCHEDULED.'
INFO apache_beam.utils.subprocess_server:subprocess_server.py:125 b'Mar 07, 2022 12:07:43 AM org.apache.flink.runtime.executiongraph.Execution transitionState'
INFO apache_beam.utils.subprocess_server:subprocess_server.py:125 b'INFO: CHAIN MapPartition (MapPartition at [4]{EstimatePiTransform, WriteToText}) -> FlatMap (FlatMap at ExtractOutput[0]) (2/16) (e6fa5da1eebb95c5afd8ff9d51d9bc11) switched from CREATED to SCHEDULED.'
INFO apache_beam.utils.subprocess_server:subprocess_server.py:125 b'Mar 07, 2022 12:07:43 AM org.apache.flink.runtime.executiongraph.Execution transitionState'
INFO apache_beam.utils.subprocess_server:subprocess_server.py:125 b'INFO: CHAIN MapPartition (MapPartition at [4]{EstimatePiTransform, WriteToText}) -> FlatMap (FlatMap at ExtractOutput[0]) (3/16) (fc82124665b65c2d51f4e466e7cbf890) switched from CREATED to SCHEDULED.'
INFO apache_beam.utils.subprocess_server:subprocess_server.py:125 b'Mar 07, 2022 12:07:43 AM org.apache.flink.runtime.executiongraph.Execution transitionState'
INFO apache_beam.utils.subprocess_server:subprocess_server.py:125 b'INFO: CHAIN MapPartition (MapPartition at [4]{EstimatePiTransform, WriteToText}) -> FlatMap (FlatMap at ExtractOutput[0]) (4/16) (7645dc7eb8bc2229adb8b102a6f3a205) switched from CREATED to SCHEDULED.'
INFO apache_beam.utils.subprocess_server:subprocess_server.py:125 b'Mar 07, 2022 12:07:43 AM org.apache.flink.runtime.executiongraph.Execution transitionState'
INFO apache_beam.utils.subprocess_server:subprocess_server.py:125 b'INFO: CHAIN MapPartition (MapPartition at [4]{EstimatePiTransform, WriteToText}) -> FlatMap (FlatMap at ExtractOutput[0]) (5/16) (4adff17e825bd26cdaf3afab2eaf7ded) switched from CREATED to SCHEDULED.'
INFO apache_beam.utils.subprocess_server:subprocess_server.py:125 b'Mar 07, 2022 12:07:43 AM org.apache.flink.runtime.executiongraph.Execution transitionState'
INFO apache_beam.utils.subprocess_server:subprocess_server.py:125 b'INFO: CHAIN MapPartition (MapPartition at [4]{EstimatePiTransform, WriteToText}) -> FlatMap (FlatMap at ExtractOutput[0]) (6/16) (28e382ac957cc4fbbca69c1e82c05f00) switched from CREATED to SCHEDULED.'
INFO apache_beam.utils.subprocess_server:subprocess_server.py:125 b'Mar 07, 2022 12:07:43 AM org.apache.flink.runtime.executiongraph.Execution transitionState'
INFO apache_beam.utils.subprocess_server:subprocess_server.py:125 b'INFO: CHAIN MapPartition (MapPartition at [4]{EstimatePiTransform, WriteToText}) -> FlatMap (FlatMap at ExtractOutput[0]) (7/16) (47928596195a1a1240e22eb6bc6e54b6) switched from CREATED to SCHEDULED.'
INFO apache_beam.utils.subprocess_server:subprocess_server.py:125 b'Mar 07, 2022 12:07:43 AM org.apache.flink.runtime.executiongraph.Execution transitionState'
INFO apache_beam.utils.subprocess_server:subprocess_server.py:125 b'INFO: CHAIN MapPartition (MapPartition at [4]{EstimatePiTransform, WriteToText}) -> FlatMap (FlatMap at ExtractOutput[0]) (8/16) (82138721471e5f48679ac4b72152cf0c) switched from CREATED to SCHEDULED.'
INFO apache_beam.utils.subprocess_server:subprocess_server.py:125 b'Mar 07, 2022 12:07:43 AM org.apache.flink.runtime.executiongraph.Execution transitionState'
INFO apache_beam.utils.subprocess_server:subprocess_server.py:125 b'INFO: CHAIN MapPartition (MapPartition at [4]{EstimatePiTransform, WriteToText}) -> FlatMap (FlatMap at ExtractOutput[0]) (9/16) (9854fe06e1b1e2f13c9db9e5ebbaba87) switched from CREATED to SCHEDULED.'
INFO apache_beam.utils.subprocess_server:subprocess_server.py:125 b'Mar 07, 2022 12:07:43 AM org.apache.flink.runtime.executiongraph.Execution transitionState'
INFO apache_beam.utils.subprocess_server:subprocess_server.py:125 b'INFO: CHAIN MapPartition (MapPartition at [4]{EstimatePiTransform, WriteToText}) -> FlatMap (FlatMap at ExtractOutput[0]) (10/16) (f1aed0808c9059c3ae8a4760ae3fd879) switched from CREATED to SCHEDULED.'
INFO apache_beam.utils.subprocess_server:subprocess_server.py:125 b'Mar 07, 2022 12:07:43 AM org.apache.flink.runtime.executiongraph.Execution transitionState'
INFO apache_beam.utils.subprocess_server:subprocess_server.py:125 b'INFO: CHAIN MapPartition (MapPartition at [4]{EstimatePiTransform, WriteToText}) -> FlatMap (FlatMap at ExtractOutput[0]) (11/16) (212a01418ca0babb0878fbaba068d782) switched from CREATED to SCHEDULED.'
INFO apache_beam.utils.subprocess_server:subprocess_server.py:125 b'Mar 07, 2022 12:07:43 AM org.apache.flink.runtime.executiongraph.Execution transitionState'
INFO apache_beam.utils.subprocess_server:subprocess_server.py:125 b'INFO: CHAIN MapPartition (MapPartition at [4]{EstimatePiTransform, WriteToText}) -> FlatMap (FlatMap at ExtractOutput[0]) (12/16) (6d61b7a7785475411b1a2008b113f059) switched from CREATED to SCHEDULED.'
INFO apache_beam.utils.subprocess_server:subprocess_server.py:125 b'Mar 07, 2022 12:07:43 AM org.apache.flink.runtime.executiongraph.Execution transitionState'
INFO apache_beam.utils.subprocess_server:subprocess_server.py:125 b'INFO: CHAIN MapPartition (MapPartition at [4]{EstimatePiTransform, WriteToText}) -> FlatMap (FlatMap at ExtractOutput[0]) (13/16) (ed70172b8901658ab5c49f0d5d680acc) switched from CREATED to SCHEDULED.'
INFO apache_beam.utils.subprocess_server:subprocess_server.py:125 b'Mar 07, 2022 12:07:43 AM org.apache.flink.runtime.executiongraph.Execution transitionState'
INFO apache_beam.utils.subprocess_server:subprocess_server.py:125 b'INFO: CHAIN MapPartition (MapPartition at [4]{EstimatePiTransform, WriteToText}) -> FlatMap (FlatMap at ExtractOutput[0]) (14/16) (4c8c9a21e0bc2b3da574406eac44af05) switched from CREATED to SCHEDULED.'
INFO apache_beam.utils.subprocess_server:subprocess_server.py:125 b'Mar 07, 2022 12:07:43 AM org.apache.flink.runtime.executiongraph.Execution transitionState'
INFO apache_beam.utils.subprocess_server:subprocess_server.py:125 b'INFO: CHAIN MapPartition (MapPartition at [4]{EstimatePiTransform, WriteToText}) -> FlatMap (FlatMap at ExtractOutput[0]) (15/16) (ce28e39e542ec659d04f4e237ee9470e) switched from CREATED to SCHEDULED.'
INFO apache_beam.utils.subprocess_server:subprocess_server.py:125 b'Mar 07, 2022 12:07:43 AM org.apache.flink.runtime.executiongraph.Execution transitionState'
INFO apache_beam.utils.subprocess_server:subprocess_server.py:125 b'INFO: CHAIN MapPartition (MapPartition at [4]{EstimatePiTransform, WriteToText}) -> FlatMap (FlatMap at ExtractOutput[0]) (16/16) (c7b43cb469419e554d38f6a59c107496) switched from CREATED to SCHEDULED.'
INFO apache_beam.utils.subprocess_server:subprocess_server.py:125 b'Mar 07, 2022 12:07:43 AM org.apache.flink.runtime.executiongraph.Execution transitionState'
INFO apache_beam.utils.subprocess_server:subprocess_server.py:125 b'INFO: CHAIN MapPartition (MapPartition at [2]WriteToText/Write/WriteImpl/{WriteBundles, Pair}) -> FlatMap (FlatMap at ExtractOutput[0]) -> Map (Key Extractor) -> GroupCombine (GroupCombine at GroupCombine: WriteToText/Write/WriteImpl/GroupByKey) -> Map (Key Extractor) (1/16) (951ae6b519c99e2aa7cbaad47f39f978) switched from CREATED to SCHEDULED.'
INFO apache_beam.utils.subprocess_server:subprocess_server.py:125 b'Mar 07, 2022 12:07:43 AM org.apache.flink.runtime.executiongraph.Execution transitionState'
INFO apache_beam.utils.subprocess_server:subprocess_server.py:125 b'INFO: CHAIN MapPartition (MapPartition at [2]WriteToText/Write/WriteImpl/{WriteBundles, Pair}) -> FlatMap (FlatMap at ExtractOutput[0]) -> Map (Key Extractor) -> GroupCombine (GroupCombine at GroupCombine: WriteToText/Write/WriteImpl/GroupByKey) -> Map (Key Extractor) (2/16) (8fe876df77d22de9ac18a104bd745454) switched from CREATED to SCHEDULED.'
INFO apache_beam.utils.subprocess_server:subprocess_server.py:125 b'Mar 07, 2022 12:07:43 AM org.apache.flink.runtime.executiongraph.Execution transitionState'
INFO apache_beam.utils.subprocess_server:subprocess_server.py:125 b'INFO: CHAIN MapPartition (MapPartition at [2]WriteToText/Write/WriteImpl/{WriteBundles, Pair}) -> FlatMap (FlatMap at ExtractOutput[0]) -> Map (Key Extractor) -> GroupCombine (GroupCombine at GroupCombine: WriteToText/Write/WriteImpl/GroupByKey) -> Map (Key Extractor) (3/16) (a8827f7712377137fdc6ff52bf794271) switched from CREATED to SCHEDULED.'
INFO apache_beam.utils.subprocess_server:subprocess_server.py:125 b'Mar 07, 2022 12:07:43 AM org.apache.flink.runtime.executiongraph.Execution transitionState'
INFO apache_beam.utils.subprocess_server:subprocess_server.py:125 b'INFO: CHAIN MapPartition (MapPartition at [2]WriteToText/Write/WriteImpl/{WriteBundles, Pair}) -> FlatMap (FlatMap at ExtractOutput[0]) -> Map (Key Extractor) -> GroupCombine (GroupCombine at GroupCombine: WriteToText/Write/WriteImpl/GroupByKey) -> Map (Key Extractor) (4/16) (2d83cf2bf330c16518abe3a1eb37117f) switched from CREATED to SCHEDULED.'
INFO apache_beam.utils.subprocess_server:subprocess_server.py:125 b'Mar 07, 2022 12:07:43 AM org.apache.flink.runtime.executiongraph.Execution transitionState'
INFO apache_beam.utils.subprocess_server:subprocess_server.py:125 b'INFO: CHAIN MapPartition (MapPartition at [2]WriteToText/Write/WriteImpl/{WriteBundles, Pair}) -> FlatMap (FlatMap at ExtractOutput[0]) -> Map (Key Extractor) -> GroupCombine (GroupCombine at GroupCombine: WriteToText/Write/WriteImpl/GroupByKey) -> Map (Key Extractor) (5/16) (7d3013ec703e5933ae5075476ea6d3e7) switched from CREATED to SCHEDULED.'
INFO apache_beam.utils.subprocess_server:subprocess_server.py:125 b'Mar 07, 2022 12:07:43 AM org.apache.flink.runtime.executiongraph.Execution transitionState'
INFO apache_beam.utils.subprocess_server:subprocess_server.py:125 b'INFO: CHAIN MapPartition (MapPartition at [2]WriteToText/Write/WriteImpl/{WriteBundles, Pair}) -> FlatMap (FlatMap at ExtractOutput[0]) -> Map (Key Extractor) -> GroupCombine (GroupCombine at GroupCombine: WriteToText/Write/WriteImpl/GroupByKey) -> Map (Key Extractor) (6/16) (30794799a9125572d4ea82dbf4e40c0d) switched from CREATED to SCHEDULED.'
INFO apache_beam.utils.subprocess_server:subprocess_server.py:125 b'Mar 07, 2022 12:07:43 AM org.apache.flink.runtime.executiongraph.Execution transitionState'
INFO apache_beam.utils.subprocess_server:subprocess_server.py:125 b'INFO: CHAIN MapPartition (MapPartition at [2]WriteToText/Write/WriteImpl/{WriteBundles, Pair}) -> FlatMap (FlatMap at ExtractOutput[0]) -> Map (Key Extractor) -> GroupCombine (GroupCombine at GroupCombine: WriteToText/Write/WriteImpl/GroupByKey) -> Map (Key Extractor) (7/16) (54a2b3fcc4769bea14e0a95680fd47d4) switched from CREATED to SCHEDULED.'
INFO apache_beam.utils.subprocess_server:subprocess_server.py:125 b'Mar 07, 2022 12:07:43 AM org.apache.flink.runtime.executiongraph.Execution transitionState'
INFO apache_beam.utils.subprocess_server:subprocess_server.py:125 b'INFO: CHAIN MapPartition (MapPartition at [2]WriteToText/Write/WriteImpl/{WriteBundles, Pair}) -> FlatMap (FlatMap at ExtractOutput[0]) -> Map (Key Extractor) -> GroupCombine (GroupCombine at GroupCombine: WriteToText/Write/WriteImpl/GroupByKey) -> Map (Key Extractor) (8/16) (d77bc1fbf76fcc7d5c81585976347066) switched from CREATED to SCHEDULED.'
INFO apache_beam.utils.subprocess_server:subprocess_server.py:125 b'Mar 07, 2022 12:07:43 AM org.apache.flink.runtime.executiongraph.Execution transitionState'
INFO apache_beam.utils.subprocess_server:subprocess_server.py:125 b'INFO: CHAIN MapPartition (MapPartition at [2]WriteToText/Write/WriteImpl/{WriteBundles, Pair}) -> FlatMap (FlatMap at ExtractOutput[0]) -> Map (Key Extractor) -> GroupCombine (GroupCombine at GroupCombine: WriteToText/Write/WriteImpl/GroupByKey) -> Map (Key Extractor) (9/16) (531c0808243ba08ce43547c2d38dd234) switched from CREATED to SCHEDULED.'
INFO apache_beam.utils.subprocess_server:subprocess_server.py:125 b'Mar 07, 2022 12:07:43 AM org.apache.flink.runtime.executiongraph.Execution transitionState'
INFO apache_beam.utils.subprocess_server:subprocess_server.py:125 b'INFO: CHAIN MapPartition (MapPartition at [2]WriteToText/Write/WriteImpl/{WriteBundles, Pair}) -> FlatMap (FlatMap at ExtractOutput[0]) -> Map (Key Extractor) -> GroupCombine (GroupCombine at GroupCombine: WriteToText/Write/WriteImpl/GroupByKey) -> Map (Key Extractor) (10/16) (c6ad4bd7afcb5c9810eb328f78f9213c) switched from CREATED to SCHEDULED.'
INFO apache_beam.utils.subprocess_server:subprocess_server.py:125 b'Mar 07, 2022 12:07:43 AM org.apache.flink.runtime.executiongraph.Execution transitionState'
INFO apache_beam.utils.subprocess_server:subprocess_server.py:125 b'INFO: CHAIN MapPartition (MapPartition at [2]WriteToText/Write/WriteImpl/{WriteBundles, Pair}) -> FlatMap (FlatMap at ExtractOutput[0]) -> Map (Key Extractor) -> GroupCombine (GroupCombine at GroupCombine: WriteToText/Write/WriteImpl/GroupByKey) -> Map (Key Extractor) (11/16) (c9676b5be341382c2003eadc4f4ffd89) switched from CREATED to SCHEDULED.'
INFO apache_beam.utils.subprocess_server:subprocess_server.py:125 b'Mar 07, 2022 12:07:43 AM org.apache.flink.runtime.executiongraph.Execution transitionState'
INFO apache_beam.utils.subprocess_server:subprocess_server.py:125 b'INFO: CHAIN MapPartition (MapPartition at [2]WriteToText/Write/WriteImpl/{WriteBundles, Pair}) -> FlatMap (FlatMap at ExtractOutput[0]) -> Map (Key Extractor) -> GroupCombine (GroupCombine at GroupCombine: WriteToText/Write/WriteImpl/GroupByKey) -> Map (Key Extractor) (12/16) (dead60eac601dffaece31b498619bc00) switched from CREATED to SCHEDULED.'
INFO apache_beam.utils.subprocess_server:subprocess_server.py:125 b'Mar 07, 2022 12:07:43 AM org.apache.flink.runtime.executiongraph.Execution transitionState'
INFO apache_beam.utils.subprocess_server:subprocess_server.py:125 b'INFO: CHAIN MapPartition (MapPartition at [2]WriteToText/Write/WriteImpl/{WriteBundles, Pair}) -> FlatMap (FlatMap at ExtractOutput[0]) -> Map (Key Extractor) -> GroupCombine (GroupCombine at GroupCombine: WriteToText/Write/WriteImpl/GroupByKey) -> Map (Key Extractor) (13/16) (b579d6be325976440dba4987f2bc7758) switched from CREATED to SCHEDULED.'
INFO apache_beam.utils.subprocess_server:subprocess_server.py:125 b'Mar 07, 2022 12:07:43 AM org.apache.flink.runtime.executiongraph.Execution transitionState'
INFO apache_beam.utils.subprocess_server:subprocess_server.py:125 b'INFO: CHAIN MapPartition (MapPartition at [2]WriteToText/Write/WriteImpl/{WriteBundles, Pair}) -> FlatMap (FlatMap at ExtractOutput[0]) -> Map (Key Extractor) -> GroupCombine (GroupCombine at GroupCombine: WriteToText/Write/WriteImpl/GroupByKey) -> Map (Key Extractor) (14/16) (ed3cfda0fcc5b57d5068ee2a60bfad6a) switched from CREATED to SCHEDULED.'
INFO apache_beam.utils.subprocess_server:subprocess_server.py:125 b'Mar 07, 2022 12:07:43 AM org.apache.flink.runtime.executiongraph.Execution transitionState'
INFO apache_beam.utils.subprocess_server:subprocess_server.py:125 b'INFO: CHAIN MapPartition (MapPartition at [2]WriteToText/Write/WriteImpl/{WriteBundles, Pair}) -> FlatMap (FlatMap at ExtractOutput[0]) -> Map (Key Extractor) -> GroupCombine (GroupCombine at GroupCombine: WriteToText/Write/WriteImpl/GroupByKey) -> Map (Key Extractor) (15/16) (0e349ae642ed192fd2a5b5bf4244ecaa) switched from CREATED to SCHEDULED.'
INFO apache_beam.utils.subprocess_server:subprocess_server.py:125 b'Mar 07, 2022 12:07:43 AM org.apache.flink.runtime.executiongraph.Execution transitionState'
INFO apache_beam.utils.subprocess_server:subprocess_server.py:125 b'INFO: CHAIN MapPartition (MapPartition at [2]WriteToText/Write/WriteImpl/{WriteBundles, Pair}) -> FlatMap (FlatMap at ExtractOutput[0]) -> Map (Key Extractor) -> GroupCombine (GroupCombine at GroupCombine: WriteToText/Write/WriteImpl/GroupByKey) -> Map (Key Extractor) (16/16) (8662819d6565311f67523f225f1f55f5) switched from CREATED to SCHEDULED.'
INFO apache_beam.utils.subprocess_server:subprocess_server.py:125 b'Mar 07, 2022 12:07:43 AM org.apache.flink.runtime.executiongraph.Execution transitionState'
INFO apache_beam.utils.subprocess_server:subprocess_server.py:125 b'INFO: GroupReduce (GroupReduce at WriteToText/Write/WriteImpl/GroupByKey) (1/16) (edd4eb033ce882ae271beb0f983af68c) switched from CREATED to SCHEDULED.'
INFO apache_beam.utils.subprocess_server:subprocess_server.py:125 b'Mar 07, 2022 12:07:43 AM org.apache.flink.runtime.executiongraph.Execution transitionState'
INFO apache_beam.utils.subprocess_server:subprocess_server.py:125 b'INFO: GroupReduce (GroupReduce at WriteToText/Write/WriteImpl/GroupByKey) (2/16) (88376236dabe9c8131a190fa90913e60) switched from CREATED to SCHEDULED.'
INFO apache_beam.utils.subprocess_server:subprocess_server.py:125 b'Mar 07, 2022 12:07:43 AM org.apache.flink.runtime.executiongraph.Execution transitionState'
INFO apache_beam.utils.subprocess_server:subprocess_server.py:125 b'INFO: GroupReduce (GroupReduce at WriteToText/Write/WriteImpl/GroupByKey) (3/16) (d5da37328b1f40641f7f2d1c8cf8168f) switched from CREATED to SCHEDULED.'
INFO apache_beam.utils.subprocess_server:subprocess_server.py:125 b'Mar 07, 2022 12:07:43 AM org.apache.flink.runtime.executiongraph.Execution transitionState'
INFO apache_beam.utils.subprocess_server:subprocess_server.py:125 b'INFO: GroupReduce (GroupReduce at WriteToText/Write/WriteImpl/GroupByKey) (4/16) (26c9acf8f983c76b221ddbcf64ed5c2e) switched from CREATED to SCHEDULED.'
INFO apache_beam.utils.subprocess_server:subprocess_server.py:125 b'Mar 07, 2022 12:07:43 AM org.apache.flink.runtime.executiongraph.Execution transitionState'
INFO apache_beam.utils.subprocess_server:subprocess_server.py:125 b'INFO: GroupReduce (GroupReduce at WriteToText/Write/WriteImpl/GroupByKey) (5/16) (166d570bc068245a8d37b61a3858c348) switched from CREATED to SCHEDULED.'
INFO apache_beam.utils.subprocess_server:subprocess_server.py:125 b'Mar 07, 2022 12:07:43 AM org.apache.flink.runtime.executiongraph.Execution transitionState'
INFO apache_beam.utils.subprocess_server:subprocess_server.py:125 b'INFO: GroupReduce (GroupReduce at WriteToText/Write/WriteImpl/GroupByKey) (6/16) (e0bb5a217a2f28469ce4638e555a6627) switched from CREATED to SCHEDULED.'
INFO apache_beam.utils.subprocess_server:subprocess_server.py:125 b'Mar 07, 2022 12:07:43 AM org.apache.flink.runtime.executiongraph.Execution transitionState'
INFO apache_beam.utils.subprocess_server:subprocess_server.py:125 b'INFO: GroupReduce (GroupReduce at WriteToText/Write/WriteImpl/GroupByKey) (7/16) (da9284159df3ed7ce2fc75525ddc84d1) switched from CREATED to SCHEDULED.'
INFO apache_beam.utils.subprocess_server:subprocess_server.py:125 b'Mar 07, 2022 12:07:43 AM org.apache.flink.runtime.executiongraph.Execution transitionState'
INFO apache_beam.utils.subprocess_server:subprocess_server.py:125 b'INFO: GroupReduce (GroupReduce at WriteToText/Write/WriteImpl/GroupByKey) (8/16) (68896f233b4c8ca05ceede7c230338d5) switched from CREATED to SCHEDULED.'
INFO apache_beam.utils.subprocess_server:subprocess_server.py:125 b'Mar 07, 2022 12:07:43 AM org.apache.flink.runtime.executiongraph.Execution transitionState'
INFO apache_beam.utils.subprocess_server:subprocess_server.py:125 b'INFO: GroupReduce (GroupReduce at WriteToText/Write/WriteImpl/GroupByKey) (9/16) (79b0244e91a08019d9051da1acfd2147) switched from CREATED to SCHEDULED.'
INFO apache_beam.utils.subprocess_server:subprocess_server.py:125 b'Mar 07, 2022 12:07:43 AM org.apache.flink.runtime.executiongraph.Execution transitionState'
INFO apache_beam.utils.subprocess_server:subprocess_server.py:125 b'INFO: GroupReduce (GroupReduce at WriteToText/Write/WriteImpl/GroupByKey) (10/16) (61a4f123bcf759acecc7ebb09c644b08) switched from CREATED to SCHEDULED.'
INFO apache_beam.utils.subprocess_server:subprocess_server.py:125 b'Mar 07, 2022 12:07:43 AM org.apache.flink.runtime.executiongraph.Execution transitionState'
INFO apache_beam.utils.subprocess_server:subprocess_server.py:125 b'INFO: GroupReduce (GroupReduce at WriteToText/Write/WriteImpl/GroupByKey) (11/16) (763464a5594aae6746ff83fc1f8ed94a) switched from CREATED to SCHEDULED.'
INFO apache_beam.utils.subprocess_server:subprocess_server.py:125 b'Mar 07, 2022 12:07:43 AM org.apache.flink.runtime.executiongraph.Execution transitionState'
INFO apache_beam.utils.subprocess_server:subprocess_server.py:125 b'INFO: GroupReduce (GroupReduce at WriteToText/Write/WriteImpl/GroupByKey) (12/16) (cbc7a78048b05cbfebe7d9987e233252) switched from CREATED to SCHEDULED.'
INFO apache_beam.utils.subprocess_server:subprocess_server.py:125 b'Mar 07, 2022 12:07:43 AM org.apache.flink.runtime.executiongraph.Execution transitionState'
INFO apache_beam.utils.subprocess_server:subprocess_server.py:125 b'INFO: GroupReduce (GroupReduce at WriteToText/Write/WriteImpl/GroupByKey) (13/16) (0063a37f566090fccae24de6283bb480) switched from CREATED to SCHEDULED.'
INFO apache_beam.utils.subprocess_server:subprocess_server.py:125 b'Mar 07, 2022 12:07:43 AM org.apache.flink.runtime.executiongraph.Execution transitionState'
INFO apache_beam.utils.subprocess_server:subprocess_server.py:125 b'INFO: GroupReduce (GroupReduce at WriteToText/Write/WriteImpl/GroupByKey) (14/16) (1a2eae4382ed2bd4cf73bc6ff0a2378c) switched from CREATED to SCHEDULED.'
INFO apache_beam.utils.subprocess_server:subprocess_server.py:125 b'Mar 07, 2022 12:07:43 AM org.apache.flink.runtime.executiongraph.Execution transitionState'
INFO apache_beam.utils.subprocess_server:subprocess_server.py:125 b'INFO: GroupReduce (GroupReduce at WriteToText/Write/WriteImpl/GroupByKey) (15/16) (eb99ab3483366f56dcf6eff7d36bde11) switched from CREATED to SCHEDULED.'
INFO apache_beam.utils.subprocess_server:subprocess_server.py:125 b'Mar 07, 2022 12:07:43 AM org.apache.flink.runtime.executiongraph.Execution transitionState'
INFO apache_beam.utils.subprocess_server:subprocess_server.py:125 b'INFO: GroupReduce (GroupReduce at WriteToText/Write/WriteImpl/GroupByKey) (16/16) (3fa4d8b3ae0316092a58d4ce57c1fb4f) switched from CREATED to SCHEDULED.'
INFO apache_beam.utils.subprocess_server:subprocess_server.py:125 b'Mar 07, 2022 12:07:43 AM org.apache.flink.runtime.executiongraph.Execution transitionState'
INFO apache_beam.utils.subprocess_server:subprocess_server.py:125 b'INFO: CHAIN MapPartition (MapPartition at [1]WriteToText/Write/WriteImpl/Extract) -> FlatMap (FlatMap at ExtractOutput[0]) (1/16) (c387bc92e9e03855e2b4fc62352d112c) switched from CREATED to SCHEDULED.'
INFO apache_beam.utils.subprocess_server:subprocess_server.py:125 b'Mar 07, 2022 12:07:43 AM org.apache.flink.runtime.executiongraph.Execution transitionState'
INFO apache_beam.utils.subprocess_server:subprocess_server.py:125 b'INFO: CHAIN MapPartition (MapPartition at [1]WriteToText/Write/WriteImpl/Extract) -> FlatMap (FlatMap at ExtractOutput[0]) (2/16) (6b86e3c7784fa4204dfe4618a6832a7c) switched from CREATED to SCHEDULED.'
INFO apache_beam.utils.subprocess_server:subprocess_server.py:125 b'Mar 07, 2022 12:07:43 AM org.apache.flink.runtime.executiongraph.Execution transitionState'
INFO apache_beam.utils.subprocess_server:subprocess_server.py:125 b'INFO: CHAIN MapPartition (MapPartition at [1]WriteToText/Write/WriteImpl/Extract) -> FlatMap (FlatMap at ExtractOutput[0]) (3/16) (16396959f2918abbab48c1637eeb1581) switched from CREATED to SCHEDULED.'
INFO apache_beam.utils.subprocess_server:subprocess_server.py:125 b'Mar 07, 2022 12:07:43 AM org.apache.flink.runtime.executiongraph.Execution transitionState'
INFO apache_beam.utils.subprocess_server:subprocess_server.py:125 b'INFO: CHAIN MapPartition (MapPartition at [1]WriteToText/Write/WriteImpl/Extract) -> FlatMap (FlatMap at ExtractOutput[0]) (4/16) (cf2b78a5c9c0a8ff42071d0d2c7a42b5) switched from CREATED to SCHEDULED.'
INFO apache_beam.utils.subprocess_server:subprocess_server.py:125 b'Mar 07, 2022 12:07:43 AM org.apache.flink.runtime.executiongraph.Execution transitionState'
INFO apache_beam.utils.subprocess_server:subprocess_server.py:125 b'INFO: CHAIN MapPartition (MapPartition at [1]WriteToText/Write/WriteImpl/Extract) -> FlatMap (FlatMap at ExtractOutput[0]) (5/16) (16ea3ebeddc64db381df37d2e00b4bc6) switched from CREATED to SCHEDULED.'
INFO apache_beam.utils.subprocess_server:subprocess_server.py:125 b'Mar 07, 2022 12:07:43 AM org.apache.flink.runtime.executiongraph.Execution transitionState'
INFO apache_beam.utils.subprocess_server:subprocess_server.py:125 b'INFO: CHAIN MapPartition (MapPartition at [1]WriteToText/Write/WriteImpl/Extract) -> FlatMap (FlatMap at ExtractOutput[0]) (6/16) (8658ff30a71de230a6dea638df4766e1) switched from CREATED to SCHEDULED.'
INFO apache_beam.utils.subprocess_server:subprocess_server.py:125 b'Mar 07, 2022 12:07:43 AM org.apache.flink.runtime.executiongraph.Execution transitionState'
INFO apache_beam.utils.subprocess_server:subprocess_server.py:125 b'INFO: CHAIN MapPartition (MapPartition at [1]WriteToText/Write/WriteImpl/Extract) -> FlatMap (FlatMap at ExtractOutput[0]) (7/16) (74f63feb44b5d947ab114199e4bd4a33) switched from CREATED to SCHEDULED.'
INFO apache_beam.utils.subprocess_server:subprocess_server.py:125 b'Mar 07, 2022 12:07:43 AM org.apache.flink.runtime.executiongraph.Execution transitionState'
INFO apache_beam.utils.subprocess_server:subprocess_server.py:125 b'INFO: CHAIN MapPartition (MapPartition at [1]WriteToText/Write/WriteImpl/Extract) -> FlatMap (FlatMap at ExtractOutput[0]) (8/16) (a8b34078ebb6286214091481768443ac) switched from CREATED to SCHEDULED.'
INFO apache_beam.utils.subprocess_server:subprocess_server.py:125 b'Mar 07, 2022 12:07:43 AM org.apache.flink.runtime.executiongraph.Execution transitionState'
INFO apache_beam.utils.subprocess_server:subprocess_server.py:125 b'INFO: CHAIN MapPartition (MapPartition at [1]WriteToText/Write/WriteImpl/Extract) -> FlatMap (FlatMap at ExtractOutput[0]) (9/16) (a16f307888d2aee9b40838365e928905) switched from CREATED to SCHEDULED.'
java.lang.OutOfMemoryError: GC overhead limit exceeded
Build step 'Invoke Gradle script' changed build result to FAILURE
Build step 'Invoke Gradle script' marked build as failure
---------------------------------------------------------------------
To unsubscribe, e-mail: builds-unsubscribe@beam.apache.org
For additional commands, e-mail: builds-help@beam.apache.org