You are viewing a plain text version of this content. The canonical link for it is here.
Posted to dev@zookeeper.apache.org by Apache Jenkins Server <je...@builds.apache.org> on 2011/12/08 01:21:26 UTC
Failed: ZOOKEEPER-1320 PreCommit Build #810
Jira: https://issues.apache.org/jira/browse/ZOOKEEPER-1320
Build: https://builds.apache.org/job/PreCommit-ZOOKEEPER-Build/810/
###################################################################################
########################## LAST 60 LINES OF THE CONSOLE ###########################
[...truncated 82 lines...]
[exec] Hunk #1 succeeded at 44 (offset 11 lines).
[exec] Hunk #2 succeeded at 281 (offset 87 lines).
[exec] Hunk #3 FAILED at 223.
[exec] Hunk #4 FAILED at 250.
[exec] Hunk #5 FAILED at 309.
[exec] Hunk #6 FAILED at 336.
[exec] Hunk #7 FAILED at 361.
[exec] 5 out of 7 hunks FAILED -- saving rejects to file src/java/main/org/apache/zookeeper/server/PrepRequestProcessor.java.rej
[exec] PATCH APPLICATION FAILED
[exec]
[exec]
[exec]
[exec]
[exec] -1 overall. Here are the results of testing the latest attachment
[exec] http://issues.apache.org/jira/secure/attachment/12506400/ZOOKEEPER-1320-iplimited.patch
[exec] against trunk revision 1208979.
[exec]
[exec] -1 @author. The patch appears to contain 1 @author tags which the Zookeeper community has agreed to not allow in code contributions.
[exec]
[exec] -1 tests included. The patch doesn't appear to include any new or modified tests.
[exec] Please justify why no new tests are needed for this patch.
[exec] Also please list what manual steps were performed to verify this patch.
[exec]
[exec] -1 patch. The patch command could not apply the patch.
[exec]
[exec] Console output: https://builds.apache.org/job/PreCommit-ZOOKEEPER-Build/810//console
[exec]
[exec] This message is automatically generated.
[exec]
[exec]
[exec] ======================================================================
[exec] ======================================================================
[exec] Adding comment to Jira.
[exec] ======================================================================
[exec] ======================================================================
[exec]
[exec]
[exec] Comment added.
[exec] T6M1hv1rAQ logged out
[exec]
[exec]
[exec] ======================================================================
[exec] ======================================================================
[exec] Finished build.
[exec] ======================================================================
[exec] ======================================================================
[exec]
[exec]
BUILD FAILED
/home/jenkins/jenkins-slave/workspace/PreCommit-ZOOKEEPER-Build/trunk/build.xml:1567: exec returned: 1
Total time: 41 seconds
Build step 'Execute shell' marked build as failure
Archiving artifacts
Recording test results
Description set: ZOOKEEPER-1320
Email was triggered for: Failure
Sending email for trigger: Failure
###################################################################################
############################## FAILED TESTS (if any) ##############################
No tests ran.
Success: ZOOKEEPER-1319 PreCommit Build #812
Posted by Apache Jenkins Server <je...@builds.apache.org>.
Jira: https://issues.apache.org/jira/browse/ZOOKEEPER-1319
Build: https://builds.apache.org/job/PreCommit-ZOOKEEPER-Build/812/
###################################################################################
########################## LAST 60 LINES OF THE CONSOLE ###########################
[...truncated 134847 lines...]
[exec] BUILD SUCCESSFUL
[exec] Total time: 0 seconds
[exec]
[exec]
[exec]
[exec]
[exec] +1 overall. Here are the results of testing the latest attachment
[exec] http://issues.apache.org/jira/secure/attachment/12506569/ZOOKEEPER-1319_trunk2.patch
[exec] against trunk revision 1208979.
[exec]
[exec] +1 @author. The patch does not contain any @author tags.
[exec]
[exec] +1 tests included. The patch appears to include 6 new or modified tests.
[exec]
[exec] +1 javadoc. The javadoc tool did not generate any warning messages.
[exec]
[exec] +1 javac. The applied patch does not increase the total number of javac compiler warnings.
[exec]
[exec] +1 findbugs. The patch does not introduce any new Findbugs (version 1.3.9) warnings.
[exec]
[exec] +1 release audit. The applied patch does not increase the total number of release audit warnings.
[exec]
[exec] +1 core tests. The patch passed core unit tests.
[exec]
[exec] +1 contrib tests. The patch passed contrib unit tests.
[exec]
[exec] Test results: https://builds.apache.org/job/PreCommit-ZOOKEEPER-Build/812//testReport/
[exec] Findbugs warnings: https://builds.apache.org/job/PreCommit-ZOOKEEPER-Build/812//artifact/trunk/build/test/findbugs/newPatchFindbugsWarnings.html
[exec] Console output: https://builds.apache.org/job/PreCommit-ZOOKEEPER-Build/812//console
[exec]
[exec] This message is automatically generated.
[exec]
[exec]
[exec] ======================================================================
[exec] ======================================================================
[exec] Adding comment to Jira.
[exec] ======================================================================
[exec] ======================================================================
[exec]
[exec]
[exec] Comment added.
[exec] lCCFUn41a2 logged out
[exec]
[exec]
[exec] ======================================================================
[exec] ======================================================================
[exec] Finished build.
[exec] ======================================================================
[exec] ======================================================================
[exec]
[exec]
BUILD SUCCESSFUL
Total time: 23 minutes 56 seconds
Archiving artifacts
Recording test results
Description set: ZOOKEEPER-1319
Email was triggered for: Success
Sending email for trigger: Success
###################################################################################
############################## FAILED TESTS (if any) ##############################
All tests passed
Failed: ZOOKEEPER-1322 PreCommit Build #811
Posted by Apache Jenkins Server <je...@builds.apache.org>.
Jira: https://issues.apache.org/jira/browse/ZOOKEEPER-1322
Build: https://builds.apache.org/job/PreCommit-ZOOKEEPER-Build/811/
###################################################################################
########################## LAST 60 LINES OF THE CONSOLE ###########################
[...truncated 139710 lines...]
[exec]
[exec] -1 overall. Here are the results of testing the latest attachment
[exec] http://issues.apache.org/jira/secure/attachment/12506554/ZOOKEEPER-1322_trunk.patch
[exec] against trunk revision 1208979.
[exec]
[exec] +1 @author. The patch does not contain any @author tags.
[exec]
[exec] -1 tests included. The patch doesn't appear to include any new or modified tests.
[exec] Please justify why no new tests are needed for this patch.
[exec] Also please list what manual steps were performed to verify this patch.
[exec]
[exec] +1 javadoc. The javadoc tool did not generate any warning messages.
[exec]
[exec] +1 javac. The applied patch does not increase the total number of javac compiler warnings.
[exec]
[exec] +1 findbugs. The patch does not introduce any new Findbugs (version 1.3.9) warnings.
[exec]
[exec] +1 release audit. The applied patch does not increase the total number of release audit warnings.
[exec]
[exec] +1 core tests. The patch passed core unit tests.
[exec]
[exec] +1 contrib tests. The patch passed contrib unit tests.
[exec]
[exec] Test results: https://builds.apache.org/job/PreCommit-ZOOKEEPER-Build/811//testReport/
[exec] Findbugs warnings: https://builds.apache.org/job/PreCommit-ZOOKEEPER-Build/811//artifact/trunk/build/test/findbugs/newPatchFindbugsWarnings.html
[exec] Console output: https://builds.apache.org/job/PreCommit-ZOOKEEPER-Build/811//console
[exec]
[exec] This message is automatically generated.
[exec]
[exec]
[exec] ======================================================================
[exec] ======================================================================
[exec] Adding comment to Jira.
[exec] ======================================================================
[exec] ======================================================================
[exec]
[exec]
[exec] Comment added.
[exec] M7YBl25Ukr logged out
[exec]
[exec]
[exec] ======================================================================
[exec] ======================================================================
[exec] Finished build.
[exec] ======================================================================
[exec] ======================================================================
[exec]
[exec]
BUILD FAILED
/home/jenkins/jenkins-slave/workspace/PreCommit-ZOOKEEPER-Build/trunk/build.xml:1567: exec returned: 1
Total time: 23 minutes 51 seconds
Build step 'Execute shell' marked build as failure
Archiving artifacts
Recording test results
Description set: ZOOKEEPER-1322
Email was triggered for: Failure
Sending email for trigger: Failure
###################################################################################
############################## FAILED TESTS (if any) ##############################
All tests passed