You are viewing a plain text version of this content. The canonical link for it is here.
Posted to dev@poi.apache.org by Apache Jenkins Server <je...@builds.apache.org> on 2015/02/06 01:36:53 UTC
Build failed in Jenkins: POI-OpenJDK #65
See <https://builds.apache.org/job/POI-OpenJDK/65/changes>
Changes:
[nick] Republish JavaDocs
[nick] XWPF implementation of some common Paragraph methods
[nick] Stub a common WP paragraph class, needs uncommenting as XWPF implements/emulates
[nick] More common HWPF/XWPF interfaces
[nick] More common XWPF/HWPF character run methods
[nick] Republish javadocs
[nick] XWPF double strikethrough, and start on a common interface for HWPF and XWPF character runs
------------------------------------------
[...truncated 1417 lines...]
[junit] Running org.apache.poi.hslf.model.TestFreeform
[junit] Tests run: 4, Failures: 0, Errors: 0, Skipped: 0, Time elapsed: 0.047 sec
[junit] Running org.apache.poi.hslf.model.TestHeadersFooters
[junit] Tests run: 5, Failures: 0, Errors: 0, Skipped: 0, Time elapsed: 0.04 sec
[junit] Running org.apache.poi.hslf.model.TestHyperlink
[junit] Tests run: 1, Failures: 0, Errors: 0, Skipped: 0, Time elapsed: 0.006 sec
[junit] Running org.apache.poi.hslf.model.TestImagePainter
[junit] Tests run: 1, Failures: 0, Errors: 0, Skipped: 0, Time elapsed: 0.002 sec
[junit] Running org.apache.poi.hslf.model.TestLine
[junit] Tests run: 1, Failures: 0, Errors: 0, Skipped: 0, Time elapsed: 0.005 sec
[junit] Running org.apache.poi.hslf.model.TestMovieShape
[junit] Tests run: 1, Failures: 0, Errors: 0, Skipped: 0, Time elapsed: 0.01 sec
[junit] Running org.apache.poi.hslf.model.TestOleEmbedding
[junit] Tests run: 3, Failures: 0, Errors: 0, Skipped: 0, Time elapsed: 0.128 sec
[junit] Running org.apache.poi.hslf.model.TestPPFont
[junit] Tests run: 1, Failures: 0, Errors: 0, Skipped: 0, Time elapsed: 0.004 sec
[junit] Running org.apache.poi.hslf.model.TestPPGraphics2D
[junit] Tests run: 1, Failures: 0, Errors: 0, Skipped: 0, Time elapsed: 0.014 sec
[junit] Running org.apache.poi.hslf.model.TestPicture
[junit] Tests run: 4, Failures: 0, Errors: 0, Skipped: 1, Time elapsed: 0.26 sec
[junit] Running org.apache.poi.hslf.model.TestSetBoldItalic
[junit] Tests run: 1, Failures: 0, Errors: 0, Skipped: 0, Time elapsed: 0.204 sec
[junit] Running org.apache.poi.hslf.model.TestShapes
[junit] Tests run: 10, Failures: 0, Errors: 0, Skipped: 0, Time elapsed: 0.13 sec
[junit] Running org.apache.poi.hslf.model.TestSheet
[junit] Tests run: 1, Failures: 0, Errors: 0, Skipped: 0, Time elapsed: 0.017 sec
[junit] Running org.apache.poi.hslf.model.TestSlideChangeNotes
[junit] Tests run: 2, Failures: 0, Errors: 0, Skipped: 0, Time elapsed: 0.002 sec
[junit] Running org.apache.poi.hslf.model.TestSlideMaster
[junit] Tests run: 6, Failures: 0, Errors: 0, Skipped: 0, Time elapsed: 0.024 sec
[junit] Running org.apache.poi.hslf.model.TestSlides
[junit] Tests run: 4, Failures: 0, Errors: 0, Skipped: 0, Time elapsed: 0.023 sec
[junit] Running org.apache.poi.hslf.model.TestTable
[junit] Tests run: 3, Failures: 0, Errors: 0, Skipped: 0, Time elapsed: 0.014 sec
[junit] Running org.apache.poi.hslf.model.TestTextRun
[junit] Tests run: 13, Failures: 0, Errors: 0, Skipped: 0, Time elapsed: 0.064 sec
[junit] Running org.apache.poi.hslf.model.TestTextRunReWrite
[junit] Tests run: 2, Failures: 0, Errors: 0, Skipped: 0, Time elapsed: 0.009 sec
[junit] Running org.apache.poi.hslf.model.TestTextShape
[junit] Tests run: 6, Failures: 0, Errors: 0, Skipped: 0, Time elapsed: 0.016 sec
[junit] Running org.apache.poi.hslf.record.TestAnimationInfoAtom
[junit] Tests run: 3, Failures: 0, Errors: 0, Skipped: 0, Time elapsed: 0.002 sec
[junit] Running org.apache.poi.hslf.record.TestCString
[junit] Tests run: 5, Failures: 0, Errors: 0, Skipped: 0, Time elapsed: 0.002 sec
[junit] Running org.apache.poi.hslf.record.TestColorSchemeAtom
[junit] Tests run: 5, Failures: 0, Errors: 0, Skipped: 0, Time elapsed: 0.002 sec
[junit] Running org.apache.poi.hslf.record.TestComment2000
[junit] Tests run: 8, Failures: 0, Errors: 0, Skipped: 0, Time elapsed: 0.004 sec
[junit] Running org.apache.poi.hslf.record.TestComment2000Atom
[junit] Tests run: 7, Failures: 0, Errors: 0, Skipped: 0, Time elapsed: 0.003 sec
[junit] Running org.apache.poi.hslf.record.TestCurrentUserAtom
[junit] Tests run: 3, Failures: 0, Errors: 0, Skipped: 0, Time elapsed: 0.004 sec
[junit] Running org.apache.poi.hslf.record.TestDocument
[junit] Tests run: 3, Failures: 0, Errors: 0, Skipped: 0, Time elapsed: 0.002 sec
[junit] Running org.apache.poi.hslf.record.TestDocumentAtom
[junit] Tests run: 6, Failures: 0, Errors: 0, Skipped: 0, Time elapsed: 0.002 sec
[junit] Running org.apache.poi.hslf.record.TestDocumentEncryption
[junit] Tests run: 4, Failures: 0, Errors: 0, Skipped: 0, Time elapsed: 0.322 sec
[junit] Running org.apache.poi.hslf.record.TestDocumentEncryptionAtom
[junit] Tests run: 2, Failures: 0, Errors: 0, Skipped: 0, Time elapsed: 0.003 sec
[junit] Running org.apache.poi.hslf.record.TestExControl
[junit] Tests run: 3, Failures: 0, Errors: 0, Skipped: 0, Time elapsed: 0.002 sec
[junit] Running org.apache.poi.hslf.record.TestExHyperlink
[junit] Tests run: 6, Failures: 0, Errors: 0, Skipped: 0, Time elapsed: 0.006 sec
[junit] Running org.apache.poi.hslf.record.TestExHyperlinkAtom
[junit] Tests run: 5, Failures: 0, Errors: 0, Skipped: 0, Time elapsed: 0.002 sec
[junit] Running org.apache.poi.hslf.record.TestExMediaAtom
[junit] Tests run: 4, Failures: 0, Errors: 0, Skipped: 0, Time elapsed: 0.001 sec
[junit] Running org.apache.poi.hslf.record.TestExObjList
[junit] Tests run: 1, Failures: 0, Errors: 0, Skipped: 0, Time elapsed: 0.004 sec
[junit] Running org.apache.poi.hslf.record.TestExObjListAtom
[junit] Tests run: 5, Failures: 0, Errors: 0, Skipped: 0, Time elapsed: 0.002 sec
[junit] Running org.apache.poi.hslf.record.TestExOleObjAtom
[junit] Tests run: 3, Failures: 0, Errors: 0, Skipped: 0, Time elapsed: 0.001 sec
[junit] Running org.apache.poi.hslf.record.TestExOleObjStg
[junit] Tests run: 3, Failures: 0, Errors: 0, Skipped: 0, Time elapsed: 0.002 sec
[junit] Running org.apache.poi.hslf.record.TestExVideoContainer
[junit] Tests run: 3, Failures: 0, Errors: 0, Skipped: 0, Time elapsed: 0.001 sec
[junit] Running org.apache.poi.hslf.record.TestFontCollection
[junit] Tests run: 3, Failures: 0, Errors: 0, Skipped: 0, Time elapsed: 0.001 sec
[junit] Running org.apache.poi.hslf.record.TestHeadersFootersAtom
[junit] Tests run: 4, Failures: 0, Errors: 0, Skipped: 0, Time elapsed: 0.002 sec
[junit] Running org.apache.poi.hslf.record.TestHeadersFootersContainer
[junit] Tests run: 6, Failures: 0, Errors: 0, Skipped: 0, Time elapsed: 0.003 sec
[junit] Running org.apache.poi.hslf.record.TestInteractiveInfo
[junit] Tests run: 4, Failures: 0, Errors: 0, Skipped: 0, Time elapsed: 0.002 sec
[junit] Running org.apache.poi.hslf.record.TestInteractiveInfoAtom
[junit] Tests run: 6, Failures: 0, Errors: 0, Skipped: 0, Time elapsed: 0.002 sec
[junit] Running org.apache.poi.hslf.record.TestNotesAtom
[junit] Tests run: 3, Failures: 0, Errors: 0, Skipped: 0, Time elapsed: 0.002 sec
[junit] Running org.apache.poi.hslf.record.TestRecordContainer
[junit] Tests run: 5, Failures: 0, Errors: 0, Skipped: 0, Time elapsed: 0.01 sec
[junit] Running org.apache.poi.hslf.record.TestRecordTypes
[junit] Tests run: 4, Failures: 0, Errors: 0, Skipped: 0, Time elapsed: 0.002 sec
[junit] Running org.apache.poi.hslf.record.TestSlideAtom
[junit] Tests run: 5, Failures: 0, Errors: 0, Skipped: 0, Time elapsed: 0.006 sec
[junit] Running org.apache.poi.hslf.record.TestSlidePersistAtom
[junit] Tests run: 3, Failures: 0, Errors: 0, Skipped: 0, Time elapsed: 0.002 sec
[junit] Running org.apache.poi.hslf.record.TestSound
[junit] Tests run: 1, Failures: 0, Errors: 0, Skipped: 0, Time elapsed: 0.004 sec
[junit] Running org.apache.poi.hslf.record.TestStyleTextPropAtom
[junit] Tests run: 20, Failures: 0, Errors: 0, Skipped: 0, Time elapsed: 0.006 sec
[junit] Running org.apache.poi.hslf.record.TestTextBytesAtom
[junit] Tests run: 5, Failures: 0, Errors: 0, Skipped: 0, Time elapsed: 0.002 sec
[junit] Running org.apache.poi.hslf.record.TestTextCharsAtom
[junit] Tests run: 6, Failures: 0, Errors: 0, Skipped: 0, Time elapsed: 0.002 sec
[junit] Running org.apache.poi.hslf.record.TestTextHeaderAtom
[junit] Tests run: 3, Failures: 0, Errors: 0, Skipped: 0, Time elapsed: 0.003 sec
[junit] Running org.apache.poi.hslf.record.TestTextRulerAtom
[junit] Tests run: 3, Failures: 0, Errors: 0, Skipped: 0, Time elapsed: 0.002 sec
[junit] Running org.apache.poi.hslf.record.TestTextSpecInfoAtom
[junit] Tests run: 3, Failures: 0, Errors: 0, Skipped: 0, Time elapsed: 0.002 sec
[junit] Running org.apache.poi.hslf.record.TestTxInteractiveInfoAtom
[junit] Tests run: 4, Failures: 0, Errors: 0, Skipped: 0, Time elapsed: 0.002 sec
[junit] Running org.apache.poi.hslf.record.TestTxMasterStyleAtom
[junit] Tests run: 1, Failures: 0, Errors: 0, Skipped: 0, Time elapsed: 0.002 sec
[junit] Running org.apache.poi.hslf.record.TestUserEditAtom
[junit] Tests run: 3, Failures: 0, Errors: 0, Skipped: 0, Time elapsed: 0.002 sec
[junit] Running org.apache.poi.hslf.usermodel.TestAddingSlides
[junit] Tests run: 5, Failures: 0, Errors: 0, Skipped: 0, Time elapsed: 0.078 sec
[junit] Running org.apache.poi.hslf.usermodel.TestBugs
[junit] Tests run: 27, Failures: 0, Errors: 0, Skipped: 0, Time elapsed: 0.45 sec
[junit] Running org.apache.poi.hslf.usermodel.TestCounts
[junit] Tests run: 2, Failures: 0, Errors: 0, Skipped: 0, Time elapsed: 0.002 sec
[junit] Running org.apache.poi.hslf.usermodel.TestFontRendering
[junit] Tests run: 1, Failures: 0, Errors: 0, Skipped: 1, Time elapsed: 0.002 sec
[junit] Running org.apache.poi.hslf.usermodel.TestMostRecentRecords
[junit] Tests run: 3, Failures: 0, Errors: 0, Skipped: 0, Time elapsed: 0.002 sec
[junit] Running org.apache.poi.hslf.usermodel.TestNotesText
[junit] Tests run: 2, Failures: 0, Errors: 0, Skipped: 0, Time elapsed: 0.001 sec
[junit] Running org.apache.poi.hslf.usermodel.TestNumberedList
[junit] Tests run: 1, Failures: 0, Errors: 0, Skipped: 0, Time elapsed: 0.004 sec
[junit] Running org.apache.poi.hslf.usermodel.TestNumberedList2
[junit] Tests run: 1, Failures: 0, Errors: 0, Skipped: 0, Time elapsed: 0.009 sec
[junit] Running org.apache.poi.hslf.usermodel.TestNumberedList3
[junit] Tests run: 1, Failures: 0, Errors: 0, Skipped: 0, Time elapsed: 0.009 sec
[junit] Running org.apache.poi.hslf.usermodel.TestPictures
[junit] Tests run: 10, Failures: 0, Errors: 0, Skipped: 0, Time elapsed: 0.157 sec
[junit] Running org.apache.poi.hslf.usermodel.TestReOrderingSlides
[junit] Tests run: 5, Failures: 0, Errors: 0, Skipped: 0, Time elapsed: 0.031 sec
[junit] Running org.apache.poi.hslf.usermodel.TestRecordSetup
[junit] Tests run: 1, Failures: 0, Errors: 0, Skipped: 0, Time elapsed: 0.001 sec
[junit] Running org.apache.poi.hslf.usermodel.TestRichTextRun
[junit] Tests run: 11, Failures: 0, Errors: 0, Skipped: 0, Time elapsed: 0.191 sec
[junit] Running org.apache.poi.hslf.usermodel.TestSheetText
[junit] Tests run: 3, Failures: 0, Errors: 0, Skipped: 0, Time elapsed: 0.033 sec
[junit] Running org.apache.poi.hslf.usermodel.TestSlideOrdering
[junit] Tests run: 3, Failures: 0, Errors: 0, Skipped: 0, Time elapsed: 0.012 sec
[junit] Running org.apache.poi.hslf.usermodel.TestSoundData
[junit] Tests run: 1, Failures: 0, Errors: 0, Skipped: 0, Time elapsed: 0.003 sec
[junit] Running org.apache.poi.hslf.usermodel.TestTable
[junit] Tests run: 1, Failures: 0, Errors: 0, Skipped: 0, Time elapsed: 0.005 sec
[junit] Running org.apache.poi.hslf.util.TestSystemTimeUtils
[junit] Tests run: 4, Failures: 0, Errors: 0, Skipped: 0, Time elapsed: 0.003 sec
[junit] Running org.apache.poi.hsmf.TestBasics
[junit] Tests run: 8, Failures: 0, Errors: 0, Skipped: 0, Time elapsed: 0.019 sec
[junit] Running org.apache.poi.hsmf.TestBlankFileRead
[junit] Tests run: 7, Failures: 0, Errors: 0, Skipped: 0, Time elapsed: 0.004 sec
[junit] Running org.apache.poi.hsmf.TestFileWithAttachmentsRead
[junit] Tests run: 3, Failures: 0, Errors: 0, Skipped: 0, Time elapsed: 0.003 sec
[junit] Running org.apache.poi.hsmf.TestFixedSizedProperties
[junit] Tests run: 5, Failures: 0, Errors: 0, Skipped: 0, Time elapsed: 0.026 sec
[junit] Running org.apache.poi.hsmf.TestOutlook30FileRead
[junit] Tests run: 9, Failures: 0, Errors: 0, Skipped: 0, Time elapsed: 0.007 sec
[junit] Running org.apache.poi.hsmf.TestSimpleFileRead
[junit] Tests run: 8, Failures: 0, Errors: 0, Skipped: 0, Time elapsed: 0.003 sec
[junit] Running org.apache.poi.hsmf.datatypes.TestChunkData
[junit] Tests run: 6, Failures: 0, Errors: 0, Skipped: 0, Time elapsed: 0.002 sec
[junit] Running org.apache.poi.hsmf.datatypes.TestMAPIProperty
[junit] Tests run: 3, Failures: 0, Errors: 0, Skipped: 0, Time elapsed: 0.002 sec
[junit] Running org.apache.poi.hsmf.datatypes.TestSorters
[junit] Tests run: 2, Failures: 0, Errors: 0, Skipped: 0, Time elapsed: 0.002 sec
[junit] Running org.apache.poi.hsmf.datatypes.TestTypes
[junit] Tests run: 3, Failures: 0, Errors: 0, Skipped: 0, Time elapsed: 0.001 sec
[junit] Running org.apache.poi.hsmf.extractor.TestOutlookTextExtractor
[junit] Tests run: 7, Failures: 0, Errors: 0, Skipped: 0, Time elapsed: 0.047 sec
[junit] Running org.apache.poi.hsmf.parsers.TestPOIFSChunkParser
[junit] Tests run: 6, Failures: 0, Errors: 0, Skipped: 0, Time elapsed: 0.018 sec
[junit] Running org.apache.poi.hssf.converter.TestExcelConverterSuite
[junit] Tests run: 664, Failures: 0, Errors: 0, Skipped: 0, Time elapsed: 10.94 sec
[junit] Running org.apache.poi.hssf.usermodel.TestHSSFChart
[junit] Tests run: 6, Failures: 0, Errors: 0, Skipped: 0, Time elapsed: 0.083 sec
[junit] Running org.apache.poi.hwpf.TestFieldsTables
[junit] Tests run: 1, Failures: 0, Errors: 0, Skipped: 0, Time elapsed: 0.011 sec
[junit] Running org.apache.poi.hwpf.TestHWPFPictures
[junit] Tests run: 5, Failures: 0, Errors: 0, Skipped: 0, Time elapsed: 0.124 sec
[junit] Running org.apache.poi.hwpf.TestHWPFRangeParts
[junit] Tests run: 2, Failures: 0, Errors: 0, Skipped: 0, Time elapsed: 0.037 sec
[junit] Running org.apache.poi.hwpf.converter.TestNumberFormatter
[junit] Tests run: 2, Failures: 0, Errors: 0, Skipped: 0, Time elapsed: 0.229 sec
[junit] Running org.apache.poi.hwpf.converter.TestWordToConverterSuite
[junit] Tests run: 339, Failures: 0, Errors: 0, Skipped: 0, Time elapsed: 4.809 sec
[junit] Running org.apache.poi.hwpf.converter.TestWordToFoConverter
[junit] Tests run: 8, Failures: 0, Errors: 0, Skipped: 0, Time elapsed: 0.018 sec
[junit] Running org.apache.poi.hwpf.converter.TestWordToHtmlConverter
[junit] Tests run: 21, Failures: 0, Errors: 0, Skipped: 0, Time elapsed: 0.159 sec
[junit] Running org.apache.poi.hwpf.converter.TestWordToTextConverter
[junit] Tests run: 3, Failures: 0, Errors: 0, Skipped: 0, Time elapsed: 0.072 sec
[junit] Running org.apache.poi.hwpf.extractor.TestDifferentRoutes
[junit] Tests run: 2, Failures: 0, Errors: 0, Skipped: 0, Time elapsed: 0.002 sec
[junit] Running org.apache.poi.hwpf.extractor.TestWordExtractor
[junit] Tests run: 15, Failures: 0, Errors: 0, Skipped: 0, Time elapsed: 0.067 sec
[junit] Running org.apache.poi.hwpf.extractor.TestWordExtractorBugs
[junit] Tests run: 2, Failures: 0, Errors: 0, Skipped: 0, Time elapsed: 0.202 sec
[junit] Running org.apache.poi.hwpf.model.TestBookmarksTables
[junit] Tests run: 5, Failures: 0, Errors: 0, Skipped: 0, Time elapsed: 0.004 sec
[junit] Running org.apache.poi.hwpf.model.TestCHPBinTable
[junit] Tests run: 1, Failures: 0, Errors: 0, Skipped: 0, Time elapsed: 0.001 sec
[junit] Running org.apache.poi.hwpf.model.TestDocumentProperties
[junit] Tests run: 1, Failures: 0, Errors: 0, Skipped: 0, Time elapsed: 0.004 sec
[junit] Running org.apache.poi.hwpf.model.TestFileInformationBlock
[junit] Tests run: 1, Failures: 0, Errors: 0, Skipped: 0, Time elapsed: 0.003 sec
[junit] Running org.apache.poi.hwpf.model.TestFontTable
[junit] Tests run: 1, Failures: 0, Errors: 0, Skipped: 0, Time elapsed: 0.001 sec
[junit] Running org.apache.poi.hwpf.model.TestListTables
[junit] Tests run: 1, Failures: 0, Errors: 0, Skipped: 0, Time elapsed: 0.001 sec
[junit] Running org.apache.poi.hwpf.model.TestNotesTables
[junit] Tests run: 1, Failures: 0, Errors: 0, Skipped: 0, Time elapsed: 0.001 sec
[junit] Running org.apache.poi.hwpf.model.TestPAPBinTable
[junit] Tests run: 2, Failures: 0, Errors: 0, Skipped: 0, Time elapsed: 0.009 sec
[junit] Running org.apache.poi.hwpf.model.TestPlexOfCps
[junit] Tests run: 1, Failures: 0, Errors: 0, Skipped: 0, Time elapsed: 0.001 sec
[junit] Running org.apache.poi.hwpf.model.TestRevisionMarkAuthorTable
[junit] Tests run: 3, Failures: 0, Errors: 0, Skipped: 0, Time elapsed: 0.004 sec
[junit] Running org.apache.poi.hwpf.model.TestSavedByTable
[junit] Tests run: 1, Failures: 0, Errors: 0, Skipped: 0, Time elapsed: 0.013 sec
[junit] Running org.apache.poi.hwpf.model.TestSectionTable
[junit] Tests run: 1, Failures: 0, Errors: 0, Skipped: 0, Time elapsed: 0.001 sec
[junit] Running org.apache.poi.hwpf.model.TestStyleSheet
[junit] Tests run: 2, Failures: 0, Errors: 0, Skipped: 0, Time elapsed: 0.002 sec
[junit] Running org.apache.poi.hwpf.model.TestTextPieceTable
[junit] Tests run: 3, Failures: 0, Errors: 0, Skipped: 0, Time elapsed: 0.006 sec
[junit] Running org.apache.poi.hwpf.sprm.TestSprms
[junit] Tests run: 2, Failures: 0, Errors: 0, Skipped: 0, Time elapsed: 0.005 sec
[junit] Running org.apache.poi.hwpf.usermodel.TestBorderCode
[junit] Tests run: 1, Failures: 0, Errors: 0, Skipped: 0, Time elapsed: 0.001 sec
[junit] Running org.apache.poi.hwpf.usermodel.TestBug46610
[junit] Tests run: 3, Failures: 0, Errors: 0, Skipped: 0, Time elapsed: 0.006 sec
[junit] Running org.apache.poi.hwpf.usermodel.TestBug47563
[junit] Tests run: 1, Failures: 1, Errors: 0, Skipped: 0, Time elapsed: 0.057 sec
BUILD FAILED
<https://builds.apache.org/job/POI-OpenJDK/ws/build.xml>:995: Tests failed
Total time: 3 minutes 21 seconds
Build step 'Invoke Ant' marked build as failure
[WARNINGS] Skipping publisher since build result is FAILURE
Archiving artifacts
Recording test results
---------------------------------------------------------------------
To unsubscribe, e-mail: dev-unsubscribe@poi.apache.org
For additional commands, e-mail: dev-help@poi.apache.org
Jenkins build is back to normal : POI-OpenJDK #67
Posted by Apache Jenkins Server <je...@builds.apache.org>.
See <https://builds.apache.org/job/POI-OpenJDK/67/changes>
---------------------------------------------------------------------
To unsubscribe, e-mail: dev-unsubscribe@poi.apache.org
For additional commands, e-mail: dev-help@poi.apache.org
Build failed in Jenkins: POI-OpenJDK #66
Posted by Apache Jenkins Server <je...@builds.apache.org>.
See <https://builds.apache.org/job/POI-OpenJDK/66/changes>
Changes:
[nick] Republish javadocs
[nick] Finish converting ErrorEval to only use the FormulaError constants, and then finish unit test for 57535
[nick] Prepare FormulaError for both long and short codes
[nick] Add a unit test (disabled) for bug #57535 - "Unknown error type: -60" fetching formula error value
[nick] Reduce duplication between FormulaError and ErrorConstants
------------------------------------------
[...truncated 1785 lines...]
[junit] Running org.apache.poi.xslf.usermodel.TestXSLFShape
[junit] Tests run: 2, Failures: 0, Errors: 0, Skipped: 0, Time elapsed: 0.055 sec
[junit] Running org.apache.poi.xslf.usermodel.TestXSLFShapeContainer
[junit] Tests run: 1, Failures: 0, Errors: 0, Skipped: 0, Time elapsed: 0.025 sec
[junit] Running org.apache.poi.xslf.usermodel.TestXSLFSheet
[junit] Tests run: 1, Failures: 0, Errors: 0, Skipped: 0, Time elapsed: 0.067 sec
[junit] Running org.apache.poi.xslf.usermodel.TestXSLFSimpleShape
[junit] Tests run: 5, Failures: 0, Errors: 0, Skipped: 0, Time elapsed: 0.139 sec
[junit] Running org.apache.poi.xslf.usermodel.TestXSLFSlide
[junit] Tests run: 4, Failures: 0, Errors: 0, Skipped: 0, Time elapsed: 1.522 sec
[junit] Running org.apache.poi.xslf.usermodel.TestXSLFSlideShow
[junit] Tests run: 5, Failures: 0, Errors: 0, Skipped: 0, Time elapsed: 0.185 sec
[junit] Running org.apache.poi.xslf.usermodel.TestXSLFTable
[junit] Tests run: 2, Failures: 0, Errors: 0, Skipped: 0, Time elapsed: 0.073 sec
[junit] Running org.apache.poi.xslf.usermodel.TestXSLFTableStyles
[junit] Tests run: 2, Failures: 0, Errors: 0, Skipped: 0, Time elapsed: 0.024 sec
[junit] Running org.apache.poi.xslf.usermodel.TestXSLFTextBox
[junit] Tests run: 2, Failures: 0, Errors: 0, Skipped: 0, Time elapsed: 0.042 sec
[junit] Running org.apache.poi.xslf.usermodel.TestXSLFTextParagraph
[junit] Tests run: 5, Failures: 0, Errors: 0, Skipped: 0, Time elapsed: 0.1 sec
[junit] Running org.apache.poi.xslf.usermodel.TestXSLFTextRun
[junit] Tests run: 1, Failures: 0, Errors: 0, Skipped: 0, Time elapsed: 0.023 sec
[junit] Running org.apache.poi.xslf.usermodel.TestXSLFTextShape
[junit] Tests run: 3, Failures: 0, Errors: 0, Skipped: 0, Time elapsed: 0.121 sec
[junit] Running org.apache.poi.xslf.usermodel.TestXSLFTheme
[junit] Tests run: 1, Failures: 0, Errors: 0, Skipped: 0, Time elapsed: 0.244 sec
[junit] Running org.apache.poi.xssf.TestSheetProtection
[junit] Tests run: 17, Failures: 0, Errors: 0, Skipped: 0, Time elapsed: 0.112 sec
[junit] Running org.apache.poi.xssf.TestWorkbookProtection
[junit] Tests run: 7, Failures: 0, Errors: 0, Skipped: 0, Time elapsed: 0.321 sec
[junit] Running org.apache.poi.xssf.eventusermodel.TestReadOnlySharedStringsTable
[junit] Tests run: 1, Failures: 0, Errors: 0, Skipped: 0, Time elapsed: 0.005 sec
[junit] Running org.apache.poi.xssf.eventusermodel.TestXSSFReader
[junit] Tests run: 8, Failures: 0, Errors: 0, Skipped: 0, Time elapsed: 0.07 sec
[junit] Running org.apache.poi.xssf.extractor.TestXSSFEventBasedExcelExtractor
[junit] Tests run: 8, Failures: 0, Errors: 0, Skipped: 0, Time elapsed: 0.333 sec
[junit] Running org.apache.poi.xssf.extractor.TestXSSFEventBasedExcelExtractorUsingFactory
[junit] Tests run: 8, Failures: 0, Errors: 0, Skipped: 0, Time elapsed: 0.222 sec
[junit] Running org.apache.poi.xssf.extractor.TestXSSFExcelExtractor
[junit] Tests run: 7, Failures: 0, Errors: 0, Skipped: 0, Time elapsed: 0.52 sec
[junit] Running org.apache.poi.xssf.extractor.TestXSSFExcelExtractorUsingFactory
[junit] Tests run: 7, Failures: 0, Errors: 0, Skipped: 0, Time elapsed: 0.41 sec
[junit] Running org.apache.poi.xssf.extractor.TestXSSFExportToXML
[junit] Tests run: 15, Failures: 0, Errors: 0, Skipped: 0, Time elapsed: 0.318 sec
[junit] Running org.apache.poi.xssf.extractor.TestXSSFImportFromXML
[junit] Tests run: 4, Failures: 0, Errors: 0, Skipped: 0, Time elapsed: 0.158 sec
[junit] Running org.apache.poi.xssf.io.TestLoadSaveXSSF
[junit] Tests run: 3, Failures: 0, Errors: 0, Skipped: 0, Time elapsed: 0.036 sec
[junit] Running org.apache.poi.xssf.model.TestCalculationChain
[junit] Tests run: 1, Failures: 0, Errors: 0, Skipped: 0, Time elapsed: 0.455 sec
[junit] Running org.apache.poi.xssf.model.TestCommentsTable
[junit] Tests run: 7, Failures: 0, Errors: 0, Skipped: 0, Time elapsed: 0.16 sec
[junit] Running org.apache.poi.xssf.model.TestExternalLinksTable
[junit] Tests run: 4, Failures: 0, Errors: 0, Skipped: 0, Time elapsed: 0.06 sec
[junit] Running org.apache.poi.xssf.model.TestMapInfo
[junit] Tests run: 1, Failures: 0, Errors: 0, Skipped: 0, Time elapsed: 0.012 sec
[junit] Running org.apache.poi.xssf.model.TestSharedStringsTable
[junit] Tests run: 3, Failures: 0, Errors: 0, Skipped: 0, Time elapsed: 0.111 sec
[junit] Running org.apache.poi.xssf.model.TestStylesTable
[junit] Tests run: 6, Failures: 0, Errors: 0, Skipped: 0, Time elapsed: 0.109 sec
[junit] Running org.apache.poi.xssf.model.TestThemesTable
[junit] Tests run: 1, Failures: 0, Errors: 0, Skipped: 0, Time elapsed: 0.018 sec
[junit] Running org.apache.poi.xssf.streaming.TestOutlining
[junit] Tests run: 3, Failures: 0, Errors: 0, Skipped: 0, Time elapsed: 0.036 sec
[junit] Running org.apache.poi.xssf.streaming.TestSXSSFCell
[junit] Tests run: 24, Failures: 0, Errors: 0, Skipped: 0, Time elapsed: 0.614 sec
[junit] Running org.apache.poi.xssf.streaming.TestSXSSFDataValidation
[junit] Tests run: 2, Failures: 0, Errors: 0, Skipped: 0, Time elapsed: 0.167 sec
[junit] Running org.apache.poi.xssf.streaming.TestSXSSFHyperlink
[junit] Tests run: 1, Failures: 0, Errors: 0, Skipped: 0, Time elapsed: 0.018 sec
[junit] Running org.apache.poi.xssf.streaming.TestSXSSFRow
[junit] Tests run: 10, Failures: 0, Errors: 0, Skipped: 0, Time elapsed: 0.276 sec
[junit] Running org.apache.poi.xssf.streaming.TestSXSSFSheet
[junit] Tests run: 32, Failures: 0, Errors: 0, Skipped: 0, Time elapsed: 0.171 sec
[junit] Running org.apache.poi.xssf.streaming.TestSXSSFWorkbook
[junit] Tests run: 19, Failures: 0, Errors: 0, Skipped: 0, Time elapsed: 0.805 sec
[junit] Running org.apache.poi.xssf.usermodel.TestFormulaEvaluatorOnXSSF
[junit] Tests run: 2, Failures: 0, Errors: 0, Skipped: 0, Time elapsed: 0.496 sec
[junit] Running org.apache.poi.xssf.usermodel.TestMissingWorkbookOnXSSF
[junit] Tests run: 3, Failures: 0, Errors: 0, Skipped: 0, Time elapsed: 0.033 sec
[junit] Running org.apache.poi.xssf.usermodel.TestMultiSheetFormulaEvaluatorOnXSSF
[junit] Tests run: 1, Failures: 0, Errors: 0, Skipped: 0, Time elapsed: 0.011 sec
[junit] Running org.apache.poi.xssf.usermodel.TestSheetHiding
[junit] Tests run: 5, Failures: 0, Errors: 0, Skipped: 0, Time elapsed: 0.076 sec
[junit] Running org.apache.poi.xssf.usermodel.TestXSSFBugs
[junit] Tests run: 82, Failures: 0, Errors: 0, Skipped: 2, Time elapsed: 3.659 sec
[junit] Running org.apache.poi.xssf.usermodel.TestXSSFCell
[junit] Tests run: 36, Failures: 0, Errors: 0, Skipped: 0, Time elapsed: 0.826 sec
[junit] Running org.apache.poi.xssf.usermodel.TestXSSFCellStyle
[junit] Tests run: 37, Failures: 0, Errors: 0, Skipped: 0, Time elapsed: 0.157 sec
[junit] Running org.apache.poi.xssf.usermodel.TestXSSFChart
[junit] Tests run: 3, Failures: 0, Errors: 0, Skipped: 0, Time elapsed: 0.096 sec
[junit] Running org.apache.poi.xssf.usermodel.TestXSSFChartSheet
[junit] Tests run: 3, Failures: 0, Errors: 0, Skipped: 0, Time elapsed: 0.03 sec
[junit] Running org.apache.poi.xssf.usermodel.TestXSSFColGrouping
[junit] Tests run: 6, Failures: 0, Errors: 0, Skipped: 0, Time elapsed: 0.052 sec
[junit] Running org.apache.poi.xssf.usermodel.TestXSSFColor
[junit] Tests run: 3, Failures: 0, Errors: 0, Skipped: 0, Time elapsed: 0.041 sec
[junit] Running org.apache.poi.xssf.usermodel.TestXSSFComment
[junit] Tests run: 12, Failures: 0, Errors: 0, Skipped: 0, Time elapsed: 0.105 sec
[junit] Running org.apache.poi.xssf.usermodel.TestXSSFConditionalFormatting
[junit] Tests run: 13, Failures: 0, Errors: 0, Skipped: 0, Time elapsed: 0.054 sec
[junit] Running org.apache.poi.xssf.usermodel.TestXSSFDataFormat
[junit] Tests run: 2, Failures: 0, Errors: 0, Skipped: 0, Time elapsed: 0.007 sec
[junit] Running org.apache.poi.xssf.usermodel.TestXSSFDataValidation
[junit] Tests run: 6, Failures: 0, Errors: 0, Skipped: 0, Time elapsed: 0.216 sec
[junit] Running org.apache.poi.xssf.usermodel.TestXSSFDialogSheet
[junit] Tests run: 14, Failures: 0, Errors: 0, Skipped: 0, Time elapsed: 0.023 sec
[junit] Running org.apache.poi.xssf.usermodel.TestXSSFDrawing
[junit] Tests run: 18, Failures: 0, Errors: 0, Skipped: 0, Time elapsed: 0.316 sec
[junit] Running org.apache.poi.xssf.usermodel.TestXSSFExternalFunctions
[junit] Tests run: 2, Failures: 0, Errors: 0, Skipped: 0, Time elapsed: 0.009 sec
[junit] Running org.apache.poi.xssf.usermodel.TestXSSFFont
[junit] Tests run: 19, Failures: 0, Errors: 0, Skipped: 0, Time elapsed: 0.042 sec
[junit] Running org.apache.poi.xssf.usermodel.TestXSSFFormulaEvaluation
[junit] Tests run: 22, Failures: 0, Errors: 0, Skipped: 0, Time elapsed: 0.3 sec
[junit] Running org.apache.poi.xssf.usermodel.TestXSSFFormulaParser
[junit] Tests run: 6, Failures: 0, Errors: 0, Skipped: 0, Time elapsed: 0.033 sec
[junit] Running org.apache.poi.xssf.usermodel.TestXSSFHeaderFooter
[junit] Tests run: 2, Failures: 0, Errors: 0, Skipped: 0, Time elapsed: 0.003 sec
[junit] Running org.apache.poi.xssf.usermodel.TestXSSFHyperlink
[junit] Tests run: 8, Failures: 0, Errors: 0, Skipped: 0, Time elapsed: 0.149 sec
[junit] Running org.apache.poi.xssf.usermodel.TestXSSFName
[junit] Tests run: 20, Failures: 0, Errors: 0, Skipped: 0, Time elapsed: 0.06 sec
[junit] Running org.apache.poi.xssf.usermodel.TestXSSFPicture
[junit] Tests run: 6, Failures: 0, Errors: 0, Skipped: 0, Time elapsed: 0.089 sec
[junit] Running org.apache.poi.xssf.usermodel.TestXSSFPictureData
[junit] Tests run: 3, Failures: 0, Errors: 0, Skipped: 0, Time elapsed: 0.068 sec
[junit] Running org.apache.poi.xssf.usermodel.TestXSSFPivotTable
[junit] Tests run: 13, Failures: 0, Errors: 0, Skipped: 0, Time elapsed: 0.1 sec
[junit] Running org.apache.poi.xssf.usermodel.TestXSSFPrintSetup
[junit] Tests run: 16, Failures: 0, Errors: 0, Skipped: 0, Time elapsed: 0.018 sec
[junit] Running org.apache.poi.xssf.usermodel.TestXSSFRichTextString
[junit] Tests run: 16, Failures: 0, Errors: 0, Skipped: 0, Time elapsed: 0.024 sec
[junit] Running org.apache.poi.xssf.usermodel.TestXSSFRow
[junit] Tests run: 10, Failures: 0, Errors: 0, Skipped: 0, Time elapsed: 2.411 sec
[junit] Running org.apache.poi.xssf.usermodel.TestXSSFSheet
[junit] Tests run: 72, Failures: 0, Errors: 0, Skipped: 0, Time elapsed: 5.09 sec
[junit] Running org.apache.poi.xssf.usermodel.TestXSSFSheetAutosizeColumn
[junit] Tests run: 7, Failures: 0, Errors: 0, Skipped: 0, Time elapsed: 0.059 sec
[junit] Running org.apache.poi.xssf.usermodel.TestXSSFSheetRowGrouping
[junit] Tests run: 6, Failures: 0, Errors: 0, Skipped: 0, Time elapsed: 0.158 sec
[junit] Running org.apache.poi.xssf.usermodel.TestXSSFSheetShiftRows
[junit] Tests run: 18, Failures: 0, Errors: 0, Skipped: 0, Time elapsed: 1.025 sec
[junit] Running org.apache.poi.xssf.usermodel.TestXSSFSheetUpdateArrayFormulas
[junit] Tests run: 16, Failures: 0, Errors: 0, Skipped: 0, Time elapsed: 0.03 sec
[junit] Running org.apache.poi.xssf.usermodel.TestXSSFSimpleShape
[junit] Tests run: 1, Failures: 0, Errors: 0, Skipped: 0, Time elapsed: 0.011 sec
[junit] Running org.apache.poi.xssf.usermodel.TestXSSFTable
[junit] Tests run: 1, Failures: 0, Errors: 0, Skipped: 0, Time elapsed: 0.032 sec
[junit] Running org.apache.poi.xssf.usermodel.TestXSSFTextParagraph
[junit] Tests run: 1, Failures: 0, Errors: 0, Skipped: 0, Time elapsed: 0.01 sec
[junit] Running org.apache.poi.xssf.usermodel.TestXSSFTextRun
[junit] Tests run: 1, Failures: 0, Errors: 0, Skipped: 0, Time elapsed: 0.007 sec
[junit] Running org.apache.poi.xssf.usermodel.TestXSSFVMLDrawing
[junit] Tests run: 3, Failures: 0, Errors: 0, Skipped: 0, Time elapsed: 0.008 sec
[junit] Running org.apache.poi.xssf.usermodel.TestXSSFWorkbook
[junit] Tests run: 41, Failures: 0, Errors: 0, Skipped: 0, Time elapsed: 0.555 sec
[junit] Running org.apache.poi.xssf.usermodel.charts.TestXSSFCategoryAxis
[junit] Tests run: 1, Failures: 0, Errors: 0, Skipped: 0, Time elapsed: 0.03 sec
[junit] Running org.apache.poi.xssf.usermodel.charts.TestXSSFChartAxis
[junit] Tests run: 8, Failures: 0, Errors: 0, Skipped: 0, Time elapsed: 0.016 sec
[junit] Running org.apache.poi.xssf.usermodel.charts.TestXSSFChartLegend
[junit] Tests run: 3, Failures: 0, Errors: 0, Skipped: 0, Time elapsed: 0.009 sec
[junit] Running org.apache.poi.xssf.usermodel.charts.TestXSSFLineChartData
[junit] Tests run: 1, Failures: 0, Errors: 0, Skipped: 0, Time elapsed: 0.025 sec
[junit] Running org.apache.poi.xssf.usermodel.charts.TestXSSFManualLayout
[junit] Tests run: 2, Failures: 0, Errors: 0, Skipped: 0, Time elapsed: 0.016 sec
[junit] Running org.apache.poi.xssf.usermodel.charts.TestXSSFScatterChartData
[junit] Tests run: 1, Failures: 0, Errors: 0, Skipped: 0, Time elapsed: 0.016 sec
[junit] Running org.apache.poi.xssf.usermodel.charts.TestXSSFValueAxis
[junit] Tests run: 1, Failures: 0, Errors: 0, Skipped: 0, Time elapsed: 0.003 sec
[junit] Running org.apache.poi.xssf.usermodel.extensions.TestXSSFBorder
[junit] Tests run: 1, Failures: 0, Errors: 0, Skipped: 0, Time elapsed: 0.002 sec
[junit] Running org.apache.poi.xssf.usermodel.extensions.TestXSSFCellFill
[junit] Tests run: 5, Failures: 0, Errors: 0, Skipped: 0, Time elapsed: 0.009 sec
[junit] Running org.apache.poi.xssf.usermodel.extensions.TestXSSFSheetComments
[junit] Tests run: 1, Failures: 0, Errors: 0, Skipped: 0, Time elapsed: 0 sec
[junit] Running org.apache.poi.xssf.usermodel.helpers.TestColumnHelper
[junit] Tests run: 8, Failures: 0, Errors: 0, Skipped: 0, Time elapsed: 0.03 sec
[junit] Running org.apache.poi.xssf.usermodel.helpers.TestHeaderFooterHelper
[junit] Tests run: 2, Failures: 0, Errors: 0, Skipped: 0, Time elapsed: 0.001 sec
[junit] Running org.apache.poi.xssf.util.TestCTColComparator
[junit] Tests run: 2, Failures: 0, Errors: 0, Skipped: 0, Time elapsed: 0.002 sec
[junit] Running org.apache.poi.xssf.util.TestEvilUnclosedBRFixingInputStream
[junit] Tests run: 3, Failures: 0, Errors: 0, Skipped: 0, Time elapsed: 0.005 sec
[junit] Running org.apache.poi.xssf.util.TestNumericRanges
[junit] Tests run: 2, Failures: 0, Errors: 0, Skipped: 0, Time elapsed: 0.001 sec
[junit] Running org.apache.poi.xwpf.TestAllExtendedProperties
[junit] Tests run: 1, Failures: 0, Errors: 0, Skipped: 0, Time elapsed: 0.032 sec
[junit] Running org.apache.poi.xwpf.TestDocumentProtection
[junit] Tests run: 10, Failures: 0, Errors: 0, Skipped: 0, Time elapsed: 0.42 sec
[junit] Running org.apache.poi.xwpf.TestPackageCorePropertiesGetKeywords
[junit] Tests run: 1, Failures: 0, Errors: 0, Skipped: 0, Time elapsed: 0.017 sec
[junit] Running org.apache.poi.xwpf.TestXWPFBugs
[junit] Tests run: 2, Failures: 0, Errors: 0, Skipped: 0, Time elapsed: 0.125 sec
[junit] Running org.apache.poi.xwpf.extractor.TestExternalEntities
[junit] Tests run: 1, Failures: 0, Errors: 0, Skipped: 0, Time elapsed: 0.006 sec
[junit] Running org.apache.poi.xwpf.extractor.TestXWPFWordExtractor
[junit] Tests run: 18, Failures: 0, Errors: 0, Skipped: 0, Time elapsed: 0.557 sec
[junit] Running org.apache.poi.xwpf.model.TestXWPFDecorators
[junit] Tests run: 2, Failures: 0, Errors: 0, Skipped: 0, Time elapsed: 0.055 sec
[junit] Running org.apache.poi.xwpf.model.TestXWPFHeaderFooterPolicy
[junit] Tests run: 2, Failures: 0, Errors: 0, Skipped: 0, Time elapsed: 0.086 sec
[junit] Running org.apache.poi.xwpf.usermodel.TestChangeTracking
[junit] Tests run: 3, Failures: 0, Errors: 0, Skipped: 0, Time elapsed: 0.019 sec
[junit] Running org.apache.poi.xwpf.usermodel.TestXWPFBugs
[junit] Tests run: 2, Failures: 0, Errors: 0, Skipped: 0, Time elapsed: 0.026 sec
[junit] Running org.apache.poi.xwpf.usermodel.TestXWPFDocument
[junit] Tests run: 17, Failures: 0, Errors: 0, Skipped: 0, Time elapsed: 0.224 sec
[junit] Running org.apache.poi.xwpf.usermodel.TestXWPFFootnotes
[junit] Tests run: 2, Failures: 0, Errors: 0, Skipped: 0, Time elapsed: 0.022 sec
[junit] Running org.apache.poi.xwpf.usermodel.TestXWPFHeader
[junit] Tests run: 8, Failures: 0, Errors: 0, Skipped: 0, Time elapsed: 0.081 sec
[junit] Running org.apache.poi.xwpf.usermodel.TestXWPFHeadings
[junit] Tests run: 1, Failures: 0, Errors: 0, Skipped: 0, Time elapsed: 0.039 sec
[junit] Running org.apache.poi.xwpf.usermodel.TestXWPFNumbering
[junit] Tests run: 4, Failures: 0, Errors: 0, Skipped: 0, Time elapsed: 0.033 sec
[junit] Running org.apache.poi.xwpf.usermodel.TestXWPFParagraph
[junit] Tests run: 17, Failures: 0, Errors: 0, Skipped: 0, Time elapsed: 0.089 sec
[junit] Running org.apache.poi.xwpf.usermodel.TestXWPFPictureData
[junit] Tests run: 4, Failures: 0, Errors: 0, Skipped: 0, Time elapsed: 0.087 sec
[junit] Running org.apache.poi.xwpf.usermodel.TestXWPFRun
[junit] Tests run: 17, Failures: 0, Errors: 0, Skipped: 0, Time elapsed: 0.048 sec
[junit] Running org.apache.poi.xwpf.usermodel.TestXWPFSDT
[junit] Tests run: 4, Failures: 0, Errors: 0, Skipped: 0, Time elapsed: 0.066 sec
[junit] Running org.apache.poi.xwpf.usermodel.TestXWPFSmartTag
[junit] Tests run: 1, Failures: 0, Errors: 0, Skipped: 0, Time elapsed: 0.007 sec
[junit] Running org.apache.poi.xwpf.usermodel.TestXWPFStyles
[junit] Tests run: 7, Failures: 0, Errors: 0, Skipped: 0, Time elapsed: 0.057 sec
[junit] Running org.apache.poi.xwpf.usermodel.TestXWPFTable
[junit] Tests run: 11, Failures: 0, Errors: 0, Skipped: 0, Time elapsed: 0.038 sec
[junit] Running org.apache.poi.xwpf.usermodel.TestXWPFTableCell
[junit] Tests run: 3, Failures: 0, Errors: 0, Skipped: 0, Time elapsed: 0.019 sec
[junit] Running org.apache.poi.xwpf.usermodel.TestXWPFTableRow
[junit] Tests run: 3, Failures: 0, Errors: 0, Skipped: 0, Time elapsed: 0.003 sec
[jacoco:coverage] Enhancing junit with coverage
[junit] Running org.apache.poi.poifs.crypt.TestSignatureInfo
[junit] Tests run: 10, Failures: 1, Errors: 0, Skipped: 0, Time elapsed: 15.313 sec
BUILD FAILED
<https://builds.apache.org/job/POI-OpenJDK/ws/build.xml>:1080: The following error occurred while executing this line:
<https://builds.apache.org/job/POI-OpenJDK/ws/build.xml>:1058: Test org.apache.poi.poifs.crypt.TestSignatureInfo failed
Total time: 4 minutes 36 seconds
Build step 'Invoke Ant' marked build as failure
[WARNINGS] Skipping publisher since build result is FAILURE
Archiving artifacts
Recording test results
---------------------------------------------------------------------
To unsubscribe, e-mail: dev-unsubscribe@poi.apache.org
For additional commands, e-mail: dev-help@poi.apache.org