You are viewing a plain text version of this content. The canonical link for it is here.
Posted to dev@zookeeper.apache.org by Apache Jenkins Server <je...@builds.apache.org> on 2014/01/31 05:39:33 UTC
Failed: ZOOKEEPER-1872 PreCommit Build #1905
Jira: https://issues.apache.org/jira/browse/ZOOKEEPER-1872
Build: https://builds.apache.org/job/PreCommit-ZOOKEEPER-Build/1905/
###################################################################################
########################## LAST 60 LINES OF THE CONSOLE ###########################
[...truncated 77 lines...]
[exec] Hunk #3 FAILED at 47.
[exec] Hunk #4 FAILED at 180.
[exec] Hunk #5 FAILED at 257.
[exec] Hunk #6 FAILED at 356.
[exec] Hunk #7 FAILED at 394.
[exec] Hunk #8 FAILED at 434.
[exec] Hunk #9 FAILED at 508.
[exec] Hunk #10 FAILED at 623.
[exec] Hunk #11 FAILED at 699.
[exec] 11 out of 11 hunks FAILED -- saving rejects to file src/java/test/org/apache/zookeeper/test/ReconfigTest.java.rej
[exec] PATCH APPLICATION FAILED
[exec]
[exec]
[exec]
[exec]
[exec] -1 overall. Here are the results of testing the latest attachment
[exec] http://issues.apache.org/jira/secure/attachment/12626260/ZOOKEEPER-1872.patch
[exec] against trunk revision 1561672.
[exec]
[exec] +1 @author. The patch does not contain any @author tags.
[exec]
[exec] +1 tests included. The patch appears to include 18 new or modified tests.
[exec]
[exec] -1 patch. The patch command could not apply the patch.
[exec]
[exec] Console output: https://builds.apache.org/job/PreCommit-ZOOKEEPER-Build/1905//console
[exec]
[exec] This message is automatically generated.
[exec]
[exec]
[exec] ======================================================================
[exec] ======================================================================
[exec] Adding comment to Jira.
[exec] ======================================================================
[exec] ======================================================================
[exec]
[exec]
[exec] Comment added.
[exec] 4742d1899757c891b88a0ecaf77cc5680c702ee4 logged out
[exec]
[exec]
[exec] ======================================================================
[exec] ======================================================================
[exec] Finished build.
[exec] ======================================================================
[exec] ======================================================================
[exec]
[exec]
BUILD FAILED
/home/jenkins/jenkins-slave/workspace/PreCommit-ZOOKEEPER-Build/trunk/build.xml:1674: exec returned: 1
Total time: 41 seconds
Build step 'Execute shell' marked build as failure
Archiving artifacts
Recording test results
Description set: ZOOKEEPER-1872
Email was triggered for: Failure
Sending email for trigger: Failure
###################################################################################
############################## FAILED TESTS (if any) ##############################
No tests ran.
Success: ZOOKEEPER-1835 PreCommit Build #1909
Posted by Apache Jenkins Server <je...@builds.apache.org>.
Jira: https://issues.apache.org/jira/browse/ZOOKEEPER-1835
Build: https://builds.apache.org/job/PreCommit-ZOOKEEPER-Build/1909/
###################################################################################
########################## LAST 60 LINES OF THE CONSOLE ###########################
[...truncated 299368 lines...]
[exec] BUILD SUCCESSFUL
[exec] Total time: 0 seconds
[exec]
[exec]
[exec]
[exec]
[exec] +1 overall. Here are the results of testing the latest attachment
[exec] http://issues.apache.org/jira/secure/attachment/12626481/ZOOKEEPER-1835.patch
[exec] against trunk revision 1561672.
[exec]
[exec] +1 @author. The patch does not contain any @author tags.
[exec]
[exec] +1 tests included. The patch appears to include 4 new or modified tests.
[exec]
[exec] +1 javadoc. The javadoc tool did not generate any warning messages.
[exec]
[exec] +1 javac. The applied patch does not increase the total number of javac compiler warnings.
[exec]
[exec] +1 findbugs. The patch does not introduce any new Findbugs (version 1.3.9) warnings.
[exec]
[exec] +1 release audit. The applied patch does not increase the total number of release audit warnings.
[exec]
[exec] +1 core tests. The patch passed core unit tests.
[exec]
[exec] +1 contrib tests. The patch passed contrib unit tests.
[exec]
[exec] Test results: https://builds.apache.org/job/PreCommit-ZOOKEEPER-Build/1909//testReport/
[exec] Findbugs warnings: https://builds.apache.org/job/PreCommit-ZOOKEEPER-Build/1909//artifact/trunk/build/test/findbugs/newPatchFindbugsWarnings.html
[exec] Console output: https://builds.apache.org/job/PreCommit-ZOOKEEPER-Build/1909//console
[exec]
[exec] This message is automatically generated.
[exec]
[exec]
[exec] ======================================================================
[exec] ======================================================================
[exec] Adding comment to Jira.
[exec] ======================================================================
[exec] ======================================================================
[exec]
[exec]
[exec] Comment added.
[exec] 07031b4c5ad18f7ac18f8fdb35fd3689cffeb00f logged out
[exec]
[exec]
[exec] ======================================================================
[exec] ======================================================================
[exec] Finished build.
[exec] ======================================================================
[exec] ======================================================================
[exec]
[exec]
BUILD SUCCESSFUL
Total time: 37 minutes 6 seconds
Archiving artifacts
Recording test results
Description set: ZOOKEEPER-1835
Email was triggered for: Success
Sending email for trigger: Success
###################################################################################
############################## FAILED TESTS (if any) ##############################
All tests passed
Failed: ZOOKEEPER-1872 PreCommit Build #1908
Posted by Apache Jenkins Server <je...@builds.apache.org>.
Jira: https://issues.apache.org/jira/browse/ZOOKEEPER-1872
Build: https://builds.apache.org/job/PreCommit-ZOOKEEPER-Build/1908/
###################################################################################
########################## LAST 60 LINES OF THE CONSOLE ###########################
[...truncated 82 lines...]
[exec] Hunk #2 FAILED at 47.
[exec] Hunk #3 FAILED at 180.
[exec] Hunk #4 FAILED at 257.
[exec] Hunk #5 FAILED at 356.
[exec] Hunk #6 FAILED at 394.
[exec] Hunk #7 FAILED at 434.
[exec] Hunk #8 FAILED at 508.
[exec] Hunk #9 FAILED at 623.
[exec] Hunk #10 FAILED at 699.
[exec] 10 out of 10 hunks FAILED -- saving rejects to file src/java/test/org/apache/zookeeper/test/ReconfigTest.java.rej
[exec] PATCH APPLICATION FAILED
[exec]
[exec]
[exec]
[exec]
[exec] -1 overall. Here are the results of testing the latest attachment
[exec] http://issues.apache.org/jira/secure/attachment/12626410/ZOOKEEPER-1872.patch
[exec] against trunk revision 1561672.
[exec]
[exec] +1 @author. The patch does not contain any @author tags.
[exec]
[exec] +1 tests included. The patch appears to include 18 new or modified tests.
[exec]
[exec] -1 patch. The patch command could not apply the patch.
[exec]
[exec] Console output: https://builds.apache.org/job/PreCommit-ZOOKEEPER-Build/1908//console
[exec]
[exec] This message is automatically generated.
[exec]
[exec]
[exec] ======================================================================
[exec] ======================================================================
[exec] Adding comment to Jira.
[exec] ======================================================================
[exec] ======================================================================
[exec]
[exec]
[exec] Comment added.
[exec] 60997cb0998c37e3f6e5a316d3b29814a446337d logged out
[exec]
[exec]
[exec] ======================================================================
[exec] ======================================================================
[exec] Finished build.
[exec] ======================================================================
[exec] ======================================================================
[exec]
[exec]
BUILD FAILED
/home/jenkins/jenkins-slave/workspace/PreCommit-ZOOKEEPER-Build/trunk/build.xml:1674: exec returned: 1
Total time: 42 seconds
Build step 'Execute shell' marked build as failure
Archiving artifacts
Recording test results
Description set: ZOOKEEPER-1872
Email was triggered for: Failure
Sending email for trigger: Failure
###################################################################################
############################## FAILED TESTS (if any) ##############################
No tests ran.
Failed: ZOOKEEPER-1872 PreCommit Build #1907
Posted by Apache Jenkins Server <je...@builds.apache.org>.
Jira: https://issues.apache.org/jira/browse/ZOOKEEPER-1872
Build: https://builds.apache.org/job/PreCommit-ZOOKEEPER-Build/1907/
###################################################################################
########################## LAST 60 LINES OF THE CONSOLE ###########################
[...truncated 82 lines...]
[exec] Hunk #2 FAILED at 47.
[exec] Hunk #3 FAILED at 180.
[exec] Hunk #4 FAILED at 257.
[exec] Hunk #5 FAILED at 356.
[exec] Hunk #6 FAILED at 394.
[exec] Hunk #7 FAILED at 434.
[exec] Hunk #8 FAILED at 508.
[exec] Hunk #9 FAILED at 623.
[exec] Hunk #10 FAILED at 699.
[exec] 10 out of 10 hunks FAILED -- saving rejects to file src/java/test/org/apache/zookeeper/test/ReconfigTest.java.rej
[exec] PATCH APPLICATION FAILED
[exec]
[exec]
[exec]
[exec]
[exec] -1 overall. Here are the results of testing the latest attachment
[exec] http://issues.apache.org/jira/secure/attachment/12626329/ZOOKEEPER-1872.patch
[exec] against trunk revision 1561672.
[exec]
[exec] +1 @author. The patch does not contain any @author tags.
[exec]
[exec] +1 tests included. The patch appears to include 18 new or modified tests.
[exec]
[exec] -1 patch. The patch command could not apply the patch.
[exec]
[exec] Console output: https://builds.apache.org/job/PreCommit-ZOOKEEPER-Build/1907//console
[exec]
[exec] This message is automatically generated.
[exec]
[exec]
[exec] ======================================================================
[exec] ======================================================================
[exec] Adding comment to Jira.
[exec] ======================================================================
[exec] ======================================================================
[exec]
[exec]
[exec] Comment added.
[exec] 4f11324946966158aabfb912a9e7038165fbc6b3 logged out
[exec]
[exec]
[exec] ======================================================================
[exec] ======================================================================
[exec] Finished build.
[exec] ======================================================================
[exec] ======================================================================
[exec]
[exec]
BUILD FAILED
/home/jenkins/jenkins-slave/workspace/PreCommit-ZOOKEEPER-Build/trunk/build.xml:1674: exec returned: 1
Total time: 44 seconds
Build step 'Execute shell' marked build as failure
Archiving artifacts
Recording test results
Description set: ZOOKEEPER-1872
Email was triggered for: Failure
Sending email for trigger: Failure
###################################################################################
############################## FAILED TESTS (if any) ##############################
No tests ran.
Failed: ZOOKEEPER-1872 PreCommit Build #1906
Posted by Apache Jenkins Server <je...@builds.apache.org>.
Jira: https://issues.apache.org/jira/browse/ZOOKEEPER-1872
Build: https://builds.apache.org/job/PreCommit-ZOOKEEPER-Build/1906/
###################################################################################
########################## LAST 60 LINES OF THE CONSOLE ###########################
[...truncated 82 lines...]
[exec] Hunk #2 FAILED at 47.
[exec] Hunk #3 FAILED at 180.
[exec] Hunk #4 FAILED at 257.
[exec] Hunk #5 FAILED at 356.
[exec] Hunk #6 FAILED at 394.
[exec] Hunk #7 FAILED at 434.
[exec] Hunk #8 FAILED at 508.
[exec] Hunk #9 FAILED at 623.
[exec] Hunk #10 FAILED at 699.
[exec] 10 out of 10 hunks FAILED -- saving rejects to file src/java/test/org/apache/zookeeper/test/ReconfigTest.java.rej
[exec] PATCH APPLICATION FAILED
[exec]
[exec]
[exec]
[exec]
[exec] -1 overall. Here are the results of testing the latest attachment
[exec] http://issues.apache.org/jira/secure/attachment/12626301/ZOOKEEPER-1872.patch
[exec] against trunk revision 1561672.
[exec]
[exec] +1 @author. The patch does not contain any @author tags.
[exec]
[exec] +1 tests included. The patch appears to include 18 new or modified tests.
[exec]
[exec] -1 patch. The patch command could not apply the patch.
[exec]
[exec] Console output: https://builds.apache.org/job/PreCommit-ZOOKEEPER-Build/1906//console
[exec]
[exec] This message is automatically generated.
[exec]
[exec]
[exec] ======================================================================
[exec] ======================================================================
[exec] Adding comment to Jira.
[exec] ======================================================================
[exec] ======================================================================
[exec]
[exec]
[exec] Comment added.
[exec] f8d96e593dad002b7be6148569b8db63cd270cd5 logged out
[exec]
[exec]
[exec] ======================================================================
[exec] ======================================================================
[exec] Finished build.
[exec] ======================================================================
[exec] ======================================================================
[exec]
[exec]
BUILD FAILED
/home/jenkins/jenkins-slave/workspace/PreCommit-ZOOKEEPER-Build/trunk/build.xml:1674: exec returned: 1
Total time: 54 seconds
Build step 'Execute shell' marked build as failure
Archiving artifacts
Recording test results
Description set: ZOOKEEPER-1872
Email was triggered for: Failure
Sending email for trigger: Failure
###################################################################################
############################## FAILED TESTS (if any) ##############################
No tests ran.