You are viewing a plain text version of this content. The canonical link for it is here.
Posted to builds@beam.apache.org by Apache Jenkins Server <je...@builds.apache.org> on 2023/09/16 06:56:57 UTC
Build failed in Jenkins: beam_PostCommit_Java_DataflowV2 #3538
See <https://ci-beam.apache.org/job/beam_PostCommit_Java_DataflowV2/3538/display/redirect>
Changes:
------------------------------------------
[...truncated 67.53 KB...]
/home/jenkins/go/bin/go1.21.1 build -o ./build/target/linux_amd64/boot boot.go boot_test.go pathingjar.go pathingjar_test.go
> Task :sdks:java:container:java8:copySdkHarnessLauncher
Execution optimizations have been disabled for task ':sdks:java:container:java8:copySdkHarnessLauncher' to ensure correctness due to the following reasons:
- Gradle detected a problem with the following location: '<https://ci-beam.apache.org/job/beam_PostCommit_Java_DataflowV2/ws/src/sdks/java/container/build/target'.> Reason: Task ':sdks:java:container:java8:copySdkHarnessLauncher' uses this output of task ':sdks:java:container:pullLicenses' without declaring an explicit or implicit dependency. This can lead to incorrect results being produced, depending on what order the tasks are executed. Please refer to https://docs.gradle.org/7.6.2/userguide/validation_problems.html#implicit_dependency for more details about this problem.
> Task :release:go-licenses:java:dockerRun
github.com/apache/beam/sdks/v2/go,https://github.com/apache/beam/blob/sdks/v2.50.0/sdks/go/README.md,Apache-2.0
github.com/apache/beam/sdks/v2/java/container,https://github.com/apache/beam/blob/sdks/v2.50.0/sdks/LICENSE,Apache-2.0
github.com/golang/protobuf,https://github.com/golang/protobuf/blob/v1.5.3/LICENSE,BSD-3-Clause
golang.org/x/net,https://cs.opensource.google/go/x/net/+/v0.14.0:LICENSE,BSD-3-Clause
golang.org/x/sys/unix,https://cs.opensource.google/go/x/sys/+/v0.11.0:LICENSE,BSD-3-Clause
golang.org/x/text,https://cs.opensource.google/go/x/text/+/v0.12.0:LICENSE,BSD-3-Clause
google.golang.org/genproto/googleapis/rpc/status,https://github.com/googleapis/go-genproto/blob/23370e0ffb3e/googleapis/rpc/LICENSE,Apache-2.0
google.golang.org/grpc,https://github.com/grpc/grpc-go/blob/v1.57.0/LICENSE,Apache-2.0
google.golang.org/protobuf,https://github.com/protocolbuffers/protobuf-go/blob/v1.31.0/LICENSE,BSD-3-Clause
+ chmod -R a+w /output/licenses
> Task :release:go-licenses:java:createLicenses
> Task :sdks:java:container:java8:copyGolangLicenses
> Task :sdks:java:container:java8:dockerPrepare
> Task :sdks:java:container:java8:docker
#1 [internal] load build definition from Dockerfile
#1 transferring dockerfile: 2.58kB done
#1 DONE 0.0s
#2 [internal] load .dockerignore
#2 transferring context: 2B done
#2 DONE 0.0s
#3 [internal] load metadata for docker.io/library/eclipse-temurin:8
#3 DONE 0.3s
#4 [ 1/16] FROM docker.io/library/eclipse-temurin:8@sha256:ae78c894d048567fe780b577194f3409ed56ee8cb951d82c8ce66c41de46a9e4
#4 resolve docker.io/library/eclipse-temurin:8@sha256:ae78c894d048567fe780b577194f3409ed56ee8cb951d82c8ce66c41de46a9e4 0.0s done
#4 CACHED
#5 [internal] load build context
#5 transferring context: 47.26MB 0.4s done
#5 DONE 0.4s
#6 [ 2/16] ADD target/slf4j-api.jar /opt/apache/beam/jars/
#6 DONE 2.5s
#7 [ 3/16] ADD target/slf4j-jdk14.jar /opt/apache/beam/jars/
#7 DONE 0.9s
#8 [ 4/16] ADD target/jcl-over-slf4j.jar /opt/apache/beam/jars/
#8 DONE 0.1s
#9 [ 5/16] ADD target/log4j-over-slf4j.jar /opt/apache/beam/jars/
#9 DONE 0.1s
#10 [ 6/16] ADD target/log4j-to-slf4j.jar /opt/apache/beam/jars/
#10 DONE 0.1s
#11 [ 7/16] ADD target/beam-sdks-java-harness.jar /opt/apache/beam/jars/
#11 DONE 0.1s
#12 [ 8/16] COPY target/jamm.jar target/open-module-agent*.jar /opt/apache/beam/jars/
#12 DONE 0.1s
#13 [ 9/16] COPY target/linux_amd64/boot /opt/apache/beam/
#13 DONE 0.2s
#14 [10/16] COPY target/LICENSE /opt/apache/beam/
#14 DONE 0.1s
#15 [11/16] COPY target/NOTICE /opt/apache/beam/
#15 DONE 0.1s
#16 [12/16] ADD target/third_party_licenses /opt/apache/beam/third_party_licenses/
#16 DONE 0.2s
#17 [13/16] COPY target/LICENSE target/options/* /opt/apache/beam/options/
#17 DONE 0.1s
#18 [14/16] COPY target/go-licenses/* /opt/apache/beam/third_party_licenses/golang/
#18 DONE 0.1s
#19 [15/16] RUN if [ "true" = "false" ] ; then rm -rf /opt/apache/beam/third_party_licenses ; fi
#19 DONE 0.3s
#20 [16/16] COPY target/profiler/* /opt/google_cloud_profiler/
#20 DONE 0.1s
#21 exporting to image
#21 exporting layers
#21 exporting layers 0.2s done
#21 writing image sha256:379df22a3c79f3c26a0e3007d782ef21754abb94b7f6bef84c11d2816c781abb done
#21 naming to docker.io/apache/beam_java8_sdk:2.51.0.dev done
#21 DONE 0.2s
> Task :runners:google-cloud-dataflow-java:buildAndPushDockerJavaContainer
WARNING: `gcloud docker` will not be supported for Docker client versions above 18.03.
As an alternative, use `gcloud auth configure-docker` to configure `docker` to
use `gcloud` as a credential helper, then use `docker` as you would for non-GCR
registries, e.g. `docker pull gcr.io/project-id/my-image`. Add
`--verbosity=error` to silence this warning: `gcloud docker
--verbosity=error -- pull gcr.io/project-id/my-image`.
See: https://cloud.google.com/container-registry/docs/support/deprecation-notices#gcloud-docker
The push refers to repository [us.gcr.io/apache-beam-testing/java-postcommit-it/java]
e54b5258ae0b: Preparing
5f70bf18a086: Preparing
9ebb23fad33f: Preparing
9fda9531528e: Preparing
0f3f3b89296c: Preparing
cb740e472d4a: Preparing
9d96e9ee4b9d: Preparing
f9bd40252589: Preparing
6ff5c5bfe149: Preparing
e95564a2a226: Preparing
fada2f7ebb93: Preparing
368fda41f054: Preparing
4ee07e52f860: Preparing
c2e9009a2cc4: Preparing
9d96e9ee4b9d: Waiting
cb740e472d4a: Waiting
f9bd40252589: Waiting
6ff5c5bfe149: Waiting
fada2f7ebb93: Waiting
04bb80b9080b: Preparing
e95564a2a226: Waiting
cc64ed2782c8: Preparing
4ee07e52f860: Waiting
75d91765f4e2: Preparing
a31fc5e5e9a2: Preparing
c2e9009a2cc4: Waiting
2f3ff0b4cbda: Preparing
dc0585a4b8b7: Preparing
04bb80b9080b: Waiting
cc64ed2782c8: Waiting
2f3ff0b4cbda: Waiting
a31fc5e5e9a2: Waiting
368fda41f054: Waiting
dc0585a4b8b7: Waiting
5f70bf18a086: Layer already exists
9fda9531528e: Pushed
cb740e472d4a: Pushed
9ebb23fad33f: Pushed
e54b5258ae0b: Pushed
0f3f3b89296c: Pushed
9d96e9ee4b9d: Pushed
6ff5c5bfe149: Pushed
fada2f7ebb93: Pushed
f9bd40252589: Pushed
e95564a2a226: Pushed
cc64ed2782c8: Layer already exists
368fda41f054: Pushed
75d91765f4e2: Layer already exists
a31fc5e5e9a2: Layer already exists
2f3ff0b4cbda: Layer already exists
dc0585a4b8b7: Layer already exists
4ee07e52f860: Pushed
c2e9009a2cc4: Pushed
04bb80b9080b: Pushed
20230916035738: digest: sha256:821418b25f2afcab28b5d6d54b5939548b00eaac7f206d1cb16a9d04de703f35 size: 4504
> Task :runners:google-cloud-dataflow-java:coreSDKJavaRunnerV2IntegrationTest NO-SOURCE
> Task :runners:google-cloud-dataflow-java:examplesJavaRunnerV2IntegrationTest
***********************************************************
***********************************************************
**********************Set Up Pubsub************************
The Pub/Sub topic has been set up for this example: projects/apache-beam-testing/topics/testpipeline-jenkins-0916035834-9f61f42b
The Pub/Sub subscription has been set up for this example: projects/apache-beam-testing/subscriptions/testpipeline-jenkins-0916035834-9f61f42b
*************************Tear Down*************************
The Pub/Sub topic has been deleted: projects/apache-beam-testing/topics/testpipeline-jenkins-0916035834-9f61f42b
The Pub/Sub subscription has been deleted: projects/apache-beam-testing/subscriptions/testpipeline-jenkins-0916035834-9f61f42b
***********************************************************
***********************************************************
***********************************************************
***********************************************************
**********************Set Up Pubsub************************
The Pub/Sub topic has been set up for this example: projects/apache-beam-testing/topics/testpipeline-jenkins-0916035834-4255b44
The Pub/Sub subscription has been set up for this example: projects/apache-beam-testing/subscriptions/testpipeline-jenkins-0916035834-4255b44
*************************Tear Down*************************
The Pub/Sub topic has been deleted: projects/apache-beam-testing/topics/testpipeline-jenkins-0916035834-4255b44
The Pub/Sub subscription has been deleted: projects/apache-beam-testing/subscriptions/testpipeline-jenkins-0916035834-4255b44
***********************************************************
***********************************************************
> Task :runners:google-cloud-dataflow-java:googleCloudPlatformRunnerV2IntegrationTest
org.apache.beam.sdk.io.gcp.spanner.changestreams.it.SpannerChangeStreamOrderedWithinKeyGloballyIT > testOrderedWithinKey FAILED
java.lang.RuntimeException at SpannerChangeStreamOrderedWithinKeyGloballyIT.java:195
137 tests completed, 1 failed, 25 skipped
> Task :runners:google-cloud-dataflow-java:googleCloudPlatformRunnerV2IntegrationTest FAILED
> Task :runners:google-cloud-dataflow-java:cleanUpDockerJavaImages
Untagged: us.gcr.io/apache-beam-testing/java-postcommit-it/java:20230916035738
Untagged: us.gcr.io/apache-beam-testing/java-postcommit-it/java@sha256:821418b25f2afcab28b5d6d54b5939548b00eaac7f206d1cb16a9d04de703f35
Deleted: sha256:379df22a3c79f3c26a0e3007d782ef21754abb94b7f6bef84c11d2816c781abb
WARNING: Successfully resolved tag to sha256, but it is recommended to use sha256 directly.
Tag: [us.gcr.io/apache-beam-testing/java-postcommit-it/java:20230916035738]
- referencing digest: [us.gcr.io/apache-beam-testing/java-postcommit-it/java@sha256:821418b25f2afcab28b5d6d54b5939548b00eaac7f206d1cb16a9d04de703f35]
Deleted [[us.gcr.io/apache-beam-testing/java-postcommit-it/java:20230916035738] (referencing [us.gcr.io/apache-beam-testing/java-postcommit-it/java@sha256:821418b25f2afcab28b5d6d54b5939548b00eaac7f206d1cb16a9d04de703f35])].
Removing untagged image us.gcr.io/apache-beam-testing/java-postcommit-it/java@sha256:821418b25f2afcab28b5d6d54b5939548b00eaac7f206d1cb16a9d04de703f35
FAILURE: Build failed with an exception.
* What went wrong:
Execution failed for task ':runners:google-cloud-dataflow-java:googleCloudPlatformRunnerV2IntegrationTest'.
> There were failing tests. See the report at: file://<https://ci-beam.apache.org/job/beam_PostCommit_Java_DataflowV2/ws/src/runners/google-cloud-dataflow-java/build/reports/tests/googleCloudPlatformRunnerV2IntegrationTest/index.html>
* Try:
> Run with --stacktrace option to get the stack trace.
> Run with --info or --debug option to get more log output.
* Get more help at https://help.gradle.org
Deprecated Gradle features were used in this build, making it incompatible with Gradle 8.0.
You can use '--warning-mode all' to show the individual deprecation warnings and determine if they come from your own scripts or plugins.
See https://docs.gradle.org/7.6.2/userguide/command_line_interface.html#sec:command_line_warnings
Execution optimizations have been disabled for 1 invalid unit(s) of work during this build to ensure correctness.
Please consult deprecation warnings for more details.
BUILD FAILED in 2h 57m 29s
156 actionable tasks: 98 executed, 54 from cache, 4 up-to-date
Publishing build scan...
Publishing build scan failed due to network error 'java.net.SocketTimeoutException: Read timed out' (2 retries remaining)...
Publishing build scan failed due to 'An unexpected error occurred creating your build scan.
Please report this problem at https://ge.apache.org/help, quoting the following reference code:
pea4rtakrlq7w' (2 retries remaining)...
Publishing build scan failed due to network error 'java.net.SocketTimeoutException: Read timed out' (2 retries remaining)...
Publishing build scan failed due to 'An unexpected error occurred creating your build scan.
Please report this problem at https://ge.apache.org/help, quoting the following reference code:
jxx3guamn6fdw' (1 retry remaining)...
Publishing build scan failed due to network error 'java.net.SocketTimeoutException: Read timed out' (2 retries remaining)...
Publishing build scan failed due to network error 'java.net.SocketTimeoutException: Read timed out' (1 retry remaining)...
An unexpected error occurred creating your build scan.
Please report this problem at https://ge.apache.org/help, quoting the following reference code:
jayoarconrod2
Build step 'Invoke Gradle script' changed build result to FAILURE
Build step 'Invoke Gradle script' marked build as failure
---------------------------------------------------------------------
To unsubscribe, e-mail: builds-unsubscribe@beam.apache.org
For additional commands, e-mail: builds-help@beam.apache.org
Jenkins build is back to normal : beam_PostCommit_Java_DataflowV2 #3539
Posted by Apache Jenkins Server <je...@builds.apache.org>.
See <https://ci-beam.apache.org/job/beam_PostCommit_Java_DataflowV2/3539/display/redirect>
---------------------------------------------------------------------
To unsubscribe, e-mail: builds-unsubscribe@beam.apache.org
For additional commands, e-mail: builds-help@beam.apache.org