You are viewing a plain text version of this content. The canonical link for it is here.
Posted to commits@phoenix.apache.org by Apache Jenkins Server <je...@builds.apache.org> on 2015/03/19 21:35:08 UTC
Build failed in Jenkins: Phoenix | Master #626
See <https://builds.apache.org/job/Phoenix-master/626/changes>
Changes:
[enis] PHOENIX-1642 Make Phoenix Master Branch pointing to HBase1.0.0
------------------------------------------
[...truncated 130040 lines...]
org.apache.phoenix.end2end.AlterTableIT.testDropColumnsWithImutability(org.apache.phoenix.end2end.AlterTableIT)
Run 1: AlterTableIT.testDropColumnsWithImutability:823 » PhoenixIO org.apache.hadoop....
Run 2: AlterTableIT>BaseOwnClusterHBaseManagedTimeIT.cleanUpAfterTest:29->BaseTest.deletePriorTables:766->BaseTest.deletePriorTables:777->BaseTest.deletePriorTables:794 » PhoenixIO
org.apache.phoenix.end2end.AlterTableIT.testDropCoveredColumn(org.apache.phoenix.end2end.AlterTableIT)
Run 1: AlterTableIT.testDropCoveredColumn:319 » PhoenixIO org.apache.hadoop.hbase.DoN...
Run 2: AlterTableIT>BaseOwnClusterHBaseManagedTimeIT.cleanUpAfterTest:29->BaseTest.deletePriorTables:766->BaseTest.deletePriorTables:777->BaseTest.deletePriorTables:794 » PhoenixIO
AlterTableIT>BaseOwnClusterHBaseManagedTimeIT.cleanUpAfterTest:29->BaseTest.deletePriorTables:766->BaseTest.deletePriorTables:777->BaseTest.deletePriorTables:794 » PhoenixIO
org.apache.phoenix.end2end.AlterTableIT.testDropVarCols(org.apache.phoenix.end2end.AlterTableIT)
Run 1: AlterTableIT.testDropVarCols:673 » PhoenixIO org.apache.hadoop.hbase.DoNotRetr...
Run 2: AlterTableIT>BaseOwnClusterHBaseManagedTimeIT.cleanUpAfterTest:29->BaseTest.deletePriorTables:766->BaseTest.deletePriorTables:777->BaseTest.deletePriorTables:794 » PhoenixIO
org.apache.phoenix.end2end.AlterTableIT.testNewColumnFamilyInheritsTTLOfEmptyCF(org.apache.phoenix.end2end.AlterTableIT)
Run 1: AlterTableIT.testNewColumnFamilyInheritsTTLOfEmptyCF:1302 » PhoenixIO org.apac...
Run 2: AlterTableIT>BaseOwnClusterHBaseManagedTimeIT.cleanUpAfterTest:29->BaseTest.deletePriorTables:766->BaseTest.deletePriorTables:777->BaseTest.deletePriorTables:794 » PhoenixIO
AlterTableIT>BaseOwnClusterHBaseManagedTimeIT.cleanUpAfterTest:29->BaseTest.deletePriorTables:766->BaseTest.deletePriorTables:777->BaseTest.deletePriorTables:794 » PhoenixIO
org.apache.phoenix.end2end.AlterTableIT.testSetHColumnOrHTablePropertiesOnViewsNotAllowed(org.apache.phoenix.end2end.AlterTableIT)
Run 1: AlterTableIT.testSetHColumnOrHTablePropertiesOnViewsNotAllowed:1213 » PhoenixIO
Run 2: AlterTableIT>BaseOwnClusterHBaseManagedTimeIT.cleanUpAfterTest:29->BaseTest.deletePriorTables:766->BaseTest.deletePriorTables:777->BaseTest.deletePriorTables:794 » PhoenixIO
AlterTableIT>BaseOwnClusterHBaseManagedTimeIT.cleanUpAfterTest:29->BaseTest.deletePriorTables:766->BaseTest.deletePriorTables:777->BaseTest.deletePriorTables:794 » PhoenixIO
org.apache.phoenix.end2end.AlterTableIT.testSetHColumnPropertyAndAddColumnForDefaultCFForTableWithOnlyPKCols(org.apache.phoenix.end2end.AlterTableIT)
Run 1: AlterTableIT.testSetHColumnPropertyAndAddColumnForDefaultCFForTableWithOnlyPKCols:1711 » PhoenixIO
Run 2: AlterTableIT>BaseOwnClusterHBaseManagedTimeIT.cleanUpAfterTest:29->BaseTest.deletePriorTables:766->BaseTest.deletePriorTables:777->BaseTest.deletePriorTables:794 » PhoenixIO
AlterTableIT>BaseOwnClusterHBaseManagedTimeIT.cleanUpAfterTest:29->BaseTest.deletePriorTables:766->BaseTest.deletePriorTables:777->BaseTest.deletePriorTables:794 » PhoenixIO
org.apache.phoenix.end2end.AlterTableIT.testSetHTableHColumnAndPhoenixTableProperties(org.apache.phoenix.end2end.AlterTableIT)
Run 1: AlterTableIT.testSetHTableHColumnAndPhoenixTableProperties:1063 » PhoenixIO or...
Run 2: AlterTableIT>BaseOwnClusterHBaseManagedTimeIT.cleanUpAfterTest:29->BaseTest.deletePriorTables:766->BaseTest.deletePriorTables:777->BaseTest.deletePriorTables:794 » PhoenixIO
AlterTableIT>BaseOwnClusterHBaseManagedTimeIT.cleanUpAfterTest:29->BaseTest.deletePriorTables:766->BaseTest.deletePriorTables:777->BaseTest.deletePriorTables:794 » PhoenixIO
AlterTableIT>BaseOwnClusterHBaseManagedTimeIT.cleanUpAfterTest:29->BaseTest.deletePriorTables:766->BaseTest.deletePriorTables:777->BaseTest.deletePriorTables:794 » PhoenixIO
org.apache.phoenix.end2end.AlterTableIT.testSetPropertyAndAddColumnForDifferentColumnFamilies(org.apache.phoenix.end2end.AlterTableIT)
Run 1: AlterTableIT.testSetPropertyAndAddColumnForDifferentColumnFamilies:1427 » PhoenixIO
Run 2: AlterTableIT>BaseOwnClusterHBaseManagedTimeIT.cleanUpAfterTest:29->BaseTest.deletePriorTables:766->BaseTest.deletePriorTables:777->BaseTest.deletePriorTables:794 » PhoenixIO
org.apache.phoenix.end2end.AlterTableIT.testSetPropertyAndAddColumnForNewAndExistingColumnFamily(org.apache.phoenix.end2end.AlterTableIT)
Run 1: AlterTableIT.testSetPropertyAndAddColumnForNewAndExistingColumnFamily:1351 » PhoenixIO
Run 2: AlterTableIT>BaseOwnClusterHBaseManagedTimeIT.cleanUpAfterTest:29->BaseTest.deletePriorTables:766->BaseTest.deletePriorTables:777->BaseTest.deletePriorTables:794 » PhoenixIO
org.apache.phoenix.end2end.AlterTableIT.testSetPropertyAndAddColumnUsingDefaultColumnFamilySpecifier(org.apache.phoenix.end2end.AlterTableIT)
Run 1: AlterTableIT.testSetPropertyAndAddColumnUsingDefaultColumnFamilySpecifier:1458 » PhoenixIO
Run 2: AlterTableIT>BaseOwnClusterHBaseManagedTimeIT.cleanUpAfterTest:29->BaseTest.deletePriorTables:766->BaseTest.deletePriorTables:777->BaseTest.deletePriorTables:794 » PhoenixIO
org.apache.phoenix.end2end.AlterTableIT.testSetPropertyAndAddColumnWhenTableHasExplicitDefaultColumnFamily(org.apache.phoenix.end2end.AlterTableIT)
Run 1: AlterTableIT.testSetPropertyAndAddColumnWhenTableHasExplicitDefaultColumnFamily:1379 » PhoenixIO
Run 2: AlterTableIT>BaseOwnClusterHBaseManagedTimeIT.cleanUpAfterTest:29->BaseTest.deletePriorTables:766->BaseTest.deletePriorTables:777->BaseTest.deletePriorTables:794 » PhoenixIO
org.apache.phoenix.end2end.AlterTableIT.testSetSaltedTableAsImmutable(org.apache.phoenix.end2end.AlterTableIT)
Run 1: AlterTableIT.testSetSaltedTableAsImmutable:509 » TableAlreadyExists ERROR 1013...
Run 2: AlterTableIT>BaseOwnClusterHBaseManagedTimeIT.cleanUpAfterTest:29->BaseTest.deletePriorTables:766->BaseTest.deletePriorTables:777->BaseTest.deletePriorTables:794 » PhoenixIO
AlterTableIT>BaseOwnClusterHBaseManagedTimeIT.cleanUpAfterTest:29->BaseTest.deletePriorTables:766->BaseTest.deletePriorTables:777->BaseTest.deletePriorTables:794 » PhoenixIO
AlterTableIT>BaseOwnClusterHBaseManagedTimeIT.cleanUpAfterTest:29->BaseTest.deletePriorTables:766->BaseTest.deletePriorTables:777->BaseTest.deletePriorTables:794 » PhoenixIO
AlterTableIT>BaseOwnClusterHBaseManagedTimeIT.cleanUpAfterTest:29->BaseTest.deletePriorTables:766->BaseTest.deletePriorTables:777->BaseTest.deletePriorTables:794 » PhoenixIO
org.apache.phoenix.end2end.AlterTableIT.testTTLAssignmentForNewEmptyCF(org.apache.phoenix.end2end.AlterTableIT)
Run 1: AlterTableIT.testTTLAssignmentForNewEmptyCF:1769 » PhoenixIO org.apache.hadoop...
Run 2: AlterTableIT>BaseOwnClusterHBaseManagedTimeIT.cleanUpAfterTest:29->BaseTest.deletePriorTables:766->BaseTest.deletePriorTables:777->BaseTest.deletePriorTables:794 » PhoenixIO
org.apache.phoenix.end2end.KeyOnlyIT.testKeyOnly(org.apache.phoenix.end2end.KeyOnlyIT)
Run 1: KeyOnlyIT.testKeyOnly:89 » PhoenixIO org.apache.phoenix.exception.PhoenixIOExc...
Run 2: KeyOnlyIT>BaseOwnClusterClientManagedTimeIT.cleanUpAfterTest:29->BaseTest.deletePriorTables:766->BaseTest.deletePriorTables:777->BaseTest.deletePriorTables:811 » PhoenixIO
org.apache.phoenix.end2end.KeyOnlyIT.testOr(org.apache.phoenix.end2end.KeyOnlyIT)
Run 1: KeyOnlyIT.testOr:142->BaseTest.ensureTableCreated:713->BaseTest.createTestTable:721->BaseTest.createTestTable:747 » PhoenixIO
Run 2: KeyOnlyIT>BaseOwnClusterClientManagedTimeIT.cleanUpAfterTest:29->BaseTest.deletePriorTables:766->BaseTest.deletePriorTables:777->BaseTest.deletePriorTables:811 » PhoenixIO
org.apache.phoenix.end2end.KeyOnlyIT.testQueryWithLimitAndStats(org.apache.phoenix.end2end.KeyOnlyIT)
Run 1: KeyOnlyIT.testQueryWithLimitAndStats:167->BaseTest.ensureTableCreated:713->BaseTest.createTestTable:721->BaseTest.createTestTable:747 » PhoenixIO
Run 2: KeyOnlyIT>BaseOwnClusterClientManagedTimeIT.cleanUpAfterTest:29->BaseTest.deletePriorTables:766->BaseTest.deletePriorTables:777->BaseTest.deletePriorTables:811 » PhoenixIO
org.apache.phoenix.end2end.MultiCfQueryExecIT.testCFToDisambiguate2(org.apache.phoenix.end2end.MultiCfQueryExecIT)
Run 1: MultiCfQueryExecIT.testCFToDisambiguate2:194->initTableValues:59->BaseTest.ensureTableCreated:713->BaseTest.createTestTable:721->BaseTest.createTestTable:747 » PhoenixIO
Run 2: MultiCfQueryExecIT>BaseOwnClusterClientManagedTimeIT.cleanUpAfterTest:29->BaseTest.deletePriorTables:766->BaseTest.deletePriorTables:777->BaseTest.deletePriorTables:811 » PhoenixIO
org.apache.phoenix.end2end.MultiCfQueryExecIT.testCFToDisambiguateInSelectOnly1(org.apache.phoenix.end2end.MultiCfQueryExecIT)
Run 1: MultiCfQueryExecIT.testCFToDisambiguateInSelectOnly1:123->initTableValues:59->BaseTest.ensureTableCreated:713->BaseTest.createTestTable:721->BaseTest.createTestTable:747 » PhoenixIO
Run 2: MultiCfQueryExecIT>BaseOwnClusterClientManagedTimeIT.cleanUpAfterTest:29->BaseTest.deletePriorTables:766->BaseTest.deletePriorTables:777->BaseTest.deletePriorTables:811 » PhoenixIO
org.apache.phoenix.end2end.MultiCfQueryExecIT.testCFToDisambiguateInSelectOnly2(org.apache.phoenix.end2end.MultiCfQueryExecIT)
Run 1: MultiCfQueryExecIT.testCFToDisambiguateInSelectOnly2:144->initTableValues:59->BaseTest.ensureTableCreated:713->BaseTest.createTestTable:721->BaseTest.createTestTable:747 » PhoenixIO
Run 2: MultiCfQueryExecIT>BaseOwnClusterClientManagedTimeIT.cleanUpAfterTest:29->BaseTest.deletePriorTables:766->BaseTest.deletePriorTables:777->BaseTest.deletePriorTables:811 » PhoenixIO
org.apache.phoenix.end2end.MultiCfQueryExecIT.testConstantCount(org.apache.phoenix.end2end.MultiCfQueryExecIT)
Run 1: MultiCfQueryExecIT.testConstantCount:103->initTableValues:59->BaseTest.ensureTableCreated:713->BaseTest.createTestTable:721->BaseTest.createTestTable:747 » PhoenixIO
Run 2: MultiCfQueryExecIT>BaseOwnClusterClientManagedTimeIT.cleanUpAfterTest:29->BaseTest.deletePriorTables:766->BaseTest.deletePriorTables:777->BaseTest.deletePriorTables:811 » PhoenixIO
MultiCfQueryExecIT>BaseOwnClusterClientManagedTimeIT.cleanUpAfterTest:29->BaseTest.deletePriorTables:766->BaseTest.deletePriorTables:777->BaseTest.deletePriorTables:811 » PhoenixIO
org.apache.phoenix.end2end.MultiCfQueryExecIT.testEssentialColumnFamilyForRowKeyFilter(org.apache.phoenix.end2end.MultiCfQueryExecIT)
Run 1: MultiCfQueryExecIT.testEssentialColumnFamilyForRowKeyFilter:255->initTableValues:59->BaseTest.ensureTableCreated:713->BaseTest.createTestTable:721->BaseTest.createTestTable:747 » PhoenixIO
Run 2: MultiCfQueryExecIT>BaseOwnClusterClientManagedTimeIT.cleanUpAfterTest:29->BaseTest.deletePriorTables:766->BaseTest.deletePriorTables:777->BaseTest.deletePriorTables:811 » PhoenixIO
org.apache.phoenix.end2end.MultiCfQueryExecIT.testGuidePostsForMultiCFs(org.apache.phoenix.end2end.MultiCfQueryExecIT)
Run 1: MultiCfQueryExecIT.testGuidePostsForMultiCFs:160->initTableValues:59->BaseTest.ensureTableCreated:713->BaseTest.createTestTable:721->BaseTest.createTestTable:747 » PhoenixIO
Run 2: MultiCfQueryExecIT>BaseOwnClusterClientManagedTimeIT.cleanUpAfterTest:29->BaseTest.deletePriorTables:766->BaseTest.deletePriorTables:777->BaseTest.deletePriorTables:811 » PhoenixIO
org.apache.phoenix.end2end.StatsCollectorIT.testCompactUpdatesStats(org.apache.phoenix.end2end.StatsCollectorIT)
Run 1: StatsCollectorIT.testCompactUpdatesStats:241->testCompactUpdatesStats:284 » PhoenixIO
Run 2: StatsCollectorIT>BaseOwnClusterHBaseManagedTimeIT.cleanUpAfterTest:29->BaseTest.deletePriorTables:766->BaseTest.deletePriorTables:777->BaseTest.deletePriorTables:811 » PhoenixIO
org.apache.phoenix.end2end.StatsCollectorIT.testCompactUpdatesStatsWithMinStatsUpdateFreq(org.apache.phoenix.end2end.StatsCollectorIT)
Run 1: StatsCollectorIT.testCompactUpdatesStatsWithMinStatsUpdateFreq:246->testCompactUpdatesStats:284 » PhoenixIO
Run 2: StatsCollectorIT>BaseOwnClusterHBaseManagedTimeIT.cleanUpAfterTest:29->BaseTest.deletePriorTables:766->BaseTest.deletePriorTables:777->BaseTest.deletePriorTables:811 » PhoenixIO
org.apache.phoenix.end2end.StatsCollectorWithSplitsAndMultiCFIT.testSplitUpdatesStats(org.apache.phoenix.end2end.StatsCollectorWithSplitsAndMultiCFIT)
Run 1: StatsCollectorWithSplitsAndMultiCFIT.testSplitUpdatesStats:245 » PhoenixIO org...
Run 2: StatsCollectorWithSplitsAndMultiCFIT>BaseOwnClusterHBaseManagedTimeIT.cleanUpAfterTest:29->BaseTest.deletePriorTables:766->BaseTest.deletePriorTables:777->BaseTest.deletePriorTables:811 » PhoenixIO
TenantSpecificTablesDDLIT.testAddDropColumn:226 » PhoenixIO org.apache.phoenix...
org.apache.phoenix.end2end.TenantSpecificTablesDDLIT.testAllDropParentTableWithCascadeWithMultipleTenantTablesAndIndexes(org.apache.phoenix.end2end.TenantSpecificTablesDDLIT)
Run 1: TenantSpecificTablesDDLIT>BaseTenantSpecificTablesIT.createTables:68->BaseTest.createTestTable:721->BaseTest.createTestTable:747 » PhoenixIO
Run 2: TenantSpecificTablesDDLIT>BaseOwnClusterClientManagedTimeIT.cleanUpAfterTest:29->BaseTest.deletePriorTables:766->BaseTest.deletePriorTables:777->BaseTest.deletePriorTables:811 » PhoenixIO
org.apache.phoenix.end2end.TenantSpecificTablesDDLIT.testAllowDropParentTableWithCascadeAndSingleTenantTable(org.apache.phoenix.end2end.TenantSpecificTablesDDLIT)
Run 1: TenantSpecificTablesDDLIT>BaseTenantSpecificTablesIT.createTables:68->BaseTest.createTestTable:721->BaseTest.createTestTable:747 » PhoenixIO
Run 2: TenantSpecificTablesDDLIT>BaseOwnClusterClientManagedTimeIT.cleanUpAfterTest:29->BaseTest.deletePriorTables:766->BaseTest.deletePriorTables:777->BaseTest.deletePriorTables:811 » PhoenixIO
org.apache.phoenix.end2end.TenantSpecificTablesDDLIT.testAlterMultiTenantWithViewsToGlobal(org.apache.phoenix.end2end.TenantSpecificTablesDDLIT)
Run 1: TenantSpecificTablesDDLIT>BaseTenantSpecificTablesIT.createTables:68->BaseTest.createTestTable:721->BaseTest.createTestTable:747 » PhoenixIO
Run 2: TenantSpecificTablesDDLIT>BaseOwnClusterClientManagedTimeIT.cleanUpAfterTest:29->BaseTest.deletePriorTables:766->BaseTest.deletePriorTables:777->BaseTest.deletePriorTables:811 » PhoenixIO
org.apache.phoenix.end2end.TenantSpecificTablesDDLIT.testBaseTableWrongFormatWithNoTenantTypeId(org.apache.phoenix.end2end.TenantSpecificTablesDDLIT)
Run 1: TenantSpecificTablesDDLIT>BaseTenantSpecificTablesIT.createTables:68->BaseTest.createTestTable:721->BaseTest.createTestTable:747 » PhoenixIO
Run 2: TenantSpecificTablesDDLIT>BaseOwnClusterClientManagedTimeIT.cleanUpAfterTest:29->BaseTest.deletePriorTables:766->BaseTest.deletePriorTables:777->BaseTest.deletePriorTables:811 » PhoenixIO
org.apache.phoenix.end2end.TenantSpecificTablesDDLIT.testBaseTableWrongFormatWithTenantTypeId(org.apache.phoenix.end2end.TenantSpecificTablesDDLIT)
Run 1: TenantSpecificTablesDDLIT>BaseTenantSpecificTablesIT.createTables:68->BaseTest.createTestTable:721->BaseTest.createTestTable:747 » PhoenixIO
Run 2: TenantSpecificTablesDDLIT>BaseOwnClusterClientManagedTimeIT.cleanUpAfterTest:29->BaseTest.deletePriorTables:766->BaseTest.deletePriorTables:777->BaseTest.deletePriorTables:811 » PhoenixIO
org.apache.phoenix.end2end.TenantSpecificTablesDDLIT.testColumnMutationInParentTableWithExistingTenantTable(org.apache.phoenix.end2end.TenantSpecificTablesDDLIT)
Run 1: TenantSpecificTablesDDLIT>BaseTenantSpecificTablesIT.createTables:68->BaseTest.createTestTable:721->BaseTest.createTestTable:747 » PhoenixIO
Run 2: TenantSpecificTablesDDLIT>BaseOwnClusterClientManagedTimeIT.cleanUpAfterTest:29->BaseTest.deletePriorTables:766->BaseTest.deletePriorTables:777->BaseTest.deletePriorTables:811 » PhoenixIO
org.apache.phoenix.end2end.TenantSpecificTablesDDLIT.testCreateTenantSpecificTable(org.apache.phoenix.end2end.TenantSpecificTablesDDLIT)
Run 1: TenantSpecificTablesDDLIT>BaseTenantSpecificTablesIT.createTables:68->BaseTest.createTestTable:721->BaseTest.createTestTable:747 » PhoenixIO
Run 2: TenantSpecificTablesDDLIT>BaseOwnClusterClientManagedTimeIT.cleanUpAfterTest:29->BaseTest.deletePriorTables:766->BaseTest.deletePriorTables:777->BaseTest.deletePriorTables:811 » PhoenixIO
org.apache.phoenix.end2end.TenantSpecificTablesDDLIT.testCreateTenantTableTwice(org.apache.phoenix.end2end.TenantSpecificTablesDDLIT)
Run 1: TenantSpecificTablesDDLIT>BaseTenantSpecificTablesIT.createTables:68->BaseTest.createTestTable:721->BaseTest.createTestTable:747 » PhoenixIO
Run 2: TenantSpecificTablesDDLIT>BaseOwnClusterClientManagedTimeIT.cleanUpAfterTest:29->BaseTest.deletePriorTables:766->BaseTest.deletePriorTables:777->BaseTest.deletePriorTables:811 » PhoenixIO
org.apache.phoenix.end2end.TenantSpecificTablesDDLIT.testCreateTenantTableWithSameWhereClause(org.apache.phoenix.end2end.TenantSpecificTablesDDLIT)
Run 1: TenantSpecificTablesDDLIT>BaseTenantSpecificTablesIT.createTables:68->BaseTest.createTestTable:721->BaseTest.createTestTable:747 » PhoenixIO
Run 2: TenantSpecificTablesDDLIT>BaseOwnClusterClientManagedTimeIT.cleanUpAfterTest:29->BaseTest.deletePriorTables:766->BaseTest.deletePriorTables:777->BaseTest.deletePriorTables:811 » PhoenixIO
org.apache.phoenix.end2end.TenantSpecificTablesDDLIT.testCreateTenantViewFromNonMultiTenant(org.apache.phoenix.end2end.TenantSpecificTablesDDLIT)
Run 1: TenantSpecificTablesDDLIT>BaseTenantSpecificTablesIT.createTables:68->BaseTest.createTestTable:721->BaseTest.createTestTable:747 » PhoenixIO
Run 2: TenantSpecificTablesDDLIT>BaseOwnClusterClientManagedTimeIT.cleanUpAfterTest:29->BaseTest.deletePriorTables:766->BaseTest.deletePriorTables:777->BaseTest.deletePriorTables:811 » PhoenixIO
org.apache.phoenix.end2end.TenantSpecificTablesDDLIT.testDeletionOfParentTableFailsOnTenantSpecificConnection(org.apache.phoenix.end2end.TenantSpecificTablesDDLIT)
Run 1: TenantSpecificTablesDDLIT>BaseTenantSpecificTablesIT.createTables:68->BaseTest.createTestTable:721->BaseTest.createTestTable:747 » PhoenixIO
Run 2: TenantSpecificTablesDDLIT>BaseOwnClusterClientManagedTimeIT.cleanUpAfterTest:29->BaseTest.deletePriorTables:766->BaseTest.deletePriorTables:777->BaseTest.deletePriorTables:811 » PhoenixIO
org.apache.phoenix.end2end.TenantSpecificTablesDDLIT.testDisallowDropParentTableWithExistingTenantTable(org.apache.phoenix.end2end.TenantSpecificTablesDDLIT)
Run 1: TenantSpecificTablesDDLIT>BaseTenantSpecificTablesIT.createTables:68->BaseTest.createTestTable:721->BaseTest.createTestTable:747 » PhoenixIO
Run 2: TenantSpecificTablesDDLIT>BaseOwnClusterClientManagedTimeIT.cleanUpAfterTest:29->BaseTest.deletePriorTables:766->BaseTest.deletePriorTables:777->BaseTest.deletePriorTables:811 » PhoenixIO
org.apache.phoenix.end2end.TenantSpecificTablesDDLIT.testMutationOfPKInTenantTablesNotAllowed(org.apache.phoenix.end2end.TenantSpecificTablesDDLIT)
Run 1: TenantSpecificTablesDDLIT>BaseTenantSpecificTablesIT.createTables:68->BaseTest.createTestTable:721->BaseTest.createTestTable:747 » PhoenixIO
Run 2: TenantSpecificTablesDDLIT>BaseOwnClusterClientManagedTimeIT.cleanUpAfterTest:29->BaseTest.deletePriorTables:766->BaseTest.deletePriorTables:777->BaseTest.deletePriorTables:811 » PhoenixIO
org.apache.phoenix.end2end.TenantSpecificTablesDDLIT.testTableMetadataScan(org.apache.phoenix.end2end.TenantSpecificTablesDDLIT)
Run 1: TenantSpecificTablesDDLIT>BaseTenantSpecificTablesIT.createTables:68->BaseTest.createTestTable:721->BaseTest.createTestTable:747 » PhoenixIO
Run 2: TenantSpecificTablesDDLIT>BaseOwnClusterClientManagedTimeIT.cleanUpAfterTest:29->BaseTest.deletePriorTables:766->BaseTest.deletePriorTables:777->BaseTest.deletePriorTables:811 » PhoenixIO
org.apache.phoenix.end2end.TenantSpecificTablesDDLIT.testTenantSpecificAndParentTablesMayBeInDifferentSchemas(org.apache.phoenix.end2end.TenantSpecificTablesDDLIT)
Run 1: TenantSpecificTablesDDLIT>BaseTenantSpecificTablesIT.createTables:68->BaseTest.createTestTable:721->BaseTest.createTestTable:747 » PhoenixIO
Run 2: TenantSpecificTablesDDLIT>BaseOwnClusterClientManagedTimeIT.cleanUpAfterTest:29->BaseTest.deletePriorTables:766->BaseTest.deletePriorTables:777->BaseTest.deletePriorTables:811 » PhoenixIO
org.apache.phoenix.end2end.TenantSpecificTablesDDLIT.testTenantSpecificTableCannotDeclarePK(org.apache.phoenix.end2end.TenantSpecificTablesDDLIT)
Run 1: TenantSpecificTablesDDLIT>BaseTenantSpecificTablesIT.createTables:68->BaseTest.createTestTable:721->BaseTest.createTestTable:747 » PhoenixIO
Run 2: TenantSpecificTablesDDLIT>BaseOwnClusterClientManagedTimeIT.cleanUpAfterTest:29->BaseTest.deletePriorTables:766->BaseTest.deletePriorTables:777->BaseTest.deletePriorTables:811 » PhoenixIO
org.apache.phoenix.end2end.TenantSpecificTablesDDLIT.testTenantSpecificTableCannotOverrideParentCol(org.apache.phoenix.end2end.TenantSpecificTablesDDLIT)
Run 1: TenantSpecificTablesDDLIT>BaseTenantSpecificTablesIT.createTables:68->BaseTest.createTestTable:721->BaseTest.createTestTable:747 » PhoenixIO
Run 2: TenantSpecificTablesDDLIT>BaseOwnClusterClientManagedTimeIT.cleanUpAfterTest:29->BaseTest.deletePriorTables:766->BaseTest.deletePriorTables:777->BaseTest.deletePriorTables:811 » PhoenixIO
ViewIT.testNonSaltedUpdatableViewWithIndex:108->BaseViewIT.testUpdatableViewWithIndex:53->BaseViewIT.testUpdatableView:73 » PhoenixIO
org.apache.phoenix.end2end.ViewIT.testReadOnlyOnReadOnlyView(org.apache.phoenix.end2end.ViewIT)
Run 1: ViewIT.testReadOnlyOnReadOnlyView:86->testReadOnlyView:69 » PhoenixIO org.apac...
Run 2: ViewIT>BaseOwnClusterHBaseManagedTimeIT.cleanUpAfterTest:29->BaseTest.deletePriorTables:766->BaseTest.deletePriorTables:777->BaseTest.deletePriorTables:811 » PhoenixIO
org.apache.phoenix.end2end.ViewIT.testReadOnlyView(org.apache.phoenix.end2end.ViewIT)
Run 1: ViewIT.testReadOnlyView:69 » PhoenixIO org.apache.phoenix.exception.PhoenixIOE...
Run 2: ViewIT>BaseOwnClusterHBaseManagedTimeIT.cleanUpAfterTest:29->BaseTest.deletePriorTables:766->BaseTest.deletePriorTables:777->BaseTest.deletePriorTables:811 » PhoenixIO
ViewIT.testReadOnlyViewWithCaseSensitiveColumnNames:272 » PhoenixIO org.apache...
ViewIT.testViewUsesTableIndex:441 » Commit org.apache.hadoop.hbase.client.Retr...
IndexLoadBalancerIT.tearDownAfterClass:89 » RetriesExhausted Failed after atte...
IndexLoadBalancerIT.testBalanceByTable:313 NullPointer
IndexLoadBalancerIT.testBalanceCluster:280 NullPointer
IndexLoadBalancerIT.testColocationAfterSplit:115 NullPointer
IndexLoadBalancerIT.testRandomAssignmentDuringIndexTableEnable:260 NullPointer
IndexLoadBalancerIT.testRetainAssignmentDuringMasterStartUp:382 » TestTimedOut
IndexLoadBalancerIT.testRoundRobinAssignmentAfterRegionServerDown:350 NullPointer
IndexLoadBalancerIT.testRoundRobinAssignmentDuringIndexTableCreation:101 NullPointer
IndexLoadBalancerIT.testRoundRobinAssignmentDuringMasterStartUp:403 NullPointer
CsvBulkLoadToolIT.testImportWithIndex:192 » PhoenixIO org.apache.phoenix.excep...
CsvBulkLoadToolIT.testImportWithLocalIndex:226 » PhoenixIO org.apache.phoenix....
IndexToolIT.testMutalbleIndexWithUpdates:232 » PhoenixIO org.apache.phoenix.ex...
Tests run: 184, Failures: 0, Errors: 83, Skipped: 1
[INFO]
[INFO] --- maven-failsafe-plugin:2.18:verify (ClientManagedTimeTests) @ phoenix-core ---
[INFO] Failsafe report directory: <https://builds.apache.org/job/Phoenix-master/ws/phoenix-core/target/failsafe-reports>
[INFO] ------------------------------------------------------------------------
[INFO] Reactor Summary:
[INFO]
[INFO] Apache Phoenix .................................... SUCCESS [3.119s]
[INFO] Phoenix Core ...................................... FAILURE [1:19:48.475s]
[INFO] Phoenix - Flume ................................... SKIPPED
[INFO] Phoenix - Pig ..................................... SKIPPED
[INFO] Phoenix Assembly .................................. SKIPPED
[INFO] Phoenix - Pherf ................................... SKIPPED
[INFO] ------------------------------------------------------------------------
[INFO] BUILD FAILURE
[INFO] ------------------------------------------------------------------------
[INFO] Total time: 1:19:52.095s
[INFO] Finished at: Thu Mar 19 20:29:41 UTC 2015
[INFO] Final Memory: 43M/713M
[INFO] ------------------------------------------------------------------------
[ERROR] Failed to execute goal org.apache.maven.plugins:maven-failsafe-plugin:2.18:verify (ClientManagedTimeTests) on project phoenix-core: There are test failures.
[ERROR]
[ERROR] Please refer to <https://builds.apache.org/job/Phoenix-master/ws/phoenix-core/target/failsafe-reports> for the individual test results.
[ERROR] -> [Help 1]
[ERROR]
[ERROR] To see the full stack trace of the errors, re-run Maven with the -e switch.
[ERROR] Re-run Maven using the -X switch to enable full debug logging.
[ERROR]
[ERROR] For more information about the errors and possible solutions, please read the following articles:
[ERROR] [Help 1] http://cwiki.apache.org/confluence/display/MAVEN/MojoFailureException
[ERROR]
[ERROR] After correcting the problems, you can resume the build with the command
[ERROR] mvn <goals> -rf :phoenix-core
Build step 'Invoke top-level Maven targets' marked build as failure
Archiving artifacts
Sending artifact delta relative to Phoenix | Master #624
Archived 960 artifacts
Archive block size is 32768
Received 3861 blocks and 813947522 bytes
Compression is 13.5%
Took 4 min 57 sec
Updating PHOENIX-1642
Recording test results
Jenkins build is back to normal : Phoenix | Master #628
Posted by Apache Jenkins Server <je...@builds.apache.org>.
See <https://builds.apache.org/job/Phoenix-master/628/>
Build failed in Jenkins: Phoenix | Master #627
Posted by Apache Jenkins Server <je...@builds.apache.org>.
See <https://builds.apache.org/job/Phoenix-master/627/>
------------------------------------------
[...truncated 99 lines...]
Downloaded: https://repository.apache.org/content/repositories/snapshots/org/apache/hbase/hbase-common/1.0.1-SNAPSHOT/maven-metadata.xml (2 KB at 8.8 KB/sec)
Downloading: https://repository.apache.org/content/repositories/releases/org/apache/hbase/hbase-annotations/1.0.1-SNAPSHOT/maven-metadata.xml
Downloading: https://repository.apache.org/content/repositories/snapshots/org/apache/hbase/hbase-annotations/1.0.1-SNAPSHOT/maven-metadata.xml
Downloading: http://conjars.org/repo/org/apache/hbase/hbase-annotations/1.0.1-SNAPSHOT/maven-metadata.xml
Downloading: https://oss.sonatype.org/content/repositories/snapshots/org/apache/hbase/hbase-annotations/1.0.1-SNAPSHOT/maven-metadata.xml
Downloading: http://repository.apache.org/snapshots/org/apache/hbase/hbase-annotations/1.0.1-SNAPSHOT/maven-metadata.xml
2/2 KB
2/2 KB 2/2 KB
Downloaded: http://repository.apache.org/snapshots/org/apache/hbase/hbase-annotations/1.0.1-SNAPSHOT/maven-metadata.xml (2 KB at 15.8 KB/sec)
Downloading: http://people.apache.org/~garyh/mvn/org/apache/hbase/hbase-annotations/1.0.1-SNAPSHOT/maven-metadata.xml
Downloaded: https://repository.apache.org/content/repositories/snapshots/org/apache/hbase/hbase-annotations/1.0.1-SNAPSHOT/maven-metadata.xml (2 KB at 9.0 KB/sec)
Downloading: http://conjars.org/repo/org/apache/hbase/hbase-protocol/1.0.1-SNAPSHOT/maven-metadata.xml
Downloading: https://repository.apache.org/content/repositories/releases/org/apache/hbase/hbase-protocol/1.0.1-SNAPSHOT/maven-metadata.xml
Downloading: https://oss.sonatype.org/content/repositories/snapshots/org/apache/hbase/hbase-protocol/1.0.1-SNAPSHOT/maven-metadata.xml
Downloading: https://repository.apache.org/content/repositories/snapshots/org/apache/hbase/hbase-protocol/1.0.1-SNAPSHOT/maven-metadata.xml
Downloading: http://repository.apache.org/snapshots/org/apache/hbase/hbase-protocol/1.0.1-SNAPSHOT/maven-metadata.xml
2/2 KB
2/2 KB 2/2 KB
Downloading: http://people.apache.org/~garyh/mvn/org/apache/hbase/hbase-protocol/1.0.1-SNAPSHOT/maven-metadata.xml
Downloaded: https://repository.apache.org/content/repositories/snapshots/org/apache/hbase/hbase-protocol/1.0.1-SNAPSHOT/maven-metadata.xml (2 KB at 8.6 KB/sec)
Downloaded: http://repository.apache.org/snapshots/org/apache/hbase/hbase-protocol/1.0.1-SNAPSHOT/maven-metadata.xml (2 KB at 12.0 KB/sec)
Downloading: http://conjars.org/repo/org/apache/hbase/hbase-client/1.0.1-SNAPSHOT/maven-metadata.xml
Downloading: https://repository.apache.org/content/repositories/releases/org/apache/hbase/hbase-client/1.0.1-SNAPSHOT/maven-metadata.xml
Downloading: https://repository.apache.org/content/repositories/snapshots/org/apache/hbase/hbase-client/1.0.1-SNAPSHOT/maven-metadata.xml
Downloading: https://oss.sonatype.org/content/repositories/snapshots/org/apache/hbase/hbase-client/1.0.1-SNAPSHOT/maven-metadata.xml
Downloading: http://repository.apache.org/snapshots/org/apache/hbase/hbase-client/1.0.1-SNAPSHOT/maven-metadata.xml
2/2 KB
2/2 KB 2/2 KB
Downloading: http://people.apache.org/~garyh/mvn/org/apache/hbase/hbase-client/1.0.1-SNAPSHOT/maven-metadata.xml
Downloaded: https://repository.apache.org/content/repositories/snapshots/org/apache/hbase/hbase-client/1.0.1-SNAPSHOT/maven-metadata.xml (2 KB at 5.7 KB/sec)
Downloaded: http://repository.apache.org/snapshots/org/apache/hbase/hbase-client/1.0.1-SNAPSHOT/maven-metadata.xml (2 KB at 13.2 KB/sec)
Downloading: https://repository.apache.org/content/repositories/releases/org/apache/hbase/hbase-server/1.0.1-SNAPSHOT/maven-metadata.xml
Downloading: https://oss.sonatype.org/content/repositories/snapshots/org/apache/hbase/hbase-server/1.0.1-SNAPSHOT/maven-metadata.xml
Downloading: http://conjars.org/repo/org/apache/hbase/hbase-server/1.0.1-SNAPSHOT/maven-metadata.xml
Downloading: https://repository.apache.org/content/repositories/snapshots/org/apache/hbase/hbase-server/1.0.1-SNAPSHOT/maven-metadata.xml
Downloading: http://repository.apache.org/snapshots/org/apache/hbase/hbase-server/1.0.1-SNAPSHOT/maven-metadata.xml
Downloading: http://people.apache.org/~garyh/mvn/org/apache/hbase/hbase-server/1.0.1-SNAPSHOT/maven-metadata.xml
2/2 KB
2/2 KB 2/2 KB
Downloaded: https://repository.apache.org/content/repositories/snapshots/org/apache/hbase/hbase-server/1.0.1-SNAPSHOT/maven-metadata.xml (2 KB at 3.2 KB/sec)
Downloaded: http://repository.apache.org/snapshots/org/apache/hbase/hbase-server/1.0.1-SNAPSHOT/maven-metadata.xml (2 KB at 4.8 KB/sec)
Downloading: http://conjars.org/repo/org/apache/hbase/hbase-prefix-tree/1.0.1-SNAPSHOT/maven-metadata.xml
Downloading: https://repository.apache.org/content/repositories/releases/org/apache/hbase/hbase-prefix-tree/1.0.1-SNAPSHOT/maven-metadata.xml
Downloading: https://repository.apache.org/content/repositories/snapshots/org/apache/hbase/hbase-prefix-tree/1.0.1-SNAPSHOT/maven-metadata.xml
Downloading: https://oss.sonatype.org/content/repositories/snapshots/org/apache/hbase/hbase-prefix-tree/1.0.1-SNAPSHOT/maven-metadata.xml
2/2 KB
Downloaded: https://repository.apache.org/content/repositories/snapshots/org/apache/hbase/hbase-prefix-tree/1.0.1-SNAPSHOT/maven-metadata.xml (2 KB at 11.9 KB/sec)
Downloading: http://repository.apache.org/snapshots/org/apache/hbase/hbase-prefix-tree/1.0.1-SNAPSHOT/maven-metadata.xml
Downloading: http://people.apache.org/~garyh/mvn/org/apache/hbase/hbase-prefix-tree/1.0.1-SNAPSHOT/maven-metadata.xml
2/2 KB
Downloaded: http://repository.apache.org/snapshots/org/apache/hbase/hbase-prefix-tree/1.0.1-SNAPSHOT/maven-metadata.xml (2 KB at 15.3 KB/sec)
Downloading: http://conjars.org/repo/org/apache/hbase/hbase-hadoop-compat/1.0.1-SNAPSHOT/maven-metadata.xml
Downloading: https://repository.apache.org/content/repositories/releases/org/apache/hbase/hbase-hadoop-compat/1.0.1-SNAPSHOT/maven-metadata.xml
Downloading: https://oss.sonatype.org/content/repositories/snapshots/org/apache/hbase/hbase-hadoop-compat/1.0.1-SNAPSHOT/maven-metadata.xml
Downloading: https://repository.apache.org/content/repositories/snapshots/org/apache/hbase/hbase-hadoop-compat/1.0.1-SNAPSHOT/maven-metadata.xml
Downloading: http://repository.apache.org/snapshots/org/apache/hbase/hbase-hadoop-compat/1.0.1-SNAPSHOT/maven-metadata.xml
2/2 KB
2/2 KB 2/2 KB
Downloaded: http://repository.apache.org/snapshots/org/apache/hbase/hbase-hadoop-compat/1.0.1-SNAPSHOT/maven-metadata.xml (2 KB at 14.6 KB/sec)
Downloading: http://people.apache.org/~garyh/mvn/org/apache/hbase/hbase-hadoop-compat/1.0.1-SNAPSHOT/maven-metadata.xml
Downloaded: https://repository.apache.org/content/repositories/snapshots/org/apache/hbase/hbase-hadoop-compat/1.0.1-SNAPSHOT/maven-metadata.xml (2 KB at 9.3 KB/sec)
Downloading: https://repository.apache.org/content/repositories/releases/org/apache/hbase/hbase-hadoop2-compat/1.0.1-SNAPSHOT/maven-metadata.xml
Downloading: http://conjars.org/repo/org/apache/hbase/hbase-hadoop2-compat/1.0.1-SNAPSHOT/maven-metadata.xml
Downloading: https://oss.sonatype.org/content/repositories/snapshots/org/apache/hbase/hbase-hadoop2-compat/1.0.1-SNAPSHOT/maven-metadata.xml
Downloading: https://repository.apache.org/content/repositories/snapshots/org/apache/hbase/hbase-hadoop2-compat/1.0.1-SNAPSHOT/maven-metadata.xml
Downloading: http://repository.apache.org/snapshots/org/apache/hbase/hbase-hadoop2-compat/1.0.1-SNAPSHOT/maven-metadata.xml
2/2 KB
Downloaded: https://repository.apache.org/content/repositories/snapshots/org/apache/hbase/hbase-hadoop2-compat/1.0.1-SNAPSHOT/maven-metadata.xml (2 KB at 8.9 KB/sec)
Downloading: http://people.apache.org/~garyh/mvn/org/apache/hbase/hbase-hadoop2-compat/1.0.1-SNAPSHOT/maven-metadata.xml
2/2 KB
Downloaded: http://repository.apache.org/snapshots/org/apache/hbase/hbase-hadoop2-compat/1.0.1-SNAPSHOT/maven-metadata.xml (2 KB at 11.7 KB/sec)
[WARNING] Could not transfer metadata org.apache.hbase:hbase-hadoop2-compat:1.0.1-SNAPSHOT/maven-metadata.xml from/to ghelmling.testing (http://people.apache.org/~garyh/mvn/): Connection to http://people.apache.org refused
[WARNING] Failure to transfer org.apache.hbase:hbase-hadoop2-compat:1.0.1-SNAPSHOT/maven-metadata.xml from http://people.apache.org/~garyh/mvn/ was cached in the local repository, resolution will not be reattempted until the update interval of ghelmling.testing has elapsed or updates are forced. Original error: Could not transfer metadata org.apache.hbase:hbase-hadoop2-compat:1.0.1-SNAPSHOT/maven-metadata.xml from/to ghelmling.testing (http://people.apache.org/~garyh/mvn/): Connection to http://people.apache.org refused
[WARNING] Failure to transfer org.apache.hbase:hbase-hadoop2-compat:1.0.1-SNAPSHOT/maven-metadata.xml from http://people.apache.org/~garyh/mvn/ was cached in the local repository, resolution will not be reattempted until the update interval of ghelmling.testing has elapsed or updates are forced. Original error: Could not transfer metadata org.apache.hbase:hbase-hadoop2-compat:1.0.1-SNAPSHOT/maven-metadata.xml from/to ghelmling.testing (http://people.apache.org/~garyh/mvn/): Connection to http://people.apache.org refused
Downloading: https://repository.apache.org/content/repositories/releases/org/apache/hbase/hbase-it/1.0.1-SNAPSHOT/maven-metadata.xml
Downloading: http://conjars.org/repo/org/apache/hbase/hbase-it/1.0.1-SNAPSHOT/maven-metadata.xml
Downloading: https://oss.sonatype.org/content/repositories/snapshots/org/apache/hbase/hbase-it/1.0.1-SNAPSHOT/maven-metadata.xml
Downloading: https://repository.apache.org/content/repositories/snapshots/org/apache/hbase/hbase-it/1.0.1-SNAPSHOT/maven-metadata.xml
Downloading: http://repository.apache.org/snapshots/org/apache/hbase/hbase-it/1.0.1-SNAPSHOT/maven-metadata.xml
2/2 KB
2/2 KB 2/2 KB
Downloaded: https://repository.apache.org/content/repositories/snapshots/org/apache/hbase/hbase-it/1.0.1-SNAPSHOT/maven-metadata.xml (2 KB at 4.3 KB/sec)
Downloaded: http://repository.apache.org/snapshots/org/apache/hbase/hbase-it/1.0.1-SNAPSHOT/maven-metadata.xml (2 KB at 8.7 KB/sec)
Downloading: https://repository.apache.org/content/repositories/releases/org/apache/hbase/hbase-shell/1.0.1-SNAPSHOT/maven-metadata.xml
Downloading: http://conjars.org/repo/org/apache/hbase/hbase-shell/1.0.1-SNAPSHOT/maven-metadata.xml
Downloading: https://repository.apache.org/content/repositories/snapshots/org/apache/hbase/hbase-shell/1.0.1-SNAPSHOT/maven-metadata.xml
Downloading: https://oss.sonatype.org/content/repositories/snapshots/org/apache/hbase/hbase-shell/1.0.1-SNAPSHOT/maven-metadata.xml
Downloading: http://repository.apache.org/snapshots/org/apache/hbase/hbase-shell/1.0.1-SNAPSHOT/maven-metadata.xml
2/2 KB
Downloading: http://people.apache.org/~garyh/mvn/org/apache/hbase/hbase-shell/1.0.1-SNAPSHOT/maven-metadata.xml
2/2 KB 2/2 KB
Downloaded: https://repository.apache.org/content/repositories/snapshots/org/apache/hbase/hbase-shell/1.0.1-SNAPSHOT/maven-metadata.xml (2 KB at 7.9 KB/sec)
Downloaded: http://repository.apache.org/snapshots/org/apache/hbase/hbase-shell/1.0.1-SNAPSHOT/maven-metadata.xml (2 KB at 13.5 KB/sec)
[INFO]
[INFO] --- maven-clean-plugin:2.5:clean (default-clean) @ phoenix-core ---
[INFO] Deleting <https://builds.apache.org/job/Phoenix-master/ws/phoenix-core/target>
[INFO]
[INFO] --- build-helper-maven-plugin:1.9.1:add-test-source (add-test-source) @ phoenix-core ---
[INFO] Test Source directory: <https://builds.apache.org/job/Phoenix-master/ws/phoenix-core/src/it/java> added.
[INFO]
[INFO] --- build-helper-maven-plugin:1.9.1:add-test-resource (add-test-resource) @ phoenix-core ---
[INFO]
[INFO] --- build-helper-maven-plugin:1.9.1:add-source (add-source) @ phoenix-core ---
[INFO] Source directory: <https://builds.apache.org/job/Phoenix-master/ws/phoenix-core/target/generated-sources/antlr3> added.
[INFO] Source directory: <https://builds.apache.org/job/Phoenix-master/ws/phoenix-core/src/main/antlr3> added.
[INFO]
[INFO] --- antlr3-maven-plugin:3.5:antlr (default) @ phoenix-core ---
[INFO] ANTLR: Processing source directory <https://builds.apache.org/job/Phoenix-master/ws/phoenix-core/src/main/antlr3>
ANTLR Parser Generator Version 3.5
Output file <https://builds.apache.org/job/Phoenix-master/ws/phoenix-core/target/generated-sources/antlr3/org/apache/phoenix/parse/PhoenixSQLParser.java> does not exist: must build <https://builds.apache.org/job/Phoenix-master/ws/phoenix-core/src/main/antlr3/PhoenixSQL.g>
PhoenixSQL.g
[INFO]
[INFO] --- maven-dependency-plugin:2.1:build-classpath (create-phoenix-generated-classpath) @ phoenix-core ---
[INFO] Wrote classpath file '<https://builds.apache.org/job/Phoenix-master/ws/phoenix-core/target/cached_classpath.txt'.>
[INFO]
[INFO] --- maven-remote-resources-plugin:1.5:process (default) @ phoenix-core ---
Downloading: http://people.apache.org/~garyh/mvn/org/apache/hbase/hbase/1.0.1-SNAPSHOT/maven-metadata.xml
[INFO]
[INFO] --- maven-resources-plugin:2.6:resources (default-resources) @ phoenix-core ---
[INFO] Using 'UTF-8' encoding to copy filtered resources.
[INFO] Copying 1 resource to META-INF/services
[INFO] Copying 3 resources
[INFO]
[INFO] --- maven-compiler-plugin:3.0:compile (default-compile) @ phoenix-core ---
[INFO] Changes detected - recompiling the module!
[INFO] Compiling 784 source files to <https://builds.apache.org/job/Phoenix-master/ws/phoenix-core/target/classes>
[INFO] -------------------------------------------------------------
[WARNING] COMPILATION WARNING :
[INFO] -------------------------------------------------------------
[WARNING] <https://builds.apache.org/job/Phoenix-master/ws/phoenix-core/src/main/java/org/apache/phoenix/hbase/index/write/ParallelWriterIndexCommitter.java>: Some input files use or override a deprecated API.
[WARNING] <https://builds.apache.org/job/Phoenix-master/ws/phoenix-core/src/main/java/org/apache/phoenix/hbase/index/write/ParallelWriterIndexCommitter.java>: Recompile with -Xlint:deprecation for details.
[WARNING] <https://builds.apache.org/job/Phoenix-master/ws/phoenix-core/src/main/java/org/apache/phoenix/parse/FunctionParseNode.java>: Some input files use unchecked or unsafe operations.
[WARNING] <https://builds.apache.org/job/Phoenix-master/ws/phoenix-core/src/main/java/org/apache/phoenix/parse/FunctionParseNode.java>: Recompile with -Xlint:unchecked for details.
[INFO] 4 warnings
[INFO] -------------------------------------------------------------
[INFO] -------------------------------------------------------------
[ERROR] COMPILATION ERROR :
[INFO] -------------------------------------------------------------
[ERROR] <https://builds.apache.org/job/Phoenix-master/ws/phoenix-core/src/main/java/org/apache/phoenix/trace/util/Tracing.java>:[119,49] SAMPLER_FRACTION_CONF_KEY has private access in org.apache.htrace.impl.ProbabilitySampler
[ERROR] <https://builds.apache.org/job/Phoenix-master/ws/phoenix-core/src/main/java/org/apache/phoenix/trace/util/Tracing.java>:[143,39] SAMPLER_FRACTION_CONF_KEY has private access in org.apache.htrace.impl.ProbabilitySampler
[ERROR] <https://builds.apache.org/job/Phoenix-master/ws/phoenix-core/src/main/java/org/apache/phoenix/hbase/index/scanner/FilteredKeyValueScanner.java>:[38,8] org.apache.phoenix.hbase.index.scanner.FilteredKeyValueScanner is not abstract and does not override abstract method getNextIndexedKey() in org.apache.hadoop.hbase.regionserver.KeyValueScanner
[ERROR] <https://builds.apache.org/job/Phoenix-master/ws/phoenix-core/src/main/java/org/apache/phoenix/hbase/index/scanner/FilteredKeyValueScanner.java>:[165,19] getNextIndexedKey() in org.apache.phoenix.hbase.index.scanner.FilteredKeyValueScanner cannot implement getNextIndexedKey() in org.apache.hadoop.hbase.regionserver.KeyValueScanner
return type byte[] is not compatible with org.apache.hadoop.hbase.Cell
[ERROR] <https://builds.apache.org/job/Phoenix-master/ws/phoenix-core/src/main/java/org/apache/hadoop/hbase/regionserver/IndexHalfStoreFileReader.java>:[143,35] <anonymous org.apache.hadoop.hbase.regionserver.IndexHalfStoreFileReader$1> is not abstract and does not override abstract method getNextIndexedKey() in org.apache.hadoop.hbase.io.hfile.HFileScanner
[ERROR] <https://builds.apache.org/job/Phoenix-master/ws/phoenix-core/src/main/java/org/apache/hadoop/hbase/regionserver/IndexHalfStoreFileReader.java>:[390,27] getNextIndexedKey() in <anonymous org.apache.hadoop.hbase.regionserver.IndexHalfStoreFileReader$1> cannot implement getNextIndexedKey() in org.apache.hadoop.hbase.io.hfile.HFileScanner
return type byte[] is not compatible with org.apache.hadoop.hbase.Cell
[INFO] 6 errors
[INFO] -------------------------------------------------------------
[INFO] ------------------------------------------------------------------------
[INFO] Reactor Summary:
[INFO]
[INFO] Apache Phoenix .................................... SUCCESS [2.458s]
[INFO] Phoenix Core ...................................... FAILURE [2:48.681s]
[INFO] Phoenix - Flume ................................... SKIPPED
[INFO] Phoenix - Pig ..................................... SKIPPED
[INFO] Phoenix Assembly .................................. SKIPPED
[INFO] Phoenix - Pherf ................................... SKIPPED
[INFO] ------------------------------------------------------------------------
[INFO] BUILD FAILURE
[INFO] ------------------------------------------------------------------------
[INFO] Total time: 2:51.579s
[INFO] Finished at: Thu Mar 19 21:26:46 UTC 2015
[INFO] Final Memory: 51M/999M
[INFO] ------------------------------------------------------------------------
[ERROR] Failed to execute goal org.apache.maven.plugins:maven-compiler-plugin:3.0:compile (default-compile) on project phoenix-core: Compilation failure: Compilation failure:
[ERROR] <https://builds.apache.org/job/Phoenix-master/ws/phoenix-core/src/main/java/org/apache/phoenix/trace/util/Tracing.java>:[119,49] SAMPLER_FRACTION_CONF_KEY has private access in org.apache.htrace.impl.ProbabilitySampler
[ERROR] <https://builds.apache.org/job/Phoenix-master/ws/phoenix-core/src/main/java/org/apache/phoenix/trace/util/Tracing.java>:[143,39] SAMPLER_FRACTION_CONF_KEY has private access in org.apache.htrace.impl.ProbabilitySampler
[ERROR] <https://builds.apache.org/job/Phoenix-master/ws/phoenix-core/src/main/java/org/apache/phoenix/hbase/index/scanner/FilteredKeyValueScanner.java>:[38,8] org.apache.phoenix.hbase.index.scanner.FilteredKeyValueScanner is not abstract and does not override abstract method getNextIndexedKey() in org.apache.hadoop.hbase.regionserver.KeyValueScanner
[ERROR] <https://builds.apache.org/job/Phoenix-master/ws/phoenix-core/src/main/java/org/apache/phoenix/hbase/index/scanner/FilteredKeyValueScanner.java>:[165,19] getNextIndexedKey() in org.apache.phoenix.hbase.index.scanner.FilteredKeyValueScanner cannot implement getNextIndexedKey() in org.apache.hadoop.hbase.regionserver.KeyValueScanner
[ERROR] return type byte[] is not compatible with org.apache.hadoop.hbase.Cell
[ERROR] <https://builds.apache.org/job/Phoenix-master/ws/phoenix-core/src/main/java/org/apache/hadoop/hbase/regionserver/IndexHalfStoreFileReader.java>:[143,35] <anonymous org.apache.hadoop.hbase.regionserver.IndexHalfStoreFileReader$1> is not abstract and does not override abstract method getNextIndexedKey() in org.apache.hadoop.hbase.io.hfile.HFileScanner
[ERROR] <https://builds.apache.org/job/Phoenix-master/ws/phoenix-core/src/main/java/org/apache/hadoop/hbase/regionserver/IndexHalfStoreFileReader.java>:[390,27] getNextIndexedKey() in <anonymous org.apache.hadoop.hbase.regionserver.IndexHalfStoreFileReader$1> cannot implement getNextIndexedKey() in org.apache.hadoop.hbase.io.hfile.HFileScanner
[ERROR] return type byte[] is not compatible with org.apache.hadoop.hbase.Cell
[ERROR] -> [Help 1]
[ERROR]
[ERROR] To see the full stack trace of the errors, re-run Maven with the -e switch.
[ERROR] Re-run Maven using the -X switch to enable full debug logging.
[ERROR]
[ERROR] For more information about the errors and possible solutions, please read the following articles:
[ERROR] [Help 1] http://cwiki.apache.org/confluence/display/MAVEN/MojoFailureException
[ERROR]
[ERROR] After correcting the problems, you can resume the build with the command
[ERROR] mvn <goals> -rf :phoenix-core
Build step 'Invoke top-level Maven targets' marked build as failure
Archiving artifacts
Sending artifact delta relative to Phoenix | Master #624
Archived 73 artifacts
Archive block size is 32768
Received 4211 blocks and 102100 bytes
Compression is 99.9%
Took 1 min 15 sec
Recording test results