You are viewing a plain text version of this content. The canonical link for it is here.
Posted to dev@oozie.apache.org by Apache Jenkins Server <je...@builds.apache.org> on 2018/06/18 16:03:13 UTC

Failed: OOZIE-3270 PreCommit Build #631

Jira: https://issues.apache.org/jira/browse/OOZIE-3270
Build: https://builds.apache.org/job/PreCommit-OOZIE-Build/631/

###################################################################################
########################## LAST 100 LINES OF THE CONSOLE ###########################
[...truncated 1.74 MB...]
[TRACE] New XMLLib present, calling 'xmllint --xpath' to get bug instance counts
[DEBUG] There are no new bugs found in [sharelib/spark].
[TRACE] New XMLLib present, calling 'xmllint --xpath' to get bug instance counts
[DEBUG] There are no new bugs found in [client].
[TRACE] New XMLLib present, calling 'xmllint --xpath' to get bug instance counts
[DEBUG] There are no new bugs found in [examples].
[TRACE] New XMLLib present, calling 'xmllint --xpath' to get bug instance counts
[DEBUG] There are no new bugs found in [docs].
[TRACE] New XMLLib present, calling 'xmllint --xpath' to get bug instance counts
[DEBUG] There are no new bugs found in [server].
[ERROR] There are [1] new bugs found below threshold in total that must be fixed.
[TRACE] FindBugs diffs checked and reports created
[TRACE] Summary file size is 2727 bytes
[TRACE] Full summary file size is 1684 bytes
[TRACE] File [/home/jenkins/jenkins-slave/workspace/PreCommit-OOZIE-Build/test-patch/tmp/FINDBUGS_DIFF/diff/findbugs-diff-0.1.0-all.jar] removed
[TRACE] File [/home/jenkins/jenkins-slave/workspace/PreCommit-OOZIE-Build/test-patch/tmp/FINDBUGS_DIFF/diff/findbugs-diff-0.1.0-all.jar.md5sum] removed
  Running test-patch task BACKWARDS_COMPATIBILITY
  Running test-patch task TESTS
  Running test-patch task DISTRO


Testing JIRA OOZIE-3270

Cleaning local git workspace

----------------------------

+1 PATCH_APPLIES
+1 CLEAN
+1 RAW_PATCH_ANALYSIS
    +1 the patch does not introduce any @author tags
    +1 the patch does not introduce any tabs
    +1 the patch does not introduce any trailing spaces
    +1 the patch does not introduce any line longer than 132
    +1 the patch adds/modifies 6 testcase(s)
+1 RAT
    +1 the patch does not seem to introduce new RAT warnings
+1 JAVADOC
+1 JAVADOC
    +1 the patch does not seem to introduce new Javadoc warning(s)
    +1 the patch does not seem to introduce new Javadoc error(s)
    ERROR: the current HEAD has 2 Javadoc error(s)
-1 COMPILE
    +1 HEAD compiles
    +1 patch compiles
    -1 the patch seems to introduce 2 new javac warning(s)
-1 There are [1] new bugs found below threshold in total that must be fixed.
 +1 There are no new bugs found in [webapp].
 +1 There are no new bugs found in [core].
 +1 There are no new bugs found in [tools].
 +1 There are no new bugs found in [sharelib/hive2].
 +1 There are no new bugs found in [sharelib/distcp].
 +1 There are no new bugs found in [sharelib/hcatalog].
 +1 There are no new bugs found in [sharelib/streaming].
 +1 There are no new bugs found in [sharelib/sqoop].
 -1 There are [1] new bugs found below threshold in [sharelib/oozie] that must be fixed.
 You can find the FindBugs diff here (look for the red and orange ones): sharelib/oozie/findbugs-new.html
 The most important FindBugs errors are:
 At AllowAllPolicy.java:[lines 57-74]: Should org.apache.oozie.action.hadoop.security.AllowAllPolicy$AllPermissionCollection be a _static_ inner class?
 +1 There are no new bugs found in [sharelib/pig].
 +1 There are no new bugs found in [sharelib/hive].
 +1 There are no new bugs found in [sharelib/spark].
 +1 There are no new bugs found in [client].
 +1 There are no new bugs found in [examples].
 +1 There are no new bugs found in [docs].
 +1 There are no new bugs found in [server].
+1 BACKWARDS_COMPATIBILITY
    +1 the patch does not change any JPA Entity/Colum/Basic/Lob/Transient annotations
    +1 the patch does not modify JPA files
+1 TESTS
    Tests run: 2148
    Tests failed at first run:
TestCoordActionsKillXCommand#testActionKillCommandDate
    For the complete list of flaky tests, see TEST-SUMMARY-FULL files.
+1 DISTRO
    +1 distro tarball builds with the patch 

----------------------------
-1 Overall result, please check the reported -1(s)


The full output of the test-patch run is available at

 https://builds.apache.org/job/PreCommit-OOZIE-Build/631/

Adding comment to JIRA
  % Total    % Received % Xferd  Average Speed   Time    Time     Time  Current
                                 Dload  Upload   Total   Spent    Left  Speed
  0     0    0     0    0     0      0      0 --:--:-- --:--:-- --:--:--     0100  3566    0     0  100  3566      0   4262 --:--:-- --:--:-- --:--:--  4260{"self":"https://issues.apache.org/jira/rest/api/2/issue/13163126/comment/16515944","id":"16515944","author":{"self":"https://issues.apache.org/jira/rest/api/2/user?username=hadoopqa","name":"hadoopqa","key":"hadoopqa","avatarUrls":{"48x48":"https://issues.apache.org/jira/secure/useravatar?ownerId=hadoopqa&avatarId=10393","24x24":"https://issues.apache.org/jira/secure/useravatar?size=small&ownerId=hadoopqa&avatarId=10393","16x16":"https://issues.apache.org/jira/secure/useravatar?size=xsmall&ownerId=hadoopqa&avatarId=10393","32x32":"https://issues.apache.org/jira/secure/useravatar?size=medium&ownerId=hadoopqa&avatarId=10393"},"displayName":"Hadoop QA","active":true,"timeZone":"Etc/UTC"},"body":"\nTesting JIRA OOZIE-3270\n\nCleaning local git workspace\n\n----------------------------\n\n{color:green}+1 PATCH_APPLIES{color}\n{color:green}+1 CLEAN{color}\n{color:green}+1 RAW_PATCH_ANALYSIS{color}\n.    {color:green}+1{color} the patch does not introduce any @author tags\n.    {color:green}+1{color} the patch does not introduce any tabs\n.    {color:green}+1{color} the patch does not introduce any trailing spaces\n.    {color:green}+1{color} the patch does not introduce any line longer than 132\n.    {color:green}+1{color} the patch adds/modifies 6 testcase(s)\n{color:green}+1 RAT{color}\n.    {color:green}+1{color} the patch does not seem to introduce new RAT warnings\n{color:green}+1 JAVADOC{color}\n{color:green}+1 JAVADOC{color}\n.    {color:green}+1{color} the patch does not seem to introduce new Javadoc warning(s)\n.    {color:green}+1{color} the patch does not seem to introduce new Javadoc error(s)\n.    {color:red}ERROR{color}: the current HEAD has 2 Javadoc error(s)\n{color:red}-1 COMPILE{color}\n.    {color:green}+1{color} HEAD compiles\n.    {color:green}+1{color} patch compiles\n.    {color:red}-1{color} the patch seems to introduce 2 new javac warning(s)\n{color:red}-1{color} There are [1] new bugs found below threshold in total that must be fixed.\n. {color:green}+1{color} There are no new bugs found in [webapp].\n. {color:green}+1{color} There are no new bugs found in [core].\n. {color:green}+1{color} There are no new bugs found in [tools].\n. {color:green}+1{color} There are no new bugs found in [sharelib/hive2].\n. {color:green}+1{color} There are no new bugs found in [sharelib/distcp].\n. {color:green}+1{color} There are no new bugs found in [sharelib/hcatalog].\n. {color:green}+1{color} There are no new bugs found in [sharelib/streaming].\n. {color:green}+1{color} There are no new bugs found in [sharelib/sqoop].\n. {color:red}-1{color} There are [1] new bugs found below threshold in [sharelib/oozie] that must be fixed.\n. You can find the FindBugs diff here (look for the red and orange ones): sharelib/oozie/findbugs-new.html\n. The most important FindBugs errors are:\n. At AllowAllPolicy.java:[lines 57-74]: Should org.apache.oozie.action.hadoop.security.AllowAllPolicy$AllPermissionCollection be a _static_ inner class?\n. {color:green}+1{color} There are no new bugs found in [sharelib/pig].\n. {color:green}+1{color} There are no new bugs found in [sharelib/hive].\n. {color:green}+1{color} There are no new bugs found in [sharelib/spark].\n. {color:green}+1{color} There are no new bugs found in [client].\n. {color:green}+1{color} There are no new bugs found in [examples].\n. {color:green}+1{color} There are no new bugs found in [docs].\n. {color:green}+1{color} There are no new bugs found in [server].\n{color:green}+1 BACKWARDS_COMPATIBILITY{color}\n.    {color:green}+1{color} the patch does not change any JPA Entity/Colum/Basic/Lob/Transient annotations\n.    {color:green}+1{color} the patch does not modify JPA files\n{color:green}+1 TESTS{color}\n.    Tests run: 2148\n.    {color:orange}Tests failed at first run:{color}\nTestCoordActionsKillXCommand#testActionKillCommandDate\n.    For the complete list of flaky tests, see TEST-SUMMARY-FULL files.\n{color:green}+1 DISTRO{color}\n.    {color:green}+1{color} distro tarball builds with the patch \n\n----------------------------\n{color:red}*-1 Overall result, ple100  8508    0  4942  100  3566   5905   4261 --:--:-- --:--:-- --:--:--  5904
ase check the reported -1(s)*{color}\n\n\nThe full output of the test-patch run is available at\n\n. https://builds.apache.org/job/PreCommit-OOZIE-Build/631/\n\n","updateAuthor":{"self":"https://issues.apache.org/jira/rest/api/2/user?username=hadoopqa","name":"hadoopqa","key":"hadoopqa","avatarUrls":{"48x48":"https://issues.apache.org/jira/secure/useravatar?ownerId=hadoopqa&avatarId=10393","24x24":"https://issues.apache.org/jira/secure/useravatar?size=small&ownerId=hadoopqa&avatarId=10393","16x16":"https://issues.apache.org/jira/secure/useravatar?size=xsmall&ownerId=hadoopqa&avatarId=10393","32x32":"https://issues.apache.org/jira/secure/useravatar?size=medium&ownerId=hadoopqa&avatarId=10393"},"displayName":"Hadoop QA","active":true,"timeZone":"Etc/UTC"},"created":"2018-06-18T16:03:04.478+0000","updated":"2018-06-18T16:03:04.478+0000"}
test-patch exit code: 1

Build step 'Execute shell' marked build as failure
[description-setter] Description set: OOZIE-3270
Archiving artifacts
[Fast Archiver] Compressed 1.89 MB of artifacts by 66.3% relative to #629
Recording test results
Email was triggered for: Failure - Any
Sending email for trigger: Failure - Any



###################################################################################
############################## FAILED TESTS (if any) ##############################
All tests passed

Success: OOZIE-3270 PreCommit Build #633

Posted by Apache Jenkins Server <je...@builds.apache.org>.
Jira: https://issues.apache.org/jira/browse/OOZIE-3270
Build: https://builds.apache.org/job/PreCommit-OOZIE-Build/633/

###################################################################################
########################## LAST 100 LINES OF THE CONSOLE ###########################
[...truncated 1.78 MB...]
[TRACE] New XMLLib present, calling 'xmllint --xpath' to get bug instance counts
[DEBUG] There are no new bugs found in [sharelib/hive].
[TRACE] New XMLLib present, calling 'xmllint --xpath' to get bug instance counts
[DEBUG] There are no new bugs found in [sharelib/hcatalog].
[TRACE] New XMLLib present, calling 'xmllint --xpath' to get bug instance counts
[DEBUG] There are no new bugs found in [sharelib/sqoop].
[TRACE] New XMLLib present, calling 'xmllint --xpath' to get bug instance counts
[WARN] There are [1] new bugs found in [sharelib/oozie].
[DEBUG] You can find the FindBugs diff here: sharelib/oozie/findbugs-new.html
[TRACE] New XMLLib present, calling 'xmllint --xpath' to get bug instance counts
[DEBUG] There are no new bugs found in [sharelib/distcp].
[TRACE] New XMLLib present, calling 'xmllint --xpath' to get bug instance counts
[DEBUG] There are no new bugs found in [sharelib/spark].
[TRACE] New XMLLib present, calling 'xmllint --xpath' to get bug instance counts
[DEBUG] There are no new bugs found in [client].
[WARN] There are [1] new bugs found in total that would be nice to have fixed.
[TRACE] FindBugs diffs checked and reports created
[TRACE] Summary file size is 2590 bytes
[TRACE] Full summary file size is 1539 bytes
[TRACE] File [/home/jenkins/jenkins-slave/workspace/PreCommit-OOZIE-Build@2/test-patch/tmp/FINDBUGS_DIFF/diff/findbugs-diff-0.1.0-all.jar] removed
[TRACE] File [/home/jenkins/jenkins-slave/workspace/PreCommit-OOZIE-Build@2/test-patch/tmp/FINDBUGS_DIFF/diff/findbugs-diff-0.1.0-all.jar.md5sum] removed
  Running test-patch task BACKWARDS_COMPATIBILITY
  Running test-patch task TESTS
  Running test-patch task DISTRO


Testing JIRA OOZIE-3270

Cleaning local git workspace

----------------------------

+1 PATCH_APPLIES
+1 CLEAN
+1 RAW_PATCH_ANALYSIS
    +1 the patch does not introduce any @author tags
    +1 the patch does not introduce any tabs
    +1 the patch does not introduce any trailing spaces
    +1 the patch does not introduce any line longer than 132
    +1 the patch adds/modifies 7 testcase(s)
+1 RAT
    +1 the patch does not seem to introduce new RAT warnings
+1 JAVADOC
+1 JAVADOC
    +1 the patch does not seem to introduce new Javadoc warning(s)
    +1 the patch does not seem to introduce new Javadoc error(s)
    ERROR: the current HEAD has 2 Javadoc error(s)
+1 COMPILE
    +1 HEAD compiles
    +1 patch compiles
    +1 the patch does not seem to introduce new javac warnings
0 There are [1] new bugs found in total that would be nice to have fixed.
 +1 There are no new bugs found in [examples].
 +1 There are no new bugs found in [webapp].
 +1 There are no new bugs found in [core].
 +1 There are no new bugs found in [tools].
 +1 There are no new bugs found in [fluent-job/fluent-job-api].
 +1 There are no new bugs found in [server].
 +1 There are no new bugs found in [docs].
 +1 There are no new bugs found in [sharelib/hive2].
 +1 There are no new bugs found in [sharelib/pig].
 +1 There are no new bugs found in [sharelib/streaming].
 +1 There are no new bugs found in [sharelib/hive].
 +1 There are no new bugs found in [sharelib/hcatalog].
 +1 There are no new bugs found in [sharelib/sqoop].
 0 There are [1] new bugs found in [sharelib/oozie] that would be nice to have fixed.
 You can find the FindBugs diff here: sharelib/oozie/findbugs-new.html
 +1 There are no new bugs found in [sharelib/distcp].
 +1 There are no new bugs found in [sharelib/spark].
 +1 There are no new bugs found in [client].
+1 BACKWARDS_COMPATIBILITY
    +1 the patch does not change any JPA Entity/Colum/Basic/Lob/Transient annotations
    +1 the patch does not modify JPA files
+1 TESTS
    Tests run: 2897
+1 DISTRO
    +1 distro tarball builds with the patch 

----------------------------
+1 Overall result, good!, no -1s


The full output of the test-patch run is available at

 https://builds.apache.org/job/PreCommit-OOZIE-Build/633/

Adding comment to JIRA
  % Total    % Received % Xferd  Average Speed   Time    Time     Time  Current
                                 Dload  Upload   Total   Spent    Left  Speed
  0     0    0     0    0     0      0      0 --:--:-- --:--:-- --:--:--     0100  3229    0     0  100  3229      0   3868 --:--:-- --:--:-- --:--:--  3867{"self":"https://issues.apache.org/jira/rest/api/2/issue/13163126/comment/16516963","id":"16516963","author":{"self":"https://issues.apache.org/jira/rest/api/2/user?username=hadoopqa","name":"hadoopqa","key":"hadoopqa","avatarUrls":{"48x48":"https://issues.apache.org/jira/secure/useravatar?ownerId=hadoopqa&avatarId=10393","24x24":"https://issues.apache.org/jira/secure/useravatar?size=small&ownerId=hadoopqa&avatarId=10393","16x16":"https://issues.apache.org/jira/secure/useravatar?size=xsmall&ownerId=hadoopqa&avatarId=10393","32x32":"https://issues.apache.org/jira/secure/useravatar?size=medium&ownerId=hadoopqa&avatarId=10393"},"displayName":"Hadoop QA","active":true,"timeZone":"Etc/UTC"},"body":"\nTesting JIRA OOZIE-3270\n\nCleaning local git workspace\n\n----------------------------\n\n{color:green}+1 PATCH_APPLIES{color}\n{color:green}+1 CLEAN{color}\n{color:green}+1 RAW_PATCH_ANALYSIS{color}\n.    {color:green}+1{color} the patch does not introduce any @author tags\n.    {color:green}+1{color} the patch does not introduce any tabs\n.    {color:green}+1{color} the patch does not introduce any trailing spaces\n.    {color:green}+1{color} the patch does not introduce any line longer than 132\n.    {color:green}+1{color} the patch adds/modifies 7 testcase(s)\n{color:green}+1 RAT{color}\n.    {color:green}+1{color} the patch does not seem to introduce new RAT warnings\n{color:green}+1 JAVADOC{color}\n{color:green}+1 JAVADOC{color}\n.    {color:green}+1{color} the patch does not seem to introduce new Javadoc warning(s)\n.    {color:green}+1{color} the patch does not seem to introduce new Javadoc error(s)\n.    {color:red}ERROR{color}: the current HEAD has 2 Javadoc error(s)\n{color:green}+1 COMPILE{color}\n.    {color:green}+1{color} HEAD compiles\n.    {color:green}+1{color} patch compiles\n.    {color:green}+1{color} the patch does not seem to introduce new javac warnings\n{color:orange}0{color} There are [1] new bugs found in total that would be nice to have fixed.\n. {color:green}+1{color} There are no new bugs found in [examples].\n. {color:green}+1{color} There are no new bugs found in [webapp].\n. {color:green}+1{color} There are no new bugs found in [core].\n. {color:green}+1{color} There are no new bugs found in [tools].\n. {color:green}+1{color} There are no new bugs found in [fluent-job/fluent-job-api].\n. {color:green}+1{color} There are no new bugs found in [server].\n. {color:green}+1{color} There are no new bugs found in [docs].\n. {color:green}+1{color} There are no new bugs found in [sharelib/hive2].\n. {color:green}+1{color} There are no new bugs found in [sharelib/pig].\n. {color:green}+1{color} There are no new bugs found in [sharelib/streaming].\n. {color:green}+1{color} There are no new bugs found in [sharelib/hive].\n. {color:green}+1{color} There are no new bugs found in [sharelib/hcatalog].\n. {color:green}+1{color} There are no new bugs found in [sharelib/sqoop].\n. {color:orange}0{color} There are [1] new bugs found in [sharelib/oozie] that would be nice to have fixed.\n. You can find the FindBugs diff here: sharelib/oozie/findbugs-new.html\n. {color:green}+1{color} There are no new bugs found in [sharelib/distcp].\n. {color:green}+1{color} There are no new bugs found in [sharelib/spark].\n. {color:green}+1{color} There are no new bugs found in [client].\n{color:green}+1 BACKWARDS_COMPATIBILITY{color}\n.    {color:green}+1{color} the patch does not change any JPA Entity/Colum/Basic/Lob/Transient annotations\n.    {color:green}+1{color} the patch does not modify JPA files\n{color:green}+1 TESTS{color}\n.    Tests run: 2897\n{color:green}+1 DISTRO{color}\n.    {color:green}+1{color} distro tarball builds with the patch \n\n----------------------------\n{color:green}*+1 Overall result, good!, no -1s*{color}\n\n\nThe full output of the test-patch run is available at\n\n. https://builds.apache.org/job/PreCommit-OOZIE-Build/633/\n\n","updateAuthor":{"self":"https://issues.apache.org/jira/rest/api/2/user?username=hadoopqa","name":"hadoopqa","key":"hadoopqa","avatarUrls":{"48x48":"https://issues.apache.org/100  7834    0  4605  100  3229   5515   3867 --:--:-- --:--:-- --:--:--  5514
jira/secure/useravatar?ownerId=hadoopqa&avatarId=10393","24x24":"https://issues.apache.org/jira/secure/useravatar?size=small&ownerId=hadoopqa&avatarId=10393","16x16":"https://issues.apache.org/jira/secure/useravatar?size=xsmall&ownerId=hadoopqa&avatarId=10393","32x32":"https://issues.apache.org/jira/secure/useravatar?size=medium&ownerId=hadoopqa&avatarId=10393"},"displayName":"Hadoop QA","active":true,"timeZone":"Etc/UTC"},"created":"2018-06-19T11:33:23.142+0000","updated":"2018-06-19T11:33:23.142+0000"}
test-patch exit code: 0

[description-setter] Description set: OOZIE-3270
Archiving artifacts
[Fast Archiver] Compressed 1.97 MB of artifacts by 60.2% relative to #629
Recording test results
Email was triggered for: Success
Sending email for trigger: Success



###################################################################################
############################## FAILED TESTS (if any) ##############################
All tests passed

Failed: OOZIE-3135 PreCommit Build #632

Posted by Apache Jenkins Server <je...@builds.apache.org>.
Jira: https://issues.apache.org/jira/browse/OOZIE-3135
Build: https://builds.apache.org/job/PreCommit-OOZIE-Build/632/

###################################################################################
########################## LAST 100 LINES OF THE CONSOLE ###########################
[...truncated 1.73 MB...]
[TRACE] New XMLLib present, calling 'xmllint --xpath' to get bug instance counts
[DEBUG] There are no new bugs found in [sharelib/hcatalog].
[TRACE] New XMLLib present, calling 'xmllint --xpath' to get bug instance counts
[ERROR] There are [1] new bugs found below threshold in [sharelib/sqoop].
[DEBUG] You can find the FindBugs diff here (look for the red and orange ones): sharelib/sqoop/findbugs-new.html
[TRACE] New XMLLib present, calling 'xmllint --xpath' to get bug instance counts
[DEBUG] There are no new bugs found in [sharelib/oozie].
[TRACE] New XMLLib present, calling 'xmllint --xpath' to get bug instance counts
[DEBUG] There are no new bugs found in [sharelib/distcp].
[TRACE] New XMLLib present, calling 'xmllint --xpath' to get bug instance counts
[DEBUG] There are no new bugs found in [sharelib/spark].
[TRACE] New XMLLib present, calling 'xmllint --xpath' to get bug instance counts
[DEBUG] There are no new bugs found in [client].
[ERROR] There are [1] new bugs found below threshold in total that must be fixed.
[TRACE] FindBugs diffs checked and reports created
[TRACE] Summary file size is 2749 bytes
[TRACE] Full summary file size is 1697 bytes
[TRACE] File [/home/jenkins/jenkins-slave/workspace/PreCommit-OOZIE-Build/test-patch/tmp/FINDBUGS_DIFF/diff/findbugs-diff-0.1.0-all.jar] removed
[TRACE] File [/home/jenkins/jenkins-slave/workspace/PreCommit-OOZIE-Build/test-patch/tmp/FINDBUGS_DIFF/diff/findbugs-diff-0.1.0-all.jar.md5sum] removed
  Running test-patch task BACKWARDS_COMPATIBILITY
  Running test-patch task TESTS
  Running test-patch task DISTRO


Testing JIRA OOZIE-3135

Cleaning local git workspace

----------------------------

+1 PATCH_APPLIES
+1 CLEAN
-1 RAW_PATCH_ANALYSIS
    +1 the patch does not introduce any @author tags
    +1 the patch does not introduce any tabs
    +1 the patch does not introduce any trailing spaces
    +1 the patch does not introduce any line longer than 132
    -1 the patch does not add/modify any testcase
+1 RAT
    +1 the patch does not seem to introduce new RAT warnings
+1 JAVADOC
+1 JAVADOC
    +1 the patch does not seem to introduce new Javadoc warning(s)
    +1 the patch does not seem to introduce new Javadoc error(s)
    ERROR: the current HEAD has 2 Javadoc error(s)
+1 COMPILE
    +1 HEAD compiles
    +1 patch compiles
    +1 the patch does not seem to introduce new javac warnings
-1 There are [1] new bugs found below threshold in total that must be fixed.
 +1 There are no new bugs found in [examples].
 +1 There are no new bugs found in [webapp].
 +1 There are no new bugs found in [core].
 +1 There are no new bugs found in [tools].
 +1 There are no new bugs found in [server].
 +1 There are no new bugs found in [docs].
 +1 There are no new bugs found in [sharelib/hive2].
 +1 There are no new bugs found in [sharelib/pig].
 +1 There are no new bugs found in [sharelib/streaming].
 +1 There are no new bugs found in [sharelib/hive].
 +1 There are no new bugs found in [sharelib/hcatalog].
 -1 There are [1] new bugs found below threshold in [sharelib/sqoop] that must be fixed.
 You can find the FindBugs diff here (look for the red and orange ones): sharelib/sqoop/findbugs-new.html
 The most important FindBugs errors are:
 At SqoopMain.java:[line 126]: Found reliance on default encoding in org.apache.oozie.action.hadoop.SqoopMain.setUpSqoopLog4J2(String): new java.io.FileWriter(File)
 +1 There are no new bugs found in [sharelib/oozie].
 +1 There are no new bugs found in [sharelib/distcp].
 +1 There are no new bugs found in [sharelib/spark].
 +1 There are no new bugs found in [client].
+1 BACKWARDS_COMPATIBILITY
    +1 the patch does not change any JPA Entity/Colum/Basic/Lob/Transient annotations
    +1 the patch does not modify JPA files
+1 TESTS
    Tests run: 2148
+1 DISTRO
    +1 distro tarball builds with the patch 

----------------------------
-1 Overall result, please check the reported -1(s)


The full output of the test-patch run is available at

 https://builds.apache.org/job/PreCommit-OOZIE-Build/632/

Adding comment to JIRA
  % Total    % Received % Xferd  Average Speed   Time    Time     Time  Current
                                 Dload  Upload   Total   Spent    Left  Speed
  0     0    0     0    0     0      0      0 --:--:-- --:--:-- --:--:--     0100  3405    0     0  100  3405      0   3073  0:00:01  0:00:01 --:--:--  3075{"self":"https://issues.apache.org/jira/rest/api/2/issue/13121916/comment/16516920","id":"16516920","author":{"self":"https://issues.apache.org/jira/rest/api/2/user?username=hadoopqa","name":"hadoopqa","key":"hadoopqa","avatarUrls":{"48x48":"https://issues.apache.org/jira/secure/useravatar?ownerId=hadoopqa&avatarId=10393","24x24":"https://issues.apache.org/jira/secure/useravatar?size=small&ownerId=hadoopqa&avatarId=10393","16x16":"https://issues.apache.org/jira/secure/useravatar?size=xsmall&ownerId=hadoopqa&avatarId=10393","32x32":"https://issues.apache.org/jira/secure/useravatar?size=medium&ownerId=hadoopqa&avatarId=10393"},"displayName":"Hadoop QA","active":true,"timeZone":"Etc/UTC"},"body":"\nTesting JIRA OOZIE-3135\n\nCleaning local git workspace\n\n----------------------------\n\n{color:green}+1 PATCH_APPLIES{color}\n{color:green}+1 CLEAN{color}\n{color:red}-1 RAW_PATCH_ANALYSIS{color}\n.    {color:green}+1{color} the patch does not introduce any @author tags\n.    {color:green}+1{color} the patch does not introduce any tabs\n.    {color:green}+1{color} the patch does not introduce any trailing spaces\n.    {color:green}+1{color} the patch does not introduce any line longer than 132\n.    {color:red}-1{color} the patch does not add/modify any testcase\n{color:green}+1 RAT{color}\n.    {color:green}+1{color} the patch does not seem to introduce new RAT warnings\n{color:green}+1 JAVADOC{color}\n{color:green}+1 JAVADOC{color}\n.    {color:green}+1{color} the patch does not seem to introduce new Javadoc warning(s)\n.    {color:green}+1{color} the patch does not seem to introduce new Javadoc error(s)\n.    {color:red}ERROR{color}: the current HEAD has 2 Javadoc error(s)\n{color:green}+1 COMPILE{color}\n.    {color:green}+1{color} HEAD compiles\n.    {color:green}+1{color} patch compiles\n.    {color:green}+1{color} the patch does not seem to introduce new javac warnings\n{color:red}-1{color} There are [1] new bugs found below threshold in total that must be fixed.\n. {color:green}+1{color} There are no new bugs found in [examples].\n. {color:green}+1{color} There are no new bugs found in [webapp].\n. {color:green}+1{color} There are no new bugs found in [core].\n. {color:green}+1{color} There are no new bugs found in [tools].\n. {color:green}+1{color} There are no new bugs found in [server].\n. {color:green}+1{color} There are no new bugs found in [docs].\n. {color:green}+1{color} There are no new bugs found in [sharelib/hive2].\n. {color:green}+1{color} There are no new bugs found in [sharelib/pig].\n. {color:green}+1{color} There are no new bugs found in [sharelib/streaming].\n. {color:green}+1{color} There are no new bugs found in [sharelib/hive].\n. {color:green}+1{color} There are no new bugs found in [sharelib/hcatalog].\n. {color:red}-1{color} There are [1] new bugs found below threshold in [sharelib/sqoop] that must be fixed.\n. You can find the FindBugs diff here (look for the red and orange ones): sharelib/sqoop/findbugs-new.html\n. The most important FindBugs errors are:\n. At SqoopMain.java:[line 126]: Found reliance on default encoding in org.apache.oozie.action.hadoop.SqoopMain.setUpSqoopLog4J2(String): new java.io.FileWriter(File)\n. {color:green}+1{color} There are no new bugs found in [sharelib/oozie].\n. {color:green}+1{color} There are no new bugs found in [sharelib/distcp].\n. {color:green}+1{color} There are no new bugs found in [sharelib/spark].\n. {color:green}+1{color} There are no new bugs found in [client].\n{color:green}+1 BACKWARDS_COMPATIBILITY{color}\n.    {color:green}+1{color} the patch does not change any JPA Entity/Colum/Basic/Lob/Transient annotations\n.    {color:green}+1{color} the patch does not modify JPA files\n{color:green}+1 TESTS{color}\n.    Tests run: 2148\n{color:green}+1 DISTRO{color}\n.    {color:green}+1{color} distro tarball builds with the patch \n\n----------------------------\n{color:red}*-1 Overall result, please check the reported -1(s)*{color}\n\n\nThe full output of the test-patch run is available at\n\n. https://builds.apache.org/job/PreCommit-OOZIE-Build/632/\n\n100  8186    0  4781  100  3405   4315   3073  0:00:01  0:00:01 --:--:--  4318
","updateAuthor":{"self":"https://issues.apache.org/jira/rest/api/2/user?username=hadoopqa","name":"hadoopqa","key":"hadoopqa","avatarUrls":{"48x48":"https://issues.apache.org/jira/secure/useravatar?ownerId=hadoopqa&avatarId=10393","24x24":"https://issues.apache.org/jira/secure/useravatar?size=small&ownerId=hadoopqa&avatarId=10393","16x16":"https://issues.apache.org/jira/secure/useravatar?size=xsmall&ownerId=hadoopqa&avatarId=10393","32x32":"https://issues.apache.org/jira/secure/useravatar?size=medium&ownerId=hadoopqa&avatarId=10393"},"displayName":"Hadoop QA","active":true,"timeZone":"Etc/UTC"},"created":"2018-06-19T10:29:39.812+0000","updated":"2018-06-19T10:29:39.812+0000"}
test-patch exit code: 1

Build step 'Execute shell' marked build as failure
[description-setter] Description set: OOZIE-3135
Archiving artifacts
[Fast Archiver] Compressed 1.87 MB of artifacts by 76.7% relative to #629
Recording test results
Email was triggered for: Failure - Any
Sending email for trigger: Failure - Any



###################################################################################
############################## FAILED TESTS (if any) ##############################
All tests passed