You are viewing a plain text version of this content. The canonical link for it is here.
Posted to builds@cassandra.apache.org by Apache Jenkins Server <je...@builds.apache.org> on 2023/01/17 12:40:54 UTC
Build complete: Cassandra-4.1 #244 [UNSTABLE] c9968a8e95253a23846be1b5f502773a1eeea48d
-------------------------------------------------------------------------------
Build Cassandra-4.1 #244 Still Unstable
URL: https://ci-cassandra.apache.org/job/Cassandra-4.1/244/
-------------------------------------------------------------------------------
Changes:
[Paulo Motta] Fix sstable loading of keyspaces named snapshots or backups
-------------------------------------------------------------------------------
Failed Tests:
5 tests failed.
FAILED: dtest-upgrade.upgrade_tests.upgrade_through_versions_test.TestUpgrade_indev_3_11_x_To_indev_4_1_x.test_bootstrap
FAILED: dtest-upgrade.upgrade_tests.upgrade_through_versions_test.TestUpgrade_indev_3_11_x_To_indev_4_1_x.test_bootstrap_multidc
FAILED: dtest-upgrade.upgrade_tests.upgrade_through_versions_test.TestUpgrade_current_4_0_x_To_indev_4_1_x.test_bootstrap
FAILED: junit.framework.TestSuite.org.apache.cassandra.distributed.test.CASMultiDCTest
FAILED: org.apache.cassandra.concurrent.InfiniteLoopExecutorTest.testShutdownNow-cdc
-------------------------------------------------------------------------------
For complete test report and logs see https://nightlies.apache.org/cassandra/Cassandra-4.1/244/