You are viewing a plain text version of this content. The canonical link for it is here.
Posted to notifications@maven.apache.org by Apache Jenkins Server <je...@builds.apache.org> on 2021/08/13 14:32:50 UTC
Build unstable in Jenkins: Maven » Maven TLP » maven-javadoc-plugin » stabilize #8
See https://ci-maven.apache.org/job/Maven/job/maven-box/job/maven-javadoc-plugin/job/stabilize/8/
Changes:
* assert complete -J-Dhttp.nonProxyHosts argument including surrounding quotes
1 tests failed.
FAILED: org.apache.maven.plugins.javadoc.JavadocReportTest.windows-jdk8-m3.2.x_build / Build windows-jdk8-m3.2.x_build / testTaglets
Error Message:
An error has occurred in Javadoc report generation:
Exit code: 1 - javadoc: error - Error - Exception java.lang.reflect.InvocationTargetException thrown while trying to register Taglet org.tullmann.taglets.ToDo...
f:\jenkins\jenkins-home\82467a7c\workspace\x_maven-javadoc-plugin_stabilize@2\windows-jdk8-m3.2.x_build\src\test\resources\unit\taglet-test\taglet\test\App.java:25: error: unknown tag: todo
* @todo To test!
^
f:\jenkins\jenkins-home\82467a7c\workspace\x_maven-javadoc-plugin_stabilize@2\windows-jdk8-m3.2.x_build\src\test\resources\unit\taglet-test\taglet\test\AppSample.java:28: error: unknown tag: todo
* @todo To test!
^
Command line was: cmd.exe /X /C "f:\jenkins\tools\java\latest1.8\jre\..\bin\javadoc.exe @options @packages @argfile"
Refer to the generated Javadoc files in 'f:\jenkins\jenkins-home\82467a7c\workspace\x_maven-javadoc-plugin_stabilize@2\windows-jdk8-m3.2.x_build\target\test\unit\taglet-test\target\site\apidocs' dir.
Stack Trace:
org.apache.maven.plugin.MojoExecutionException:
An error has occurred in Javadoc report generation:
Exit code: 1 - javadoc: error - Error - Exception java.lang.reflect.InvocationTargetException thrown while trying to register Taglet org.tullmann.taglets.ToDo...
f:\jenkins\jenkins-home\82467a7c\workspace\x_maven-javadoc-plugin_stabilize@2\windows-jdk8-m3.2.x_build\src\test\resources\unit\taglet-test\taglet\test\App.java:25: error: unknown tag: todo
* @todo To test!
^
f:\jenkins\jenkins-home\82467a7c\workspace\x_maven-javadoc-plugin_stabilize@2\windows-jdk8-m3.2.x_build\src\test\resources\unit\taglet-test\taglet\test\AppSample.java:28: error: unknown tag: todo
* @todo To test!
^
Command line was: cmd.exe /X /C "f:\jenkins\tools\java\latest1.8\jre\..\bin\javadoc.exe @options @packages @argfile"
Refer to the generated Javadoc files in 'f:\jenkins\jenkins-home\82467a7c\workspace\x_maven-javadoc-plugin_stabilize@2\windows-jdk8-m3.2.x_build\target\test\unit\taglet-test\target\site\apidocs' dir.
at org.apache.maven.plugins.javadoc.AbstractJavadocMojo.failOnError(AbstractJavadocMojo.java:7051)
at org.apache.maven.plugins.javadoc.JavadocReport.doExecute(JavadocReport.java:328)
at org.apache.maven.plugins.javadoc.AbstractJavadocMojo.execute(AbstractJavadocMojo.java:2015)
at org.apache.maven.plugins.javadoc.JavadocReportTest.testTaglets(JavadocReportTest.java:692)
at sun.reflect.NativeMethodAccessorImpl.invoke0(Native Method)
at sun.reflect.NativeMethodAccessorImpl.invoke(NativeMethodAccessorImpl.java:62)
at sun.reflect.DelegatingMethodAccessorImpl.invoke(DelegatingMethodAccessorImpl.java:43)
at java.lang.reflect.Method.invoke(Method.java:498)
at junit.framework.TestCase.runTest(TestCase.java:177)
at junit.framework.TestCase.runBare(TestCase.java:142)
at junit.framework.TestResult$1.protect(TestResult.java:122)
at junit.framework.TestResult.runProtected(TestResult.java:142)
at junit.framework.TestResult.run(TestResult.java:125)
at junit.framework.TestCase.run(TestCase.java:130)
at junit.framework.TestSuite.runTest(TestSuite.java:241)
at junit.framework.TestSuite.run(TestSuite.java:236)
at org.junit.internal.runners.JUnit38ClassRunner.run(JUnit38ClassRunner.java:90)
at org.apache.maven.surefire.junit4.JUnit4Provider.execute(JUnit4Provider.java:365)
at org.apache.maven.surefire.junit4.JUnit4Provider.executeWithRerun(JUnit4Provider.java:273)
at org.apache.maven.surefire.junit4.JUnit4Provider.executeTestSet(JUnit4Provider.java:238)
at org.apache.maven.surefire.junit4.JUnit4Provider.invoke(JUnit4Provider.java:159)
at org.apache.maven.surefire.booter.ForkedBooter.invokeProviderInSameClassLoader(ForkedBooter.java:383)
at org.apache.maven.surefire.booter.ForkedBooter.runSuitesInProcess(ForkedBooter.java:344)
at org.apache.maven.surefire.booter.ForkedBooter.execute(ForkedBooter.java:125)
at org.apache.maven.surefire.booter.ForkedBooter.main(ForkedBooter.java:417)
Caused by: org.apache.maven.reporting.MavenReportException:
Exit code: 1 - javadoc: error - Error - Exception java.lang.reflect.InvocationTargetException thrown while trying to register Taglet org.tullmann.taglets.ToDo...
f:\jenkins\jenkins-home\82467a7c\workspace\x_maven-javadoc-plugin_stabilize@2\windows-jdk8-m3.2.x_build\src\test\resources\unit\taglet-test\taglet\test\App.java:25: error: unknown tag: todo
* @todo To test!
^
f:\jenkins\jenkins-home\82467a7c\workspace\x_maven-javadoc-plugin_stabilize@2\windows-jdk8-m3.2.x_build\src\test\resources\unit\taglet-test\taglet\test\AppSample.java:28: error: unknown tag: todo
* @todo To test!
^
Command line was: cmd.exe /X /C "f:\jenkins\tools\java\latest1.8\jre\..\bin\javadoc.exe @options @packages @argfile"
Refer to the generated Javadoc files in 'f:\jenkins\jenkins-home\82467a7c\workspace\x_maven-javadoc-plugin_stabilize@2\windows-jdk8-m3.2.x_build\target\test\unit\taglet-test\target\site\apidocs' dir.
at org.apache.maven.plugins.javadoc.AbstractJavadocMojo.doExecuteJavadocCommandLine(AbstractJavadocMojo.java:6043)
at org.apache.maven.plugins.javadoc.AbstractJavadocMojo.executeJavadocCommandLine(AbstractJavadocMojo.java:5925)
at org.apache.maven.plugins.javadoc.AbstractJavadocMojo.executeReport(AbstractJavadocMojo.java:2258)
at org.apache.maven.plugins.javadoc.JavadocReport.generate(JavadocReport.java:135)
at org.apache.maven.plugins.javadoc.JavadocReport.doExecute(JavadocReport.java:324)
... 23 more
Build log:
[...truncated 9781 lines...]
[INFO] Building: MJAVADOC-634-module-testreports\pom.xml
[INFO] run post-build script verify.bsh
[INFO] MJAVADOC-437\pom.xml ............................. SUCCESS (10.0 s)
[INFO] Building: MJAVADOC-444\pom.xml
[INFO] MJAVADOC-634-module-testreports\pom.xml .......... SUCCESS (9.1 s)
[INFO] Building: MJAVADOC-636-aggregate_module_skipped\pom.xml
[INFO] run post-build script verify.bsh
[INFO] MJAVADOC-444\pom.xml ............................. SUCCESS (17.2 s)
[INFO] Building: MJAVADOC-449_aggr_modulepath\pom.xml
[INFO] MJAVADOC-449_aggr_modulepath\pom.xml ............. SKIPPED due to JRE version
[INFO] Building: MJAVADOC-452_fix-duplicateparams\pom.xml
[INFO] run post-build script verify.groovy
[INFO] MJAVADOC-452_fix-duplicateparams\pom.xml ......... SUCCESS (4.7 s)
[INFO] Building: MJAVADOC-494_aggregate-repositories\pom.xml
[INFO] run post-build script verify.groovy
[INFO] MJAVADOC-636-aggregate_module_skipped\pom.xml .... SUCCESS (19.4 s)
[INFO] Building: MJAVADOC-639_aggr_static_modulepath\pom.xml
[INFO] MJAVADOC-494_aggregate-repositories\pom.xml ...... SUCCESS (9.9 s)
[INFO] Building: MJAVADOC-495_offline-filescheme\pom.xml
[INFO] MJAVADOC-639_aggr_static_modulepath\pom.xml ...... SUCCESS (9.5 s)
[INFO] Building: MJAVADOC-639_requires_ignored\pom.xml
[INFO] artifact org.apache.maven.plugins:maven-source-plugin: checking for updates from central
[INFO] run post-build script verify.groovy
[INFO] MJAVADOC-495_offline-filescheme\pom.xml .......... SUCCESS (7.9 s)
[INFO] Building: MJAVADOC-497\pom.xml
[INFO] run post-build script verify.bsh
[INFO] MJAVADOC-497\pom.xml ............................. SUCCESS (10.6 s)
[INFO] Building: MJAVADOC-498_aggr_modulepath\pom.xml
[INFO] MJAVADOC-498_aggr_modulepath\pom.xml ............. SKIPPED due to JRE version
[INFO] Building: MJAVADOC-498_mm_modulepath\pom.xml
[INFO] MJAVADOC-498_mm_modulepath\pom.xml ............... SKIPPED due to JRE version
[INFO] Building: MJAVADOC-498_modulepath\pom.xml
[INFO] MJAVADOC-498_modulepath\pom.xml .................. SKIPPED due to JRE version
[INFO] Building: MJAVADOC-506_excl-module-info\pom.xml
[INFO] run post-build script verify.groovy
[INFO] MJAVADOC-639_requires_ignored\pom.xml ............ SUCCESS (14.9 s)
[INFO] Building: MJAVADOC-661_mrjar\pom.xml
[INFO] run post-build script verify.groovy
[INFO] MJAVADOC-661_mrjar\pom.xml ....................... SUCCESS (8.2 s)
[INFO] Building: MJAVADOC-672_multiline-tag\pom.xml
[INFO] run post-build script verify.groovy
[INFO] MJAVADOC-506_excl-module-info\pom.xml ............ SUCCESS (10.2 s)
[INFO] Building: MJAVADOC-508\pom.xml
[INFO] MJAVADOC-508\pom.xml ............................. SUCCESS (4.1 s)
[INFO] Building: MJAVADOC-514_3rdparty-doclettags\pom.xml
[INFO] MJAVADOC-672_multiline-tag\pom.xml ............... SUCCESS (7.3 s)
[INFO] Building: site-failOnError\pom.xml
[INFO] site-failOnError\pom.xml ......................... SUCCESS (7.7 s)
[INFO]
[INFO] --- mrm-maven-plugin:1.2.0:stop (repository) @ maven-javadoc-plugin ---
[INFO] Stopping Mock Repository Manager on http://localhost:59158
[INFO] Stopped SocketConnector@0.0.0.0:59158
[INFO] Mock Repository Manager http://localhost:59158 is stopped.
[INFO]
[INFO] --- mrm-maven-plugin:1.2.0:stop (3rdparty) @ maven-javadoc-plugin ---
[INFO] Stopping Mock Repository Manager on http://localhost:59159
[INFO] Stopped SocketConnector@0.0.0.0:59159
[INFO] Mock Repository Manager http://localhost:59159 is stopped.
[INFO]
[INFO] --- maven-checkstyle-plugin:3.0.0:check (checkstyle-check) @ maven-javadoc-plugin ---
[INFO] MJAVADOC-514_3rdparty-doclettags\pom.xml ......... SUCCESS (9.2 s)
[INFO] Building: MJAVADOC-526_aggr-managedDeps\pom.xml
[INFO] There are 4 errors reported by Checkstyle 6.18 with config/maven_checks.xml ruleset.
[INFO] Ignored 4 errors, 0 violation remaining.
[INFO]
[INFO] --- maven-invoker-plugin:3.2.1:verify (integration-test) @ maven-javadoc-plugin ---
[INFO] -------------------------------------------------
[INFO] Build Summary:
[INFO] Passed: 76, Failed: 0, Errors: 0, Skipped: 6
[INFO] -------------------------------------------------
[INFO] ------------------------------------------------------------------------
[INFO] BUILD SUCCESS
[INFO] ------------------------------------------------------------------------
[INFO] Total time: 15:46 min
[INFO] Finished at: 2021-08-13T07:29:35-07:00
[INFO] ------------------------------------------------------------------------
[INFO] [jenkins-event-spy] Generated F:\jenkins\jenkins-slave\82467a7c\workspace\x_maven-javadoc-plugin_stabilize@2@tmp\withMaven3d1a5ad7\maven-spy-20210813-071349-280152301569127003888.log
[Pipeline] }
[Pipeline] // dir
[Pipeline] }
[withMaven] artifactsPublisher - Archive artifact windows-jdk16-m3.6.x_build\pom.xml under org\apache\maven\plugins\maven-javadoc-plugin\3.3.1-SNAPSHOT\maven-javadoc-plugin-3.3.1-SNAPSHOT.pom
[withMaven] artifactsPublisher - Archive artifact windows-jdk16-m3.6.x_build\target\maven-javadoc-plugin-3.3.1-SNAPSHOT.jar under org\apache\maven\plugins\maven-javadoc-plugin\3.3.1-SNAPSHOT\maven-javadoc-plugin-3.3.1-SNAPSHOT.jar
[Fast Archiver] Compressed 529.78 KB of artifacts by 72.5% relative to #7
[withMaven] junitPublisher - Archive test results for Maven artifact org.apache.maven.plugins:maven-javadoc-plugin:maven-plugin:3.3.1-SNAPSHOT generated by maven-surefire-plugin:test (default-test): windows-jdk16-m3.6.x_build\target\surefire-reports\*.xml
Recording test results
[INFO] MJAVADOC-526_aggr-managedDeps\pom.xml ............ SUCCESS (10.3 s)
[INFO] Building: MJAVADOC-528\pom.xml
[withMaven] Jenkins Task Scanner Plugin not found, don't display results of source code scanning for 'TODO' and 'FIXME' in pipeline screen.
[withMaven] invokerPublisher - Archive invoker results for Maven artifact MavenArtifact{org.apache.maven.plugins:maven-javadoc-plugin:maven-plugin:3.3.1-SNAPSHOT(version: 3.3.1-SNAPSHOT, snapshot:false) } generated by PluginInvocation{org.apache.maven.plugins:maven-invoker-plugin:3.2.1@integration-test integration-test}: windows-jdk16-m3.6.x_build\target\invoker-reports\*.xml
[INFO] run post-build script verify.groovy
[INFO] MJAVADOC-528\pom.xml ............................. SUCCESS (9.9 s)
[INFO] Building: MJAVADOC-538\pom.xml
[INFO] MJAVADOC-538\pom.xml ............................. SUCCESS (3.9 s)
[INFO] Building: MJAVADOC-551 spaces\pom.xml
[INFO] MJAVADOC-551 spaces\pom.xml ...................... SUCCESS (3.5 s)
[INFO] Building: MJAVADOC-552_fix-author\pom.xml
[INFO] run post-build script verify.groovy
[INFO] MJAVADOC-552_fix-author\pom.xml .................. SUCCESS (4.8 s)
[INFO] Building: MJAVADOC-555_aggr_mixed\pom.xml
[INFO] MJAVADOC-555_aggr_mixed\pom.xml .................. SKIPPED due to JRE version
[INFO] Building: MJAVADOC-555_link-automatic-modules\pom.xml
[INFO] MJAVADOC-555_link-automatic-modules\pom.xml ...... SKIPPED due to non-matching selectors
[INFO] Building: MJAVADOC-556_hide-non-exported-packages\pom.xml
[INFO] MJAVADOC-556_hide-non-exported-packages\pom.xml .. SKIPPED due to JRE version
[INFO] Building: MJAVADOC-558_fix-unknownthrows\pom.xml
[INFO] run post-build script verify.groovy
[INFO] MJAVADOC-558_fix-unknownthrows\pom.xml ........... SUCCESS (4.8 s)
[INFO] Building: MJAVADOC-562_release\pom.xml
[INFO] MJAVADOC-562_release\pom.xml ..................... SKIPPED due to JRE version
[INFO] Building: MJAVADOC-567_aggr-mixed\pom.xml
[INFO] MJAVADOC-567_aggr-mixed\pom.xml .................. SKIPPED due to JRE version
[INFO] Building: MJAVADOC-568_export-to-testcase\pom.xml
[INFO] MJAVADOC-568_export-to-testcase\pom.xml .......... SKIPPED due to JRE version
[INFO] Building: MJAVADOC-568_jar-mixed\pom.xml
[INFO] MJAVADOC-568_jar-mixed\pom.xml ................... SKIPPED due to JRE version
[INFO] Building: MJAVADOC-568_manifest-splitpackage\pom.xml
[INFO] MJAVADOC-568_manifest-splitpackage\pom.xml ....... SKIPPED due to JRE version
[INFO] Building: MJAVADOC-569_aggr-mixed\pom.xml
[INFO] MJAVADOC-569_aggr-mixed\pom.xml .................. SKIPPED due to JRE version
[INFO] Building: MJAVADOC-571_aggr-empty-sourcepaths\pom.xml
[INFO] MJAVADOC-571_aggr-empty-sourcepaths\pom.xml ...... SKIPPED due to JRE version
[INFO] Building: MJAVADOC-575_source8-module-info\pom.xml
[INFO] run post-build script verify.groovy
[INFO] MJAVADOC-575_source8-module-info\pom.xml ......... SUCCESS (4.8 s)
[INFO] Building: MJAVADOC-580_detectLinks\pom.xml
[INFO] run post-build script verify.groovy
[INFO] MJAVADOC-580_detectLinks\pom.xml ................. SUCCESS (3.8 s)
[INFO] Building: MJAVADOC-590_nooverview\pom.xml
[INFO] run post-build script verify.groovy
[INFO] MJAVADOC-590_nooverview\pom.xml .................. SUCCESS (4.4 s)
[INFO] Building: MJAVADOC-591_release8\pom.xml
[INFO] MJAVADOC-591_release8\pom.xml .................... SKIPPED due to JRE version
[INFO] Building: MJAVADOC-592_detectApiLink\pom.xml
[INFO] run post-build script verify.groovy
[INFO] MJAVADOC-592_detectApiLink\pom.xml ............... SUCCESS (3.8 s)
[INFO] Building: MJAVADOC-599\pom.xml
[INFO] run post-build script verify.groovy
[INFO] MJAVADOC-599\pom.xml ............................. SUCCESS (5.1 s)
[INFO] Building: MJAVADOC-610_mrjar\pom.xml
[INFO] MJAVADOC-610_mrjar\pom.xml ....................... SKIPPED due to JRE version
[INFO] Building: MJAVADOC-611_dependencyLinks\pom.xml
[INFO] run post-build script verify.groovy
[INFO] MJAVADOC-611_dependencyLinks\pom.xml ............. SUCCESS (16.8 s)
[INFO] Building: MJAVADOC-613-aggregate-exclude\pom.xml
[INFO] run post-build script verify.groovy
[INFO] MJAVADOC-613-aggregate-exclude\pom.xml ........... SUCCESS (6.9 s)
[INFO] Building: MJAVADOC-619_copyright-year\pom.xml
[INFO] run post-build script verify.groovy
[INFO] MJAVADOC-619_copyright-year\pom.xml .............. SUCCESS (4.5 s)
[INFO] Building: MJAVADOC-620_no-dot-in-version\pom.xml
[INFO] run post-build script verify.bsh
[INFO] MJAVADOC-620_no-dot-in-version\pom.xml ........... SUCCESS (9.0 s)
[INFO] Building: MJAVADOC-620_top-level-package\pom.xml
[INFO] run post-build script verify.bsh
[INFO] MJAVADOC-620_top-level-package\pom.xml ........... SUCCESS (9.2 s)
[INFO] Building: MJAVADOC-625_addstylesheet\pom.xml
[INFO] run post-build script verify.groovy
[INFO] MJAVADOC-625_addstylesheet\pom.xml ............... SUCCESS (4.6 s)
[INFO] Building: MJAVADOC-634-module-testreports\pom.xml
[INFO] MJAVADOC-634-module-testreports\pom.xml .......... SKIPPED due to JRE version
[INFO] Building: MJAVADOC-636-aggregate_module_skipped\pom.xml
[INFO] run post-build script verify.groovy
[INFO] MJAVADOC-636-aggregate_module_skipped\pom.xml .... SUCCESS (11.0 s)
[INFO] Building: MJAVADOC-639_aggr_static_modulepath\pom.xml
[INFO] MJAVADOC-639_aggr_static_modulepath\pom.xml ...... SKIPPED due to JRE version
[INFO] Building: MJAVADOC-639_requires_ignored\pom.xml
[INFO] MJAVADOC-639_requires_ignored\pom.xml ............ SKIPPED due to JRE version
[INFO] Building: MJAVADOC-661_mrjar\pom.xml
[INFO] MJAVADOC-661_mrjar\pom.xml ....................... SKIPPED due to JRE version
[INFO] Building: MJAVADOC-672_multiline-tag\pom.xml
[INFO] MJAVADOC-672_multiline-tag\pom.xml ............... SUCCESS (4.5 s)
[INFO] Building: site-failOnError\pom.xml
[INFO] site-failOnError\pom.xml ......................... SUCCESS (5.6 s)
[INFO]
[INFO] --- mrm-maven-plugin:1.2.0:stop (repository) @ maven-javadoc-plugin ---
[INFO] Stopping Mock Repository Manager on http://localhost:57164
[INFO] Stopped SocketConnector@0.0.0.0:57164
[INFO] Mock Repository Manager http://localhost:57164 is stopped.
[INFO]
[INFO] --- mrm-maven-plugin:1.2.0:stop (3rdparty) @ maven-javadoc-plugin ---
[INFO] Stopping Mock Repository Manager on http://localhost:57165
[INFO] Stopped SocketConnector@0.0.0.0:57165
[INFO] Mock Repository Manager http://localhost:57165 is stopped.
[INFO]
[INFO] --- maven-checkstyle-plugin:3.0.0:check (checkstyle-check) @ maven-javadoc-plugin ---
[INFO] There are 4 errors reported by Checkstyle 6.18 with config/maven_checks.xml ruleset.
[INFO] Ignored 4 errors, 0 violation remaining.
[INFO]
[INFO] --- maven-invoker-plugin:3.2.1:verify (integration-test) @ maven-javadoc-plugin ---
[INFO] -------------------------------------------------
[INFO] Build Summary:
[INFO] Passed: 62, Failed: 0, Errors: 0, Skipped: 20
[INFO] -------------------------------------------------
[INFO] ------------------------------------------------------------------------
[INFO] BUILD SUCCESS
[INFO] ------------------------------------------------------------------------
[INFO] Total time: 19:57 min
[INFO] Finished at: 2021-08-13T14:31:47+00:00
[INFO] Final Memory: 69M/1193M
[INFO] ------------------------------------------------------------------------
[INFO] [jenkins-event-spy] Generated F:\jenkins\jenkins-home\82467a7c\workspace\x_maven-javadoc-plugin_stabilize@2@tmp\withMaven18554ea4\maven-spy-20210813-141145-4045774538038168169450.log
Picked up JAVA_TOOL_OPTIONS: -Dmaven.ext.class.path="f:\jenkins\jenkins-home\82467a7c\workspace\x_maven-javadoc-plugin_stabilize@2@tmp\withMaven18554ea4\pipeline-maven-spy.jar" -Dorg.jenkinsci.plugins.pipeline.maven.reportsFolder="f:\jenkins\jenkins-home\82467a7c\workspace\x_maven-javadoc-plugin_stabilize@2@tmp\withMaven18554ea4"
[Pipeline] }
[Pipeline] // dir
[Pipeline] }
[withMaven] artifactsPublisher - Archive artifact windows-jdk8-m3.2.x_build\pom.xml under org\apache\maven\plugins\maven-javadoc-plugin\3.3.1-SNAPSHOT\maven-javadoc-plugin-3.3.1-SNAPSHOT.pom
[withMaven] artifactsPublisher - Archive artifact windows-jdk8-m3.2.x_build\target\maven-javadoc-plugin-3.3.1-SNAPSHOT.jar under org\apache\maven\plugins\maven-javadoc-plugin\3.3.1-SNAPSHOT\maven-javadoc-plugin-3.3.1-SNAPSHOT.jar
[Fast Archiver] Compressed 529.13 KB of artifacts by 90.7% relative to #7
[withMaven] junitPublisher - Archive test results for Maven artifact org.apache.maven.plugins:maven-javadoc-plugin:maven-plugin:3.3.1-SNAPSHOT generated by maven-surefire-plugin:test (default-test): windows-jdk8-m3.2.x_build\target\surefire-reports\*.xml
Recording test results
[withMaven] Jenkins Task Scanner Plugin not found, don't display results of source code scanning for 'TODO' and 'FIXME' in pipeline screen.
[withMaven] invokerPublisher - Archive invoker results for Maven artifact MavenArtifact{org.apache.maven.plugins:maven-javadoc-plugin:maven-plugin:3.3.1-SNAPSHOT(version: 3.3.1-SNAPSHOT, snapshot:false) } generated by PluginInvocation{org.apache.maven.plugins:maven-invoker-plugin:3.2.1@integration-test integration-test}: windows-jdk8-m3.2.x_build\target\invoker-reports\*.xml
[withMaven] Publishers: Generated Artifacts Publisher: 4827 ms, Junit Publisher: 8623 ms, Open Task Scanner Publisher: 11 ms, Invoker Publisher: 122443 ms, Pipeline Graph Publisher: 7 ms
[Pipeline] // withMaven
[Pipeline] cleanWs
[WS-CLEANUP] Deleting project workspace...
[WS-CLEANUP] Deferred wipeout is used...
[WS-CLEANUP] done
[Pipeline] }
[Pipeline] // stage
[Pipeline] }
[Pipeline] // ws
[Pipeline] }
[Pipeline] // node
[Pipeline] }
[withMaven] Publishers: Generated Artifacts Publisher: 691 ms, Junit Publisher: 927 ms, Open Task Scanner Publisher: 1 ms, Invoker Publisher: 59917 ms
[Pipeline] // withMaven
[Pipeline] cleanWs
[WS-CLEANUP] Deleting project workspace...
[WS-CLEANUP] Deferred wipeout is used...
[WS-CLEANUP] done
[Pipeline] }
[Pipeline] // stage
[Pipeline] }
[Pipeline] // ws
[Pipeline] }
[Pipeline] // node
[Pipeline] }
[Pipeline] // parallel
[Pipeline] stage
[Pipeline] { (Notifications)
[Pipeline] echo
Build result: UNSTABLE
[Pipeline] jiraIssueSelector
[Pipeline] echo
The authors of changes [rfscholte].
[Pipeline] echo
Sending email ...
[Pipeline] emailext