You are viewing a plain text version of this content. The canonical link for it is here.
Posted to dev@lucene.apache.org by Policeman Jenkins Server <je...@thetaphi.de> on 2014/06/17 23:11:38 UTC

[JENKINS] Lucene-Solr-4.x-MacOSX (64bit/jdk1.7.0) - Build # 1621 - Still Failing!

Build: http://jenkins.thetaphi.de/job/Lucene-Solr-4.x-MacOSX/1621/
Java: 64bit/jdk1.7.0 -XX:-UseCompressedOops -XX:+UseG1GC

2 tests failed.
REGRESSION:  org.apache.solr.MinimalSchemaTest.testAllConfiguredHandlers

Error Message:
posix_spawn is not a supported process launch mechanism on this platform.

Stack Trace:
java.lang.Error: posix_spawn is not a supported process launch mechanism on this platform.
	at __randomizedtesting.SeedInfo.seed([2EAE098B4D94C291:C3B0B2B1C699C315]:0)
	at java.lang.UNIXProcess$1.run(UNIXProcess.java:104)
	at java.lang.UNIXProcess$1.run(UNIXProcess.java:93)
	at java.security.AccessController.doPrivileged(Native Method)
	at java.lang.UNIXProcess.<clinit>(UNIXProcess.java:91)
	at java.lang.ProcessImpl.start(ProcessImpl.java:130)
	at java.lang.ProcessBuilder.start(ProcessBuilder.java:1022)
	at java.lang.Runtime.exec(Runtime.java:617)
	at java.lang.Runtime.exec(Runtime.java:450)
	at java.lang.Runtime.exec(Runtime.java:347)
	at org.apache.solr.handler.admin.SystemInfoHandler.execute(SystemInfoHandler.java:220)
	at org.apache.solr.handler.admin.SystemInfoHandler.getSystemInfo(SystemInfoHandler.java:176)
	at org.apache.solr.handler.admin.SystemInfoHandler.handleRequestBody(SystemInfoHandler.java:97)
	at org.apache.solr.handler.RequestHandlerBase.handleRequest(RequestHandlerBase.java:135)
	at org.apache.solr.core.SolrCore.execute(SolrCore.java:1962)
	at org.apache.solr.util.TestHarness.query(TestHarness.java:295)
	at org.apache.solr.util.TestHarness.query(TestHarness.java:278)
	at org.apache.solr.SolrTestCaseJ4.assertQ(SolrTestCaseJ4.java:678)
	at org.apache.solr.MinimalSchemaTest.testAllConfiguredHandlers(MinimalSchemaTest.java:115)
	at sun.reflect.NativeMethodAccessorImpl.invoke0(Native Method)
	at sun.reflect.NativeMethodAccessorImpl.invoke(NativeMethodAccessorImpl.java:57)
	at sun.reflect.DelegatingMethodAccessorImpl.invoke(DelegatingMethodAccessorImpl.java:43)
	at java.lang.reflect.Method.invoke(Method.java:606)
	at com.carrotsearch.randomizedtesting.RandomizedRunner.invoke(RandomizedRunner.java:1618)
	at com.carrotsearch.randomizedtesting.RandomizedRunner$6.evaluate(RandomizedRunner.java:827)
	at com.carrotsearch.randomizedtesting.RandomizedRunner$7.evaluate(RandomizedRunner.java:863)
	at com.carrotsearch.randomizedtesting.RandomizedRunner$8.evaluate(RandomizedRunner.java:877)
	at com.carrotsearch.randomizedtesting.rules.SystemPropertiesRestoreRule$1.evaluate(SystemPropertiesRestoreRule.java:53)
	at org.apache.lucene.util.TestRuleSetupTeardownChained$1.evaluate(TestRuleSetupTeardownChained.java:50)
	at org.apache.lucene.util.TestRuleFieldCacheSanity$1.evaluate(TestRuleFieldCacheSanity.java:51)
	at org.apache.lucene.util.AbstractBeforeAfterRule$1.evaluate(AbstractBeforeAfterRule.java:46)
	at com.carrotsearch.randomizedtesting.rules.SystemPropertiesInvariantRule$1.evaluate(SystemPropertiesInvariantRule.java:55)
	at org.apache.lucene.util.TestRuleThreadAndTestName$1.evaluate(TestRuleThreadAndTestName.java:49)
	at org.apache.lucene.util.TestRuleIgnoreAfterMaxFailures$1.evaluate(TestRuleIgnoreAfterMaxFailures.java:65)
	at org.apache.lucene.util.TestRuleMarkFailure$1.evaluate(TestRuleMarkFailure.java:48)
	at com.carrotsearch.randomizedtesting.rules.StatementAdapter.evaluate(StatementAdapter.java:36)
	at com.carrotsearch.randomizedtesting.ThreadLeakControl$StatementRunner.run(ThreadLeakControl.java:360)
	at com.carrotsearch.randomizedtesting.ThreadLeakControl.forkTimeoutingTask(ThreadLeakControl.java:793)
	at com.carrotsearch.randomizedtesting.ThreadLeakControl$3.evaluate(ThreadLeakControl.java:453)
	at com.carrotsearch.randomizedtesting.RandomizedRunner.runSingleTest(RandomizedRunner.java:836)
	at com.carrotsearch.randomizedtesting.RandomizedRunner$3.evaluate(RandomizedRunner.java:738)
	at com.carrotsearch.randomizedtesting.RandomizedRunner$4.evaluate(RandomizedRunner.java:772)
	at com.carrotsearch.randomizedtesting.RandomizedRunner$5.evaluate(RandomizedRunner.java:783)
	at com.carrotsearch.randomizedtesting.rules.StatementAdapter.evaluate(StatementAdapter.java:36)
	at com.carrotsearch.randomizedtesting.rules.SystemPropertiesRestoreRule$1.evaluate(SystemPropertiesRestoreRule.java:53)
	at org.apache.lucene.util.AbstractBeforeAfterRule$1.evaluate(AbstractBeforeAfterRule.java:46)
	at org.apache.lucene.util.TestRuleStoreClassName$1.evaluate(TestRuleStoreClassName.java:42)
	at com.carrotsearch.randomizedtesting.rules.SystemPropertiesInvariantRule$1.evaluate(SystemPropertiesInvariantRule.java:55)
	at com.carrotsearch.randomizedtesting.rules.NoShadowingOrOverridesOnMethodsRule$1.evaluate(NoShadowingOrOverridesOnMethodsRule.java:39)
	at com.carrotsearch.randomizedtesting.rules.NoShadowingOrOverridesOnMethodsRule$1.evaluate(NoShadowingOrOverridesOnMethodsRule.java:39)
	at com.carrotsearch.randomizedtesting.rules.StatementAdapter.evaluate(StatementAdapter.java:36)
	at com.carrotsearch.randomizedtesting.rules.StatementAdapter.evaluate(StatementAdapter.java:36)
	at com.carrotsearch.randomizedtesting.rules.StatementAdapter.evaluate(StatementAdapter.java:36)
	at org.apache.lucene.util.TestRuleAssertionsRequired$1.evaluate(TestRuleAssertionsRequired.java:43)
	at org.apache.lucene.util.TestRuleMarkFailure$1.evaluate(TestRuleMarkFailure.java:48)
	at org.apache.lucene.util.TestRuleIgnoreAfterMaxFailures$1.evaluate(TestRuleIgnoreAfterMaxFailures.java:65)
	at org.apache.lucene.util.TestRuleIgnoreTestSuites$1.evaluate(TestRuleIgnoreTestSuites.java:55)
	at com.carrotsearch.randomizedtesting.rules.StatementAdapter.evaluate(StatementAdapter.java:36)
	at com.carrotsearch.randomizedtesting.ThreadLeakControl$StatementRunner.run(ThreadLeakControl.java:360)
	at java.lang.Thread.run(Thread.java:745)


REGRESSION:  org.apache.solr.handler.admin.InfoHandlerTest.testOverriddenHandlers

Error Message:
Could not initialize class java.lang.UNIXProcess

Stack Trace:
java.lang.NoClassDefFoundError: Could not initialize class java.lang.UNIXProcess
	at __randomizedtesting.SeedInfo.seed([2EAE098B4D94C291:C8F505ACB4DD0D25]:0)
	at java.lang.ProcessImpl.start(ProcessImpl.java:130)
	at java.lang.ProcessBuilder.start(ProcessBuilder.java:1022)
	at java.lang.Runtime.exec(Runtime.java:617)
	at java.lang.Runtime.exec(Runtime.java:450)
	at java.lang.Runtime.exec(Runtime.java:347)
	at org.apache.solr.handler.admin.SystemInfoHandler.execute(SystemInfoHandler.java:220)
	at org.apache.solr.handler.admin.SystemInfoHandler.getSystemInfo(SystemInfoHandler.java:176)
	at org.apache.solr.handler.admin.SystemInfoHandler.handleRequestBody(SystemInfoHandler.java:97)
	at org.apache.solr.handler.admin.InfoHandlerTest$CountSystemInfoHandler.handleRequestBody(InfoHandlerTest.java:157)
	at org.apache.solr.handler.RequestHandlerBase.handleRequest(RequestHandlerBase.java:135)
	at org.apache.solr.handler.admin.InfoHandler.handleRequestBody(InfoHandler.java:88)
	at org.apache.solr.handler.admin.InfoHandlerTest.handleRequest(InfoHandlerTest.java:168)
	at org.apache.solr.handler.admin.InfoHandlerTest.testOverriddenHandlers(InfoHandlerTest.java:98)
	at sun.reflect.NativeMethodAccessorImpl.invoke0(Native Method)
	at sun.reflect.NativeMethodAccessorImpl.invoke(NativeMethodAccessorImpl.java:57)
	at sun.reflect.DelegatingMethodAccessorImpl.invoke(DelegatingMethodAccessorImpl.java:43)
	at java.lang.reflect.Method.invoke(Method.java:606)
	at com.carrotsearch.randomizedtesting.RandomizedRunner.invoke(RandomizedRunner.java:1618)
	at com.carrotsearch.randomizedtesting.RandomizedRunner$6.evaluate(RandomizedRunner.java:827)
	at com.carrotsearch.randomizedtesting.RandomizedRunner$7.evaluate(RandomizedRunner.java:863)
	at com.carrotsearch.randomizedtesting.RandomizedRunner$8.evaluate(RandomizedRunner.java:877)
	at com.carrotsearch.randomizedtesting.rules.SystemPropertiesRestoreRule$1.evaluate(SystemPropertiesRestoreRule.java:53)
	at org.apache.lucene.util.TestRuleSetupTeardownChained$1.evaluate(TestRuleSetupTeardownChained.java:50)
	at org.apache.lucene.util.TestRuleFieldCacheSanity$1.evaluate(TestRuleFieldCacheSanity.java:51)
	at org.apache.lucene.util.AbstractBeforeAfterRule$1.evaluate(AbstractBeforeAfterRule.java:46)
	at com.carrotsearch.randomizedtesting.rules.SystemPropertiesInvariantRule$1.evaluate(SystemPropertiesInvariantRule.java:55)
	at org.apache.lucene.util.TestRuleThreadAndTestName$1.evaluate(TestRuleThreadAndTestName.java:49)
	at org.apache.lucene.util.TestRuleIgnoreAfterMaxFailures$1.evaluate(TestRuleIgnoreAfterMaxFailures.java:65)
	at org.apache.lucene.util.TestRuleMarkFailure$1.evaluate(TestRuleMarkFailure.java:48)
	at com.carrotsearch.randomizedtesting.rules.StatementAdapter.evaluate(StatementAdapter.java:36)
	at com.carrotsearch.randomizedtesting.ThreadLeakControl$StatementRunner.run(ThreadLeakControl.java:360)
	at com.carrotsearch.randomizedtesting.ThreadLeakControl.forkTimeoutingTask(ThreadLeakControl.java:793)
	at com.carrotsearch.randomizedtesting.ThreadLeakControl$3.evaluate(ThreadLeakControl.java:453)
	at com.carrotsearch.randomizedtesting.RandomizedRunner.runSingleTest(RandomizedRunner.java:836)
	at com.carrotsearch.randomizedtesting.RandomizedRunner$3.evaluate(RandomizedRunner.java:738)
	at com.carrotsearch.randomizedtesting.RandomizedRunner$4.evaluate(RandomizedRunner.java:772)
	at com.carrotsearch.randomizedtesting.RandomizedRunner$5.evaluate(RandomizedRunner.java:783)
	at com.carrotsearch.randomizedtesting.rules.StatementAdapter.evaluate(StatementAdapter.java:36)
	at com.carrotsearch.randomizedtesting.rules.SystemPropertiesRestoreRule$1.evaluate(SystemPropertiesRestoreRule.java:53)
	at org.apache.lucene.util.AbstractBeforeAfterRule$1.evaluate(AbstractBeforeAfterRule.java:46)
	at org.apache.lucene.util.TestRuleStoreClassName$1.evaluate(TestRuleStoreClassName.java:42)
	at com.carrotsearch.randomizedtesting.rules.SystemPropertiesInvariantRule$1.evaluate(SystemPropertiesInvariantRule.java:55)
	at com.carrotsearch.randomizedtesting.rules.NoShadowingOrOverridesOnMethodsRule$1.evaluate(NoShadowingOrOverridesOnMethodsRule.java:39)
	at com.carrotsearch.randomizedtesting.rules.NoShadowingOrOverridesOnMethodsRule$1.evaluate(NoShadowingOrOverridesOnMethodsRule.java:39)
	at com.carrotsearch.randomizedtesting.rules.StatementAdapter.evaluate(StatementAdapter.java:36)
	at com.carrotsearch.randomizedtesting.rules.StatementAdapter.evaluate(StatementAdapter.java:36)
	at com.carrotsearch.randomizedtesting.rules.StatementAdapter.evaluate(StatementAdapter.java:36)
	at org.apache.lucene.util.TestRuleAssertionsRequired$1.evaluate(TestRuleAssertionsRequired.java:43)
	at org.apache.lucene.util.TestRuleMarkFailure$1.evaluate(TestRuleMarkFailure.java:48)
	at org.apache.lucene.util.TestRuleIgnoreAfterMaxFailures$1.evaluate(TestRuleIgnoreAfterMaxFailures.java:65)
	at org.apache.lucene.util.TestRuleIgnoreTestSuites$1.evaluate(TestRuleIgnoreTestSuites.java:55)
	at com.carrotsearch.randomizedtesting.rules.StatementAdapter.evaluate(StatementAdapter.java:36)
	at com.carrotsearch.randomizedtesting.ThreadLeakControl$StatementRunner.run(ThreadLeakControl.java:360)
	at java.lang.Thread.run(Thread.java:745)




Build Log:
[...truncated 11217 lines...]
   [junit4] Suite: org.apache.solr.MinimalSchemaTest
   [junit4]   2> Creating dataDir: /Users/jenkins/workspace/Lucene-Solr-4.x-MacOSX/solr/build/solr-core/test/J0/./solr.MinimalSchemaTest-2EAE098B4D94C291-001/init-core-data-001
   [junit4]   2> 1138441 T4479 oas.SolrTestCaseJ4.buildSSLConfig Randomized ssl (false) and clientAuth (false)
   [junit4]   2> 1138444 T4479 oas.SolrTestCaseJ4.initCore ####initCore
   [junit4]   2> 1138444 T4479 oasc.SolrResourceLoader.<init> new SolrResourceLoader for directory: '/Users/jenkins/workspace/Lucene-Solr-4.x-MacOSX/solr/core/src/test-files/solr/collection1/'
   [junit4]   2> 1138446 T4479 oasc.SolrResourceLoader.replaceClassLoader Adding 'file:/Users/jenkins/workspace/Lucene-Solr-4.x-MacOSX/solr/core/src/test-files/solr/collection1/lib/.svn/' to classloader
   [junit4]   2> 1138447 T4479 oasc.SolrResourceLoader.replaceClassLoader Adding 'file:/Users/jenkins/workspace/Lucene-Solr-4.x-MacOSX/solr/core/src/test-files/solr/collection1/lib/classes/' to classloader
   [junit4]   2> 1138447 T4479 oasc.SolrResourceLoader.replaceClassLoader Adding 'file:/Users/jenkins/workspace/Lucene-Solr-4.x-MacOSX/solr/core/src/test-files/solr/collection1/lib/README' to classloader
   [junit4]   2> 1138667 T4479 oasc.SolrConfig.<init> Using Lucene MatchVersion: LUCENE_4_10
   [junit4]   2> 1138788 T4479 oasc.SolrConfig.<init> Loaded SolrConfig: solr/collection1/conf/solrconfig.xml
   [junit4]   2> 1138792 T4479 oass.IndexSchema.readSchema Reading Solr Schema from solr/collection1/conf/schema-minimal.xml
   [junit4]   2> 1138805 T4479 oass.IndexSchema.readSchema [null] Schema name=minimal
   [junit4]   2> 1138893 T4479 oass.IndexSchema.readSchema WARN no uniqueKey specified in schema.
   [junit4]   2> 1138899 T4479 oasc.SolrResourceLoader.locateSolrHome JNDI not configured for solr (NoInitialContextEx)
   [junit4]   2> 1138900 T4479 oasc.SolrResourceLoader.locateSolrHome using system property solr.solr.home: /Users/jenkins/workspace/Lucene-Solr-4.x-MacOSX/solr/core/src/test-files/solr
   [junit4]   2> 1138901 T4479 oasc.SolrResourceLoader.<init> new SolrResourceLoader for directory: '/Users/jenkins/workspace/Lucene-Solr-4.x-MacOSX/solr/core/src/test-files/solr/'
   [junit4]   2> 1139000 T4479 oasc.CoreContainer.<init> New CoreContainer 1791508771
   [junit4]   2> 1139001 T4479 oasc.CoreContainer.load Loading cores into CoreContainer [instanceDir=/Users/jenkins/workspace/Lucene-Solr-4.x-MacOSX/solr/core/src/test-files/solr/]
   [junit4]   2> 1139002 T4479 oashc.HttpShardHandlerFactory.getParameter Setting socketTimeout to: 0
   [junit4]   2> 1139003 T4479 oashc.HttpShardHandlerFactory.getParameter Setting urlScheme to: null
   [junit4]   2> 1139003 T4479 oashc.HttpShardHandlerFactory.getParameter Setting connTimeout to: 0
   [junit4]   2> 1139003 T4479 oashc.HttpShardHandlerFactory.getParameter Setting maxConnectionsPerHost to: 20
   [junit4]   2> 1139004 T4479 oashc.HttpShardHandlerFactory.getParameter Setting corePoolSize to: 0
   [junit4]   2> 1139004 T4479 oashc.HttpShardHandlerFactory.getParameter Setting maximumPoolSize to: 2147483647
   [junit4]   2> 1139004 T4479 oashc.HttpShardHandlerFactory.getParameter Setting maxThreadIdleTime to: 5
   [junit4]   2> 1139004 T4479 oashc.HttpShardHandlerFactory.getParameter Setting sizeOfQueue to: -1
   [junit4]   2> 1139005 T4479 oashc.HttpShardHandlerFactory.getParameter Setting fairnessPolicy to: false
   [junit4]   2> 1139005 T4479 oasl.LogWatcher.createWatcher SLF4J impl is org.slf4j.impl.Log4jLoggerFactory
   [junit4]   2> 1139006 T4479 oasl.LogWatcher.newRegisteredLogWatcher Registering Log Listener [Log4j (org.slf4j.impl.Log4jLoggerFactory)]
   [junit4]   2> 1139006 T4479 oasc.CoreContainer.load Host Name: 
   [junit4]   2> 1139012 T4480 oasc.SolrResourceLoader.<init> new SolrResourceLoader for directory: '/Users/jenkins/workspace/Lucene-Solr-4.x-MacOSX/solr/core/src/test-files/solr/collection1/'
   [junit4]   2> 1139017 T4480 oasc.SolrResourceLoader.replaceClassLoader Adding 'file:/Users/jenkins/workspace/Lucene-Solr-4.x-MacOSX/solr/core/src/test-files/solr/collection1/lib/.svn/' to classloader
   [junit4]   2> 1139017 T4480 oasc.SolrResourceLoader.replaceClassLoader Adding 'file:/Users/jenkins/workspace/Lucene-Solr-4.x-MacOSX/solr/core/src/test-files/solr/collection1/lib/classes/' to classloader
   [junit4]   2> 1139017 T4480 oasc.SolrResourceLoader.replaceClassLoader Adding 'file:/Users/jenkins/workspace/Lucene-Solr-4.x-MacOSX/solr/core/src/test-files/solr/collection1/lib/README' to classloader
   [junit4]   2> 1139137 T4480 oasc.SolrConfig.<init> Using Lucene MatchVersion: LUCENE_4_10
   [junit4]   2> 1139211 T4480 oasc.SolrConfig.<init> Loaded SolrConfig: solr/collection1/conf/solrconfig.xml
   [junit4]   2> 1139212 T4480 oass.IndexSchema.readSchema Reading Solr Schema from solr/collection1/conf/schema-minimal.xml
   [junit4]   2> 1139220 T4480 oass.IndexSchema.readSchema [collection1] Schema name=minimal
   [junit4]   2> 1139233 T4480 oass.IndexSchema.readSchema WARN no uniqueKey specified in schema.
   [junit4]   2> 1139234 T4480 oasc.CoreContainer.create Creating SolrCore 'collection1' using configuration from instancedir /Users/jenkins/workspace/Lucene-Solr-4.x-MacOSX/solr/core/src/test-files/solr/collection1/
   [junit4]   2> 1139234 T4480 oasc.SolrCore.initDirectoryFactory org.apache.solr.core.MockDirectoryFactory
   [junit4]   2> 1139235 T4480 oasc.SolrCore.<init> [collection1] Opening new SolrCore at /Users/jenkins/workspace/Lucene-Solr-4.x-MacOSX/solr/core/src/test-files/solr/collection1/, dataDir=/Users/jenkins/workspace/Lucene-Solr-4.x-MacOSX/solr/build/solr-core/test/J0/./solr.MinimalSchemaTest-2EAE098B4D94C291-001/init-core-data-001/
   [junit4]   2> 1139235 T4480 oasc.JmxMonitoredMap.<init> JMX monitoring is enabled. Adding Solr mbeans to JMX Server: com.sun.jmx.mbeanserver.JmxMBeanServer@655f247f
   [junit4]   2> 1139236 T4480 oasc.CachingDirectoryFactory.get return new directory for /Users/jenkins/workspace/Lucene-Solr-4.x-MacOSX/solr/build/solr-core/test/J0/./solr.MinimalSchemaTest-2EAE098B4D94C291-001/init-core-data-001
   [junit4]   2> 1139236 T4480 oasc.SolrCore.getNewIndexDir New index directory detected: old=null new=/Users/jenkins/workspace/Lucene-Solr-4.x-MacOSX/solr/build/solr-core/test/J0/./solr.MinimalSchemaTest-2EAE098B4D94C291-001/init-core-data-001/index/
   [junit4]   2> 1139237 T4480 oasc.SolrCore.initIndex WARN [collection1] Solr index directory '/Users/jenkins/workspace/Lucene-Solr-4.x-MacOSX/solr/build/solr-core/test/J0/./solr.MinimalSchemaTest-2EAE098B4D94C291-001/init-core-data-001/index' doesn't exist. Creating new index...
   [junit4]   2> 1139238 T4480 oasc.CachingDirectoryFactory.get return new directory for /Users/jenkins/workspace/Lucene-Solr-4.x-MacOSX/solr/build/solr-core/test/J0/./solr.MinimalSchemaTest-2EAE098B4D94C291-001/init-core-data-001/index
   [junit4]   2> 1139238 T4480 oasu.RandomMergePolicy.<init> RandomMergePolicy wrapping class org.apache.lucene.index.TieredMergePolicy: [TieredMergePolicy: maxMergeAtOnce=46, maxMergeAtOnceExplicit=29, maxMergedSegmentMB=19.84375, floorSegmentMB=2.0263671875, forceMergeDeletesPctAllowed=15.787003984602645, segmentsPerTier=18.0, maxCFSSegmentSizeMB=8.796093022207999E12, noCFSRatio=1.0
   [junit4]   2> 1139239 T4480 oasc.SolrDeletionPolicy.onCommit SolrDeletionPolicy.onCommit: commits: num=1
   [junit4]   2> 		commit{dir=RateLimitedDirectoryWrapper(MockDirectoryWrapper(RAMDirectory@38cea7b1 lockFactory=org.apache.lucene.store.SingleInstanceLockFactory@6a4a92f7)),segFN=segments_1,generation=1}
   [junit4]   2> 1139240 T4480 oasc.SolrDeletionPolicy.updateCommits newest commit generation = 1
   [junit4]   2> 1139240 T4480 oasc.SolrCore.initWriters created xml: solr.XMLResponseWriter
   [junit4]   2> 1139248 T4480 oasup.UpdateRequestProcessorChain.init creating updateRequestProcessorChain "dedupe"
   [junit4]   2> 1139249 T4480 oasup.UpdateRequestProcessorChain.init inserting DistributedUpdateProcessorFactory into updateRequestProcessorChain "dedupe"
   [junit4]   2> 1139249 T4480 oasup.UpdateRequestProcessorChain.init creating updateRequestProcessorChain "dedupe-allfields"
   [junit4]   2> 1139249 T4480 oasup.UpdateRequestProcessorChain.init inserting DistributedUpdateProcessorFactory into updateRequestProcessorChain "dedupe-allfields"
   [junit4]   2> 1139250 T4480 oasup.UpdateRequestProcessorChain.init creating updateRequestProcessorChain "stored_sig"
   [junit4]   2> 1139250 T4480 oasup.UpdateRequestProcessorChain.init inserting DistributedUpdateProcessorFactory into updateRequestProcessorChain "stored_sig"
   [junit4]   2> 1139250 T4480 oasup.UpdateRequestProcessorChain.init creating updateRequestProcessorChain "uniq-fields"
   [junit4]   2> 1139251 T4480 oasup.UniqFieldsUpdateProcessorFactory.init WARN Use of the 'fields' init param in UniqFieldsUpdateProcessorFactory is deprecated, please use 'fieldName' (or another FieldMutatingUpdateProcessorFactory selector option) instead
   [junit4]   2> 1139252 T4480 oasup.UniqFieldsUpdateProcessorFactory.init Replacing 'fields' init param with (individual) 'fieldName' params
   [junit4]   2> 1139252 T4480 oasup.UpdateRequestProcessorChain.init inserting DistributedUpdateProcessorFactory into updateRequestProcessorChain "uniq-fields"
   [junit4]   2> 1139252 T4480 oasup.UpdateRequestProcessorChain.init creating updateRequestProcessorChain "distrib-dup-test-chain-explicit"
   [junit4]   2> 1139253 T4480 oasup.UpdateRequestProcessorChain.init creating updateRequestProcessorChain "distrib-dup-test-chain-implicit"
   [junit4]   2> 1139254 T4480 oasup.UpdateRequestProcessorChain.init inserting DistributedUpdateProcessorFactory into updateRequestProcessorChain "distrib-dup-test-chain-implicit"
   [junit4]   2> 1139254 T4480 oasc.SolrCore.loadUpdateProcessorChains no updateRequestProcessorChain defined as default, creating implicit default
   [junit4]   2> 1139254 T4480 oasc.RequestHandlers.initHandlersFromConfig adding lazy requestHandler: solr.ReplicationHandler
   [junit4]   2> 1139255 T4480 oasc.RequestHandlers.initHandlersFromConfig created /replication: solr.ReplicationHandler
   [junit4]   2> 1139255 T4480 oasc.RequestHandlers.initHandlersFromConfig created standard: solr.StandardRequestHandler
   [junit4]   2> 1139256 T4480 oasc.RequestHandlers.initHandlersFromConfig created /get: solr.RealTimeGetHandler
   [junit4]   2> 1139258 T4480 oasc.RequestHandlers.initHandlersFromConfig created dismax: solr.SearchHandler
   [junit4]   2> 1139258 T4480 oasc.RequestHandlers.initHandlersFromConfig created mock: org.apache.solr.core.MockQuerySenderListenerReqHandler
   [junit4]   2> 1139259 T4480 oasc.RequestHandlers.initHandlersFromConfig created /admin/: org.apache.solr.handler.admin.AdminHandlers
   [junit4]   2> 1139260 T4480 oasc.RequestHandlers.initHandlersFromConfig created /admin/file: solr.admin.ShowFileRequestHandler
   [junit4]   2> 1139260 T4480 oasc.RequestHandlers.initHandlersFromConfig created defaults: solr.StandardRequestHandler
   [junit4]   2> 1139260 T4480 oasc.RequestHandlers.initHandlersFromConfig adding lazy requestHandler: solr.StandardRequestHandler
   [junit4]   2> 1139261 T4480 oasc.RequestHandlers.initHandlersFromConfig created lazy: solr.StandardRequestHandler
   [junit4]   2> 1139261 T4480 oasc.RequestHandlers.initHandlersFromConfig created /update: solr.UpdateRequestHandler
   [junit4]   2> 1139262 T4480 oasc.RequestHandlers.initHandlersFromConfig created /terms: org.apache.solr.handler.component.SearchHandler
   [junit4]   2> 1139262 T4480 oasc.RequestHandlers.initHandlersFromConfig created spellCheckCompRH: org.apache.solr.handler.component.SearchHandler
   [junit4]   2> 1139263 T4480 oasc.RequestHandlers.initHandlersFromConfig created spellCheckCompRH_Direct: org.apache.solr.handler.component.SearchHandler
   [junit4]   2> 1139264 T4480 oasc.RequestHandlers.initHandlersFromConfig created spellCheckWithWordbreak: org.apache.solr.handler.component.SearchHandler
   [junit4]   2> 1139265 T4480 oasc.RequestHandlers.initHandlersFromConfig created spellCheckWithWordbreak_Direct: org.apache.solr.handler.component.SearchHandler
   [junit4]   2> 1139265 T4480 oasc.RequestHandlers.initHandlersFromConfig created spellCheckCompRH1: org.apache.solr.handler.component.SearchHandler
   [junit4]   2> 1139266 T4480 oasc.RequestHandlers.initHandlersFromConfig created mltrh: org.apache.solr.handler.component.SearchHandler
   [junit4]   2> 1139267 T4480 oasc.RequestHandlers.initHandlersFromConfig created tvrh: org.apache.solr.handler.component.SearchHandler
   [junit4]   2> 1139268 T4480 oasc.RequestHandlers.initHandlersFromConfig created /mlt: solr.MoreLikeThisHandler
   [junit4]   2> 1139268 T4480 oasc.RequestHandlers.initHandlersFromConfig created /debug/dump: solr.DumpRequestHandler
   [junit4]   2> 1139284 T4480 oashl.XMLLoader.init xsltCacheLifetimeSeconds=60
   [junit4]   2> 1139285 T4480 oasc.SolrCore.initDeprecatedSupport WARN solrconfig.xml uses deprecated <admin/gettableFiles>, Please update your config to use the ShowFileRequestHandler.
   [junit4]   2> 1139291 T4480 oasu.CommitTracker.<init> Hard AutoCommit: disabled
   [junit4]   2> 1139291 T4480 oasu.CommitTracker.<init> Soft AutoCommit: disabled
   [junit4]   2> 1139292 T4480 oasu.RandomMergePolicy.<init> RandomMergePolicy wrapping class org.apache.lucene.index.TieredMergePolicy: [TieredMergePolicy: maxMergeAtOnce=23, maxMergeAtOnceExplicit=34, maxMergedSegmentMB=18.580078125, floorSegmentMB=1.501953125, forceMergeDeletesPctAllowed=20.09794340317691, segmentsPerTier=32.0, maxCFSSegmentSizeMB=8.796093022207999E12, noCFSRatio=0.1730603767944393
   [junit4]   2> 1139292 T4480 oasc.SolrDeletionPolicy.onInit SolrDeletionPolicy.onInit: commits: num=1
   [junit4]   2> 		commit{dir=RateLimitedDirectoryWrapper(MockDirectoryWrapper(RAMDirectory@38cea7b1 lockFactory=org.apache.lucene.store.SingleInstanceLockFactory@6a4a92f7)),segFN=segments_1,generation=1}
   [junit4]   2> 1139293 T4480 oasc.SolrDeletionPolicy.updateCommits newest commit generation = 1
   [junit4]   2> 1139293 T4480 oass.SolrIndexSearcher.<init> Opening Searcher@79234d9a[collection1] main
   [junit4]   2> 1139294 T4480 oasr.RestManager.init Initializing RestManager with initArgs: {storageIO=org.apache.solr.rest.ManagedResourceStorage$InMemoryStorageIO}
   [junit4]   2> 1139294 T4480 oasr.ManagedResourceStorage.load Reading _rest_managed.json using InMemoryStorage
   [junit4]   2> 1139295 T4480 oasr.ManagedResource.reloadFromStorage WARN No stored data found for /rest/managed
   [junit4]   2> 1139295 T4480 oasr.ManagedResource.notifyObserversDuringInit WARN No registered observers for /rest/managed
   [junit4]   2> 1139295 T4480 oasr.RestManager.init Initializing 0 registered ManagedResources
   [junit4]   2> 1139296 T4480 oashc.SpellCheckComponent.inform Initializing spell checkers
   [junit4]   2> 1139308 T4480 oass.DirectSolrSpellChecker.init init: {name=direct,classname=DirectSolrSpellChecker,field=lowerfilt,minQueryLength=3}
   [junit4]   2> 1139389 T4481 oasc.SolrCore.registerSearcher [collection1] Registered new searcher Searcher@79234d9a[collection1] main{StandardDirectoryReader(segments_1:1:nrt)}
   [junit4]   2> 1139394 T4480 oasc.CoreContainer.registerCore registering core: collection1
   [junit4]   2> 1139398 T4479 oas.SolrTestCaseJ4.initCore ####initCore end
   [junit4]   2> ASYNC  NEW_CORE C548 name=collection1 org.apache.solr.core.SolrCore@1f283040
   [junit4]   2> 1139401 T4479 C548 oasup.LogUpdateProcessor.finish [collection1] webapp=null path=null params={} {add=[(null)]} 0 2
   [junit4]   2> 1139408 T4479 C548 oasup.LogUpdateProcessor.finish [collection1] webapp=null path=null params={} {add=[(null)]} 0 1
   [junit4]   2> 1139410 T4479 C548 oasu.DirectUpdateHandler2.commit start commit{,optimize=false,openSearcher=true,waitSearcher=true,expungeDeletes=false,softCommit=false,prepareCommit=false}
   [junit4]   2> 1139413 T4479 C548 oasc.SolrDeletionPolicy.onCommit SolrDeletionPolicy.onCommit: commits: num=2
   [junit4]   2> 		commit{dir=RateLimitedDirectoryWrapper(MockDirectoryWrapper(RAMDirectory@38cea7b1 lockFactory=org.apache.lucene.store.SingleInstanceLockFactory@6a4a92f7)),segFN=segments_1,generation=1}
   [junit4]   2> 		commit{dir=RateLimitedDirectoryWrapper(MockDirectoryWrapper(RAMDirectory@38cea7b1 lockFactory=org.apache.lucene.store.SingleInstanceLockFactory@6a4a92f7)),segFN=segments_2,generation=2}
   [junit4]   2> 1139414 T4479 C548 oasc.SolrDeletionPolicy.updateCommits newest commit generation = 2
   [junit4]   2> 1139416 T4479 C548 oass.SolrIndexSearcher.<init> Opening Searcher@27c7babb[collection1] main
   [junit4]   2> 1139417 T4479 C548 oasu.DirectUpdateHandler2.commit end_commit_flush
   [junit4]   2> 1139419 T4481 oasc.SolrCore.registerSearcher [collection1] Registered new searcher Searcher@27c7babb[collection1] main{StandardDirectoryReader(segments_2:3:nrt _0(4.10):C2)}
   [junit4]   2> 1139420 T4479 C548 oasup.LogUpdateProcessor.finish [collection1] webapp=null path=null params={} {commit=} 0 10
   [junit4]   2> 1139424 T4479 C548 oasu.DirectUpdateHandler2.commit start commit{,optimize=true,openSearcher=true,waitSearcher=true,expungeDeletes=false,softCommit=false,prepareCommit=false}
   [junit4]   2> 1139425 T4479 C548 oasu.DirectUpdateHandler2.commit No uncommitted changes. Skipping IW.commit.
   [junit4]   2> 1139425 T4479 C548 oasc.SolrCore.openNewSearcher SolrIndexSearcher has not changed - not re-opening: org.apache.solr.search.SolrIndexSearcher
   [junit4]   2> 1139426 T4479 C548 oasu.DirectUpdateHandler2.commit end_commit_flush
   [junit4]   2> 1139426 T4479 C548 oasup.LogUpdateProcessor.finish [collection1] webapp=null path=null params={} {optimize=} 0 3
   [junit4]   2> 1139436 T4479 oas.SolrTestCaseJ4.setUp ###Starting testAllConfiguredHandlers
   [junit4]   2> 1139438 T4479 C548 oasc.SolrCore.execute [collection1] webapp=null path=null params={q=foo:bar&omitHeader=false&qt=spellCheckCompRH_Direct} hits=0 status=0 QTime=0 
   [junit4]   2> 1139442 T4479 C548 oasc.SolrCore.execute [collection1] webapp=null path=null params={q=foo:bar&omitHeader=false&qt=/debug/dump} status=0 QTime=1 
   [junit4]   2> 1139445 T4479 C548 oasc.SolrCore.execute [collection1] webapp=null path=null params={q=foo:bar&omitHeader=false&qt=/admin/properties} status=0 QTime=0 
   [junit4]   2> 1139449 T4479 C548 oasc.SolrCore.execute [collection1] webapp=null path=null params={q=foo:bar&omitHeader=false&qt=tvrh} hits=0 status=0 QTime=0 
   [junit4]   2> 1139459 T4479 C548 oasc.SolrCore.execute [collection1] webapp=null path=null params={q=foo:bar&omitHeader=false&qt=/admin/logging} status=0 QTime=7 
   [junit4]   2> 1139473 T4479 C548 oasc.SolrCore.execute [collection1] webapp=null path=null params={q=foo:bar&omitHeader=false&qt=/admin/plugins} status=0 QTime=4 
   [junit4]   2> 1139479 T4479 C548 oasc.SolrCore.execute [collection1] webapp=null path=null params={q=foo:bar&omitHeader=false&qt=dismax} hits=0 status=0 QTime=1 
   [junit4]   2> 1139483 T4479 C548 oasc.SolrCore.execute [collection1] webapp=null path=null params={q=foo:bar&omitHeader=false&qt=mltrh} hits=0 status=0 QTime=1 
   [junit4]   2> 1139485 T4479 C548 oasc.SolrCore.execute [collection1] webapp=null path=null params={q=foo:bar&omitHeader=false&qt=spellCheckCompRH} hits=0 status=0 QTime=0 
   [junit4]   2> 1139502 T4479 C548 oasc.SolrCore.execute [collection1] webapp=null path=null params={q=foo:bar&omitHeader=false&qt=/admin/threads} status=0 QTime=14 
   [junit4]   2> 1139507 T4479 C548 oasc.SolrCore.execute [collection1] webapp=null path=null params={q=foo:bar&omitHeader=false&qt=mock} status=0 QTime=0 
   [junit4]   2> 1139510 T4479 C548 oasc.SolrCore.execute [collection1] webapp=null path=null params={q=foo:bar&omitHeader=false&qt=} hits=0 status=0 QTime=0 
   [junit4]   2> 1139529 T4479 C548 oasc.SolrCore.execute [collection1] webapp=null path=null params={q=foo:bar&omitHeader=false&qt=/admin/luke} status=0 QTime=16 
   [junit4]   2> 1139533 T4479 C548 oasc.SolrCore.execute [collection1] webapp=null path=null params={q=foo:bar&omitHeader=false&qt=lazy} hits=0 status=0 QTime=1 
   [junit4]   2> 1139575 T4479 oas.SolrTestCaseJ4.tearDown ###Ending testAllConfiguredHandlers
   [junit4]   2> NOTE: reproduce with: ant test  -Dtestcase=MinimalSchemaTest -Dtests.method=testAllConfiguredHandlers -Dtests.seed=2EAE098B4D94C291 -Dtests.slow=true -Dtests.locale=tr_TR -Dtests.timezone=America/Adak -Dtests.file.encoding=UTF-8
   [junit4] ERROR   0.16s | MinimalSchemaTest.testAllConfiguredHandlers <<<
   [junit4]    > Throwable #1: java.lang.Error: posix_spawn is not a supported process launch mechanism on this platform.
   [junit4]    > 	at __randomizedtesting.SeedInfo.seed([2EAE098B4D94C291:C3B0B2B1C699C315]:0)
   [junit4]    > 	at java.lang.UNIXProcess$1.run(UNIXProcess.java:104)
   [junit4]    > 	at java.lang.UNIXProcess$1.run(UNIXProcess.java:93)
   [junit4]    > 	at java.security.AccessController.doPrivileged(Native Method)
   [junit4]    > 	at java.lang.UNIXProcess.<clinit>(UNIXProcess.java:91)
   [junit4]    > 	at java.lang.ProcessImpl.start(ProcessImpl.java:130)
   [junit4]    > 	at java.lang.ProcessBuilder.start(ProcessBuilder.java:1022)
   [junit4]    > 	at java.lang.Runtime.exec(Runtime.java:617)
   [junit4]    > 	at java.lang.Runtime.exec(Runtime.java:450)
   [junit4]    > 	at java.lang.Runtime.exec(Runtime.java:347)
   [junit4]    > 	at org.apache.solr.handler.admin.SystemInfoHandler.execute(SystemInfoHandler.java:220)
   [junit4]    > 	at org.apache.solr.handler.admin.SystemInfoHandler.getSystemInfo(SystemInfoHandler.java:176)
   [junit4]    > 	at org.apache.solr.handler.admin.SystemInfoHandler.handleRequestBody(SystemInfoHandler.java:97)
   [junit4]    > 	at org.apache.solr.handler.RequestHandlerBase.handleRequest(RequestHandlerBase.java:135)
   [junit4]    > 	at org.apache.solr.core.SolrCore.execute(SolrCore.java:1962)
   [junit4]    > 	at org.apache.solr.util.TestHarness.query(TestHarness.java:295)
   [junit4]    > 	at org.apache.solr.util.TestHarness.query(TestHarness.java:278)
   [junit4]    > 	at org.apache.solr.SolrTestCaseJ4.assertQ(SolrTestCaseJ4.java:678)
   [junit4]    > 	at org.apache.solr.MinimalSchemaTest.testAllConfiguredHandlers(MinimalSchemaTest.java:115)
   [junit4]    > 	at java.lang.Thread.run(Thread.java:745)
   [junit4]   2> 1139601 T4479 oas.SolrTestCaseJ4.setUp ###Starting testLuke
   [junit4]   2> 1139603 T4479 C548 oasc.SolrCore.execute [collection1] webapp=null path=null params={qt=/admin/luke} status=0 QTime=0 
   [junit4]   2> 1139609 T4479 C548 oasc.SolrCore.execute [collection1] webapp=null path=null params={show=schema&qt=/admin/luke} status=0 QTime=2 
   [junit4]   2> 1139618 T4479 oas.SolrTestCaseJ4.tearDown ###Ending testLuke
   [junit4]   2> 1139628 T4479 oas.SolrTestCaseJ4.setUp ###Starting testSimpleQueries
   [junit4]   2> 1139630 T4479 C548 oasc.SolrCore.execute [collection1] webapp=null path=null params={version=2.2&q=subject:Hoss&rows=20&qt=standard&start=0} hits=1 status=0 QTime=0 
   [junit4]   2> 1139635 T4479 C548 oasc.SolrCore.execute [collection1] webapp=null path=null params={version=2.2&q=subject:Yonik&rows=20&qt=standard&start=0} hits=1 status=0 QTime=1 
   [junit4]   2> 1139641 T4479 oas.SolrTestCaseJ4.tearDown ###Ending testSimpleQueries
   [junit4]   2> 1139644 T4479 oas.SolrTestCaseJ4.deleteCore ###deleteCore
   [junit4]   2> 1139644 T4479 oasc.CoreContainer.shutdown Shutting down CoreContainer instance=1791508771
   [junit4]   2> 1139645 T4479 oasc.SolrCore.close [collection1]  CLOSING SolrCore org.apache.solr.core.SolrCore@1f283040
   [junit4]   2> 1139673 T4479 oasu.DirectUpdateHandler2.close closing DirectUpdateHandler2{commits=1,autocommits=0,soft autocommits=0,optimizes=1,rollbacks=0,expungeDeletes=0,docsPending=0,adds=0,deletesById=0,deletesByQuery=0,errors=0,cumulative_adds=2,cumulative_deletesById=0,cumulative_deletesByQuery=0,cumulative_errors=0,transaction_logs_total_size=132,transaction_logs_total_number=1}
   [junit4]   2> 1139674 T4479 oasu.SolrCoreState.decrefSolrCoreState Closing SolrCoreState
   [junit4]   2> 1139674 T4479 oasu.DefaultSolrCoreState.closeIndexWriter SolrCoreState ref count has reached 0 - closing IndexWriter
   [junit4]   2> 1139676 T4479 oasu.DefaultSolrCoreState.closeIndexWriter closing IndexWriter with IndexWriterCloser
   [junit4]   2> 1139677 T4479 oasc.SolrCore.closeSearcher [collection1] Closing main searcher on request.
   [junit4]   2> 1139678 T4479 oasc.CachingDirectoryFactory.close Closing MockDirectoryFactory - 2 directories currently being tracked
   [junit4]   2> 1139678 T4479 oasc.CachingDirectoryFactory.closeCacheValue looking to close /Users/jenkins/workspace/Lucene-Solr-4.x-MacOSX/solr/build/solr-core/test/J0/./solr.MinimalSchemaTest-2EAE098B4D94C291-001/init-core-data-001/index [CachedDir<<refCount=0;path=/Users/jenkins/workspace/Lucene-Solr-4.x-MacOSX/solr/build/solr-core/test/J0/./solr.MinimalSchemaTest-2EAE098B4D94C291-001/init-core-data-001/index;done=false>>]
   [junit4]   2> 1139678 T4479 oasc.CachingDirectoryFactory.close Closing directory: /Users/jenkins/workspace/Lucene-Solr-4.x-MacOSX/solr/build/solr-core/test/J0/./solr.MinimalSchemaTest-2EAE098B4D94C291-001/init-core-data-001/index
   [junit4]   2> 1139679 T4479 oasc.CachingDirectoryFactory.closeCacheValue looking to close /Users/jenkins/workspace/Lucene-Solr-4.x-MacOSX/solr/build/solr-core/test/J0/./solr.MinimalSchemaTest-2EAE098B4D94C291-001/init-core-data-001 [CachedDir<<refCount=0;path=/Users/jenkins/workspace/Lucene-Solr-4.x-MacOSX/solr/build/solr-core/test/J0/./solr.MinimalSchemaTest-2EAE098B4D94C291-001/init-core-data-001;done=false>>]
   [junit4]   2> 1139679 T4479 oasc.CachingDirectoryFactory.close Closing directory: /Users/jenkins/workspace/Lucene-Solr-4.x-MacOSX/solr/build/solr-core/test/J0/./solr.MinimalSchemaTest-2EAE098B4D94C291-001/init-core-data-001
   [junit4]   2> NOTE: leaving temporary files on disk at: /Users/jenkins/workspace/Lucene-Solr-4.x-MacOSX/solr/build/solr-core/test/J0/./solr.MinimalSchemaTest-2EAE098B4D94C291-001
   [junit4]   2> NOTE: test params are: codec=Asserting(Lucene49), sim=DefaultSimilarity, locale=tr_TR, timezone=America/Adak
   [junit4]   2> NOTE: Mac OS X 10.8.5 x86_64/Oracle Corporation 1.7.0_60 (64-bit)/cpus=2,threads=1,free=170264384,total=536870912
   [junit4]   2> NOTE: All tests run in this JVM: [HdfsDirectoryTest, MultiThreadedOCPTest, TestDistribDocBasedVersion, TestSchemaResource, CursorMarkTest, SpatialFilterTest, TestUtils, EnumFieldTest, ParsingFieldUpdateProcessorsTest, TestStressVersions, TestElisionMultitermQuery, TestLuceneMatchVersion, DistributedQueryComponentCustomSortTest, TestSimpleQParserPlugin, TestCharFilters, PreAnalyzedUpdateProcessorTest, IndexSchemaTest, ExternalFileFieldSortTest, TestReversedWildcardFilterFactory, SpellCheckCollatorTest, TestDFRSimilarityFactory, TestCodecSupport, NotRequiredUniqueKeyTest, HighlighterTest, DateFieldTest, BlockCacheTest, TestAnalyzedSuggestions, SOLR749Test, ResourceLoaderTest, TestPseudoReturnFields, ReturnFieldsTest, XsltUpdateRequestHandlerTest, CacheHeaderTest, DebugComponentTest, TestSweetSpotSimilarityFactory, TestCSVResponseWriter, SliceStateUpdateTest, SuggesterWFSTTest, SolrXmlInZkTest, DeleteReplicaTest, TestSolrXml, ZkCLITest, TestReplicationHandler, BinaryUpdateRequestHandlerTest, PreAnalyzedFieldTest, HdfsRecoveryZkTest, TestMaxScoreQueryParser, TestDocBasedVersionConstraints, AddSchemaFieldsUpdateProcessorFactoryTest, OverseerCollectionProcessorTest, QueryEqualityTest, DirectUpdateHandlerOptimizeTest, TestManagedResourceStorage, AliasIntegrationTest, LoggingHandlerTest, IndexSchemaRuntimeFieldTest, DistributedSuggestComponentTest, AtomicUpdatesTest, TestJmxIntegration, TestSolrDeletionPolicy1, SchemaVersionSpecificBehaviorTest, FullSolrCloudDistribCmdsTest, ClusterStateTest, TestHighlightDedupGrouping, TestSolrDeletionPolicy2, TriLevelCompositeIdRoutingTest, OverseerStatusTest, QueryResultKeyTest, TestSolrQueryParserDefaultOperatorResource, CurrencyFieldOpenExchangeTest, TestPostingsSolrHighlighter, TestSearcherReuse, RAMDirectoryFactoryTest, TestDistributedMissingSort, LeaderElectionTest, TestDistributedGrouping, HdfsBasicDistributedZkTest, BJQParserTest, RegexBoostProcessorTest, TestCSVLoader, MergeStrategyTest, TestRequestStatusCollectionAPI, FastVectorHighlighterTest, TestZkChroot, SpellCheckComponentTest, TestCloudManagedSchema, TestQuerySenderListener, SolrTestCaseJ4Test, TestManagedStopFilterFactory, TestSolrXmlPersistor, StatsComponentTest, QueryParsingTest, LeaderElectionIntegrationTest, TestSolrQueryParser, RequiredFieldsTest, RequestHandlersTest, TestNonNRTOpen, NoCacheHeaderTest, TestCollationFieldDocValues, TestBlendedInfixSuggestions, TestRestManager, DeleteShardTest, ZkSolrClientTest, TestFastOutputStream, DocumentBuilderTest, CircularListTest, MinimalSchemaTest]
   [junit4] Completed in 1.30s, 3 tests, 1 error <<< FAILURES!

[...truncated 257 lines...]
   [junit4] Suite: org.apache.solr.handler.admin.InfoHandlerTest
   [junit4]   2> Creating dataDir: /Users/jenkins/workspace/Lucene-Solr-4.x-MacOSX/solr/build/solr-core/test/J0/./solr.handler.admin.InfoHandlerTest-2EAE098B4D94C291-001/init-core-data-001
   [junit4]   2> 1849667 T6496 oas.SolrTestCaseJ4.buildSSLConfig Randomized ssl (false) and clientAuth (false)
   [junit4]   2> 1849668 T6496 oas.SolrTestCaseJ4.initCore ####initCore
   [junit4]   2> 1849668 T6496 oasc.SolrResourceLoader.<init> new SolrResourceLoader for directory: '/Users/jenkins/workspace/Lucene-Solr-4.x-MacOSX/solr/core/src/test-files/solr/collection1/'
   [junit4]   2> 1849669 T6496 oasc.SolrResourceLoader.replaceClassLoader Adding 'file:/Users/jenkins/workspace/Lucene-Solr-4.x-MacOSX/solr/core/src/test-files/solr/collection1/lib/.svn/' to classloader
   [junit4]   2> 1849670 T6496 oasc.SolrResourceLoader.replaceClassLoader Adding 'file:/Users/jenkins/workspace/Lucene-Solr-4.x-MacOSX/solr/core/src/test-files/solr/collection1/lib/classes/' to classloader
   [junit4]   2> 1849670 T6496 oasc.SolrResourceLoader.replaceClassLoader Adding 'file:/Users/jenkins/workspace/Lucene-Solr-4.x-MacOSX/solr/core/src/test-files/solr/collection1/lib/README' to classloader
   [junit4]   2> 1849828 T6496 oasc.SolrConfig.<init> Using Lucene MatchVersion: LUCENE_4_10
   [junit4]   2> 1849897 T6496 oasc.SolrConfig.<init> Loaded SolrConfig: solrconfig.xml
   [junit4]   2> 1849898 T6496 oass.IndexSchema.readSchema Reading Solr Schema from schema.xml
   [junit4]   2> 1849910 T6496 oass.IndexSchema.readSchema [null] Schema name=test
   [junit4]   2> 1850392 T6496 oass.ByteField.init WARN ByteField is deprecated and will be removed in 5.0. You should use TrieIntField instead.
   [junit4]   2> 1850393 T6496 oass.ShortField.init WARN ShortField is deprecated and will be removed in 5.0. You should use TrieIntField instead.
   [junit4]   2> 1850394 T6496 oass.OpenExchangeRatesOrgProvider.init Initialized with rates=open-exchange-rates.json, refreshInterval=1440.
   [junit4]   2> 1850404 T6496 oass.IndexSchema.readSchema default search field in schema is text
   [junit4]   2> 1850407 T6496 oass.IndexSchema.readSchema unique key field: id
   [junit4]   2> 1850419 T6496 oass.FileExchangeRateProvider.reload Reloading exchange rates from file currency.xml
   [junit4]   2> 1850423 T6496 oass.FileExchangeRateProvider.reload Reloading exchange rates from file currency.xml
   [junit4]   2> 1850427 T6496 oass.OpenExchangeRatesOrgProvider.reload Reloading exchange rates from open-exchange-rates.json
   [junit4]   2> 1850429 T6496 oass.OpenExchangeRatesOrgProvider$OpenExchangeRates.<init> WARN Unknown key IMPORTANT NOTE
   [junit4]   2> 1850429 T6496 oass.OpenExchangeRatesOrgProvider$OpenExchangeRates.<init> WARN Expected key, got STRING
   [junit4]   2> 1850429 T6496 oass.OpenExchangeRatesOrgProvider.reload Reloading exchange rates from open-exchange-rates.json
   [junit4]   2> 1850430 T6496 oass.OpenExchangeRatesOrgProvider$OpenExchangeRates.<init> WARN Unknown key IMPORTANT NOTE
   [junit4]   2> 1850430 T6496 oass.OpenExchangeRatesOrgProvider$OpenExchangeRates.<init> WARN Expected key, got STRING
   [junit4]   2> 1850430 T6496 oasc.SolrResourceLoader.locateSolrHome JNDI not configured for solr (NoInitialContextEx)
   [junit4]   2> 1850431 T6496 oasc.SolrResourceLoader.locateSolrHome using system property solr.solr.home: /Users/jenkins/workspace/Lucene-Solr-4.x-MacOSX/solr/core/src/test-files/solr
   [junit4]   2> 1850432 T6496 oasc.SolrResourceLoader.<init> new SolrResourceLoader for directory: '/Users/jenkins/workspace/Lucene-Solr-4.x-MacOSX/solr/core/src/test-files/solr/'
   [junit4]   2> 1850502 T6496 oasc.CoreContainer.<init> New CoreContainer 1730756785
   [junit4]   2> 1850503 T6496 oasc.CoreContainer.load Loading cores into CoreContainer [instanceDir=/Users/jenkins/workspace/Lucene-Solr-4.x-MacOSX/solr/core/src/test-files/solr/]
   [junit4]   2> 1850504 T6496 oashc.HttpShardHandlerFactory.getParameter Setting socketTimeout to: 0
   [junit4]   2> 1850504 T6496 oashc.HttpShardHandlerFactory.getParameter Setting urlScheme to: null
   [junit4]   2> 1850505 T6496 oashc.HttpShardHandlerFactory.getParameter Setting connTimeout to: 0
   [junit4]   2> 1850505 T6496 oashc.HttpShardHandlerFactory.getParameter Setting maxConnectionsPerHost to: 20
   [junit4]   2> 1850505 T6496 oashc.HttpShardHandlerFactory.getParameter Setting corePoolSize to: 0
   [junit4]   2> 1850506 T6496 oashc.HttpShardHandlerFactory.getParameter Setting maximumPoolSize to: 2147483647
   [junit4]   2> 1850506 T6496 oashc.HttpShardHandlerFactory.getParameter Setting maxThreadIdleTime to: 5
   [junit4]   2> 1850506 T6496 oashc.HttpShardHandlerFactory.getParameter Setting sizeOfQueue to: -1
   [junit4]   2> 1850507 T6496 oashc.HttpShardHandlerFactory.getParameter Setting fairnessPolicy to: false
   [junit4]   2> 1850507 T6496 oasl.LogWatcher.createWatcher SLF4J impl is org.slf4j.impl.Log4jLoggerFactory
   [junit4]   2> 1850508 T6496 oasl.LogWatcher.newRegisteredLogWatcher Registering Log Listener [Log4j (org.slf4j.impl.Log4jLoggerFactory)]
   [junit4]   2> 1850508 T6496 oasc.CoreContainer.load Host Name: 
   [junit4]   2> 1850514 T6497 oasc.SolrResourceLoader.<init> new SolrResourceLoader for directory: '/Users/jenkins/workspace/Lucene-Solr-4.x-MacOSX/solr/core/src/test-files/solr/collection1/'
   [junit4]   2> 1850515 T6497 oasc.SolrResourceLoader.replaceClassLoader Adding 'file:/Users/jenkins/workspace/Lucene-Solr-4.x-MacOSX/solr/core/src/test-files/solr/collection1/lib/.svn/' to classloader
   [junit4]   2> 1850516 T6497 oasc.SolrResourceLoader.replaceClassLoader Adding 'file:/Users/jenkins/workspace/Lucene-Solr-4.x-MacOSX/solr/core/src/test-files/solr/collection1/lib/classes/' to classloader
   [junit4]   2> 1850516 T6497 oasc.SolrResourceLoader.replaceClassLoader Adding 'file:/Users/jenkins/workspace/Lucene-Solr-4.x-MacOSX/solr/core/src/test-files/solr/collection1/lib/README' to classloader
   [junit4]   2> 1850587 T6497 oasc.SolrConfig.<init> Using Lucene MatchVersion: LUCENE_4_10
   [junit4]   2> 1850659 T6497 oasc.SolrConfig.<init> Loaded SolrConfig: solrconfig.xml
   [junit4]   2> 1850659 T6497 oass.IndexSchema.readSchema Reading Solr Schema from schema.xml
   [junit4]   2> 1850670 T6497 oass.IndexSchema.readSchema [collection1] Schema name=test
   [junit4]   2> 1851152 T6497 oass.ByteField.init WARN ByteField is deprecated and will be removed in 5.0. You should use TrieIntField instead.
   [junit4]   2> 1851152 T6497 oass.ShortField.init WARN ShortField is deprecated and will be removed in 5.0. You should use TrieIntField instead.
   [junit4]   2> 1851153 T6497 oass.OpenExchangeRatesOrgProvider.init Initialized with rates=open-exchange-rates.json, refreshInterval=1440.
   [junit4]   2> 1851160 T6497 oass.IndexSchema.readSchema default search field in schema is text
   [junit4]   2> 1851164 T6497 oass.IndexSchema.readSchema unique key field: id
   [junit4]   2> 1851174 T6497 oass.FileExchangeRateProvider.reload Reloading exchange rates from file currency.xml
   [junit4]   2> 1851180 T6497 oass.FileExchangeRateProvider.reload Reloading exchange rates from file currency.xml
   [junit4]   2> 1851183 T6497 oass.OpenExchangeRatesOrgProvider.reload Reloading exchange rates from open-exchange-rates.json
   [junit4]   2> 1851184 T6497 oass.OpenExchangeRatesOrgProvider$OpenExchangeRates.<init> WARN Unknown key IMPORTANT NOTE
   [junit4]   2> 1851184 T6497 oass.OpenExchangeRatesOrgProvider$OpenExchangeRates.<init> WARN Expected key, got STRING
   [junit4]   2> 1851185 T6497 oass.OpenExchangeRatesOrgProvider.reload Reloading exchange rates from open-exchange-rates.json
   [junit4]   2> 1851185 T6497 oass.OpenExchangeRatesOrgProvider$OpenExchangeRates.<init> WARN Unknown key IMPORTANT NOTE
   [junit4]   2> 1851185 T6497 oass.OpenExchangeRatesOrgProvider$OpenExchangeRates.<init> WARN Expected key, got STRING
   [junit4]   2> 1851186 T6497 oasc.CoreContainer.create Creating SolrCore 'collection1' using configuration from instancedir /Users/jenkins/workspace/Lucene-Solr-4.x-MacOSX/solr/core/src/test-files/solr/collection1/
   [junit4]   2> 1851186 T6497 oasc.SolrCore.initDirectoryFactory org.apache.solr.core.MockDirectoryFactory
   [junit4]   2> 1851186 T6497 oasc.SolrCore.<init> [collection1] Opening new SolrCore at /Users/jenkins/workspace/Lucene-Solr-4.x-MacOSX/solr/core/src/test-files/solr/collection1/, dataDir=/Users/jenkins/workspace/Lucene-Solr-4.x-MacOSX/solr/build/solr-core/test/J0/./solr.handler.admin.InfoHandlerTest-2EAE098B4D94C291-001/init-core-data-001/
   [junit4]   2> 1851187 T6497 oasc.JmxMonitoredMap.<init> JMX monitoring is enabled. Adding Solr mbeans to JMX Server: com.sun.jmx.mbeanserver.JmxMBeanServer@655f247f
   [junit4]   2> 1851188 T6497 oasc.CachingDirectoryFactory.get return new directory for /Users/jenkins/workspace/Lucene-Solr-4.x-MacOSX/solr/build/solr-core/test/J0/./solr.handler.admin.InfoHandlerTest-2EAE098B4D94C291-001/init-core-data-001
   [junit4]   2> 1851188 T6497 oasc.SolrCore.getNewIndexDir New index directory detected: old=null new=/Users/jenkins/workspace/Lucene-Solr-4.x-MacOSX/solr/build/solr-core/test/J0/./solr.handler.admin.InfoHandlerTest-2EAE098B4D94C291-001/init-core-data-001/index/
   [junit4]   2> 1851188 T6497 oasc.SolrCore.initIndex WARN [collection1] Solr index directory '/Users/jenkins/workspace/Lucene-Solr-4.x-MacOSX/solr/build/solr-core/test/J0/./solr.handler.admin.InfoHandlerTest-2EAE098B4D94C291-001/init-core-data-001/index' doesn't exist. Creating new index...
   [junit4]   2> 1851189 T6497 oasc.CachingDirectoryFactory.get return new directory for /Users/jenkins/workspace/Lucene-Solr-4.x-MacOSX/solr/build/solr-core/test/J0/./solr.handler.admin.InfoHandlerTest-2EAE098B4D94C291-001/init-core-data-001/index
   [junit4]   2> 1851189 T6497 oasu.RandomMergePolicy.<init> RandomMergePolicy wrapping class org.apache.lucene.index.LogDocMergePolicy: [LogDocMergePolicy: minMergeSize=1000, mergeFactor=50, maxMergeSize=9223372036854775807, maxMergeSizeForForcedMerge=9223372036854775807, calibrateSizeByDeletes=false, maxMergeDocs=2147483647, maxCFSSegmentSizeMB=8.796093022207999E12, noCFSRatio=0.2680549420480359]
   [junit4]   2> 1851190 T6497 oasc.SolrDeletionPolicy.onCommit SolrDeletionPolicy.onCommit: commits: num=1
   [junit4]   2> 		commit{dir=RateLimitedDirectoryWrapper(MockDirectoryWrapper(RAMDirectory@34b49672 lockFactory=org.apache.lucene.store.SingleInstanceLockFactory@757930d2)),segFN=segments_1,generation=1}
   [junit4]   2> 1851191 T6497 oasc.SolrDeletionPolicy.updateCommits newest commit generation = 1
   [junit4]   2> 1851191 T6497 oasc.SolrCore.initWriters created xml: solr.XMLResponseWriter
   [junit4]   2> 1851197 T6497 oasup.UpdateRequestProcessorChain.init creating updateRequestProcessorChain "dedupe"
   [junit4]   2> 1851198 T6497 oasup.UpdateRequestProcessorChain.init inserting DistributedUpdateProcessorFactory into updateRequestProcessorChain "dedupe"
   [junit4]   2> 1851198 T6497 oasup.UpdateRequestProcessorChain.init creating updateRequestProcessorChain "dedupe-allfields"
   [junit4]   2> 1851199 T6497 oasup.UpdateRequestProcessorChain.init inserting DistributedUpdateProcessorFactory into updateRequestProcessorChain "dedupe-allfields"
   [junit4]   2> 1851199 T6497 oasup.UpdateRequestProcessorChain.init creating updateRequestProcessorChain "stored_sig"
   [junit4]   2> 1851199 T6497 oasup.UpdateRequestProcessorChain.init inserting DistributedUpdateProcessorFactory into updateRequestProcessorChain "stored_sig"
   [junit4]   2> 1851200 T6497 oasup.UpdateRequestProcessorChain.init creating updateRequestProcessorChain "uniq-fields"
   [junit4]   2> 1851200 T6497 oasup.UniqFieldsUpdateProcessorFactory.init WARN Use of the 'fields' init param in UniqFieldsUpdateProcessorFactory is deprecated, please use 'fieldName' (or another FieldMutatingUpdateProcessorFactory selector option) instead
   [junit4]   2> 1851200 T6497 oasup.UniqFieldsUpdateProcessorFactory.init Replacing 'fields' init param with (individual) 'fieldName' params
   [junit4]   2> 1851201 T6497 oasup.UpdateRequestProcessorChain.init inserting DistributedUpdateProcessorFactory into updateRequestProcessorChain "uniq-fields"
   [junit4]   2> 1851201 T6497 oasup.UpdateRequestProcessorChain.init creating updateRequestProcessorChain "distrib-dup-test-chain-explicit"
   [junit4]   2> 1851201 T6497 oasup.UpdateRequestProcessorChain.init creating updateRequestProcessorChain "distrib-dup-test-chain-implicit"
   [junit4]   2> 1851202 T6497 oasup.UpdateRequestProcessorChain.init inserting DistributedUpdateProcessorFactory into updateRequestProcessorChain "distrib-dup-test-chain-implicit"
   [junit4]   2> 1851202 T6497 oasc.SolrCore.loadUpdateProcessorChains no updateRequestProcessorChain defined as default, creating implicit default
   [junit4]   2> 1851202 T6497 oasc.RequestHandlers.initHandlersFromConfig adding lazy requestHandler: solr.ReplicationHandler
   [junit4]   2> 1851202 T6497 oasc.RequestHandlers.initHandlersFromConfig created /replication: solr.ReplicationHandler
   [junit4]   2> 1851203 T6497 oasc.RequestHandlers.initHandlersFromConfig created standard: solr.StandardRequestHandler
   [junit4]   2> 1851203 T6497 oasc.RequestHandlers.initHandlersFromConfig created /get: solr.RealTimeGetHandler
   [junit4]   2> 1851204 T6497 oasc.RequestHandlers.initHandlersFromConfig created dismax: solr.SearchHandler
   [junit4]   2> 1851204 T6497 oasc.RequestHandlers.initHandlersFromConfig created mock: org.apache.solr.core.MockQuerySenderListenerReqHandler
   [junit4]   2> 1851205 T6497 oasc.RequestHandlers.initHandlersFromConfig created /admin/: org.apache.solr.handler.admin.AdminHandlers
   [junit4]   2> 1851205 T6497 oasc.RequestHandlers.initHandlersFromConfig created /admin/file: solr.admin.ShowFileRequestHandler
   [junit4]   2> 1851206 T6497 oasc.RequestHandlers.initHandlersFromConfig created defaults: solr.StandardRequestHandler
   [junit4]   2> 1851206 T6497 oasc.RequestHandlers.initHandlersFromConfig adding lazy requestHandler: solr.StandardRequestHandler
   [junit4]   2> 1851206 T6497 oasc.RequestHandlers.initHandlersFromConfig created lazy: solr.StandardRequestHandler
   [junit4]   2> 1851207 T6497 oasc.RequestHandlers.initHandlersFromConfig created /update: solr.UpdateRequestHandler
   [junit4]   2> 1851207 T6497 oasc.RequestHandlers.initHandlersFromConfig created /terms: org.apache.solr.handler.component.SearchHandler
   [junit4]   2> 1851209 T6497 oasc.RequestHandlers.initHandlersFromConfig created spellCheckCompRH: org.apache.solr.handler.component.SearchHandler
   [junit4]   2> 1851209 T6497 oasc.RequestHandlers.initHandlersFromConfig created spellCheckCompRH_Direct: org.apache.solr.handler.component.SearchHandler
   [junit4]   2> 1851210 T6497 oasc.RequestHandlers.initHandlersFromConfig created spellCheckWithWordbreak: org.apache.solr.handler.component.SearchHandler
   [junit4]   2> 1851210 T6497 oasc.RequestHandlers.initHandlersFromConfig created spellCheckWithWordbreak_Direct: org.apache.solr.handler.component.SearchHandler
   [junit4]   2> 1851210 T6497 oasc.RequestHandlers.initHandlersFromConfig created spellCheckCompRH1: org.apache.solr.handler.component.SearchHandler
   [junit4]   2> 1851211 T6497 oasc.RequestHandlers.initHandlersFromConfig created mltrh: org.apache.solr.handler.component.SearchHandler
   [junit4]   2> 1851211 T6497 oasc.RequestHandlers.initHandlersFromConfig created tvrh: org.apache.solr.handler.component.SearchHandler
   [junit4]   2> 1851212 T6497 oasc.RequestHandlers.initHandlersFromConfig created /mlt: solr.MoreLikeThisHandler
   [junit4]   2> 1851213 T6497 oasc.RequestHandlers.initHandlersFromConfig created /debug/dump: solr.DumpRequestHandler
   [junit4]   2> 1851225 T6497 oashl.XMLLoader.init xsltCacheLifetimeSeconds=60
   [junit4]   2> 1851226 T6497 oasc.SolrCore.initDeprecatedSupport WARN solrconfig.xml uses deprecated <admin/gettableFiles>, Please update your config to use the ShowFileRequestHandler.
   [junit4]   2> 1851231 T6497 oasu.CommitTracker.<init> Hard AutoCommit: disabled
   [junit4]   2> 1851231 T6497 oasu.CommitTracker.<init> Soft AutoCommit: disabled
   [junit4]   2> 1851232 T6497 oasu.RandomMergePolicy.<init> RandomMergePolicy wrapping class org.apache.lucene.index.LogByteSizeMergePolicy: [LogByteSizeMergePolicy: minMergeSize=1677721, mergeFactor=40, maxMergeSize=2147483648, maxMergeSizeForForcedMerge=9223372036854775807, calibrateSizeByDeletes=true, maxMergeDocs=2147483647, maxCFSSegmentSizeMB=8.796093022207999E12, noCFSRatio=1.0]
   [junit4]   2> 1851232 T6497 oasc.SolrDeletionPolicy.onInit SolrDeletionPolicy.onInit: commits: num=1
   [junit4]   2> 		commit{dir=RateLimitedDirectoryWrapper(MockDirectoryWrapper(RAMDirectory@34b49672 lockFactory=org.apache.lucene.store.SingleInstanceLockFactory@757930d2)),segFN=segments_1,generation=1}
   [junit4]   2> 1851233 T6497 oasc.SolrDeletionPolicy.updateCommits newest commit generation = 1
   [junit4]   2> 1851233 T6497 oass.SolrIndexSearcher.<init> Opening Searcher@5176d596[collection1] main
   [junit4]   2> 1851233 T6497 oasr.RestManager.init Initializing RestManager with initArgs: {storageIO=org.apache.solr.rest.ManagedResourceStorage$InMemoryStorageIO}
   [junit4]   2> 1851234 T6497 oasr.ManagedResourceStorage.load Reading _rest_managed.json using InMemoryStorage
   [junit4]   2> 1851234 T6497 oasr.ManagedResource.reloadFromStorage WARN No stored data found for /rest/managed
   [junit4]   2> 1851234 T6497 oasr.ManagedResource.notifyObserversDuringInit WARN No registered observers for /rest/managed
   [junit4]   2> 1851235 T6497 oasr.RestManager.init Initializing 0 registered ManagedResources
   [junit4]   2> 1851235 T6497 oashc.SpellCheckComponent.inform Initializing spell checkers
   [junit4]   2> 1851248 T6497 oass.DirectSolrSpellChecker.init init: {name=direct,classname=DirectSolrSpellChecker,field=lowerfilt,minQueryLength=3}
   [junit4]   2> 1851332 T6498 oasc.SolrCore.registerSearcher [collection1] Registered new searcher Searcher@5176d596[collection1] main{StandardDirectoryReader(segments_1:1:nrt)}
   [junit4]   2> 1851337 T6497 oasc.CoreContainer.registerCore registering core: collection1
   [junit4]   2> 1851341 T6496 oas.SolrTestCaseJ4.initCore ####initCore end
   [junit4]   2> 1851345 T6496 oas.SolrTestCaseJ4.setUp ###Starting testOverriddenHandlers
   [junit4]   2> 1851357 T6496 oas.SolrTestCaseJ4.tearDown ###Ending testOverriddenHandlers
   [junit4]   2> NOTE: reproduce with: ant test  -Dtestcase=InfoHandlerTest -Dtests.method=testOverriddenHandlers -Dtests.seed=2EAE098B4D94C291 -Dtests.slow=true -Dtests.locale=ar -Dtests.timezone=Pacific/Chuuk -Dtests.file.encoding=UTF-8
   [junit4] ERROR   0.02s | InfoHandlerTest.testOverriddenHandlers <<<
   [junit4]    > Throwable #1: java.lang.NoClassDefFoundError: Could not initialize class java.lang.UNIXProcess
   [junit4]    > 	at __randomizedtesting.SeedInfo.seed([2EAE098B4D94C291:C8F505ACB4DD0D25]:0)
   [junit4]    > 	at java.lang.ProcessImpl.start(ProcessImpl.java:130)
   [junit4]    > 	at java.lang.ProcessBuilder.start(ProcessBuilder.java:1022)
   [junit4]    > 	at java.lang.Runtime.exec(Runtime.java:617)
   [junit4]    > 	at java.lang.Runtime.exec(Runtime.java:450)
   [junit4]    > 	at java.lang.Runtime.exec(Runtime.java:347)
   [junit4]    > 	at org.apache.solr.handler.admin.SystemInfoHandler.execute(SystemInfoHandler.java:220)
   [junit4]    > 	at org.apache.solr.handler.admin.SystemInfoHandler.getSystemInfo(SystemInfoHandler.java:176)
   [junit4]    > 	at org.apache.solr.handler.admin.SystemInfoHandler.handleRequestBody(SystemInfoHandler.java:97)
   [junit4]    > 	at org.apache.solr.handler.admin.InfoHandlerTest$CountSystemInfoHandler.handleRequestBody(InfoHandlerTest.java:157)
   [junit4]    > 	at org.apache.solr.handler.RequestHandlerBase.handleRequest(RequestHandlerBase.java:135)
   [junit4]    > 	at org.apache.solr.handler.admin.InfoHandler.handleRequestBody(InfoHandler.java:88)
   [junit4]    > 	at org.apache.solr.handler.admin.InfoHandlerTest.handleRequest(InfoHandlerTest.java:168)
   [junit4]    > 	at org.apache.solr.handler.admin.InfoHandlerTest.testOverriddenHandlers(InfoHandlerTest.java:98)
   [junit4]    > 	at java.lang.Thread.run(Thread.java:745)
   [junit4]   2> 1851373 T6496 oas.SolrTestCaseJ4.setUp ###Starting testCoreAdminHandler
   [junit4]   2> 1851385 T6496 oas.SolrTestCaseJ4.tearDown ###Ending testCoreAdminHandler
   [junit4]   2> 1851386 T6496 oas.SolrTestCaseJ4.deleteCore ###deleteCore
   [junit4]   2> 1851387 T6496 oasc.CoreContainer.shutdown Shutting down CoreContainer instance=1730756785
   [junit4]   2> 1851387 T6496 oasc.SolrCore.close [collection1]  CLOSING SolrCore org.apache.solr.core.SolrCore@78cf2c9e
   [junit4]   2> 1851404 T6496 oasu.DirectUpdateHandler2.close closing DirectUpdateHandler2{commits=0,autocommits=0,soft autocommits=0,optimizes=0,rollbacks=0,expungeDeletes=0,docsPending=0,adds=0,deletesById=0,deletesByQuery=0,errors=0,cumulative_adds=0,cumulative_deletesById=0,cumulative_deletesByQuery=0,cumulative_errors=0,transaction_logs_total_size=0,transaction_logs_total_number=0}
   [junit4]   2> 1851405 T6496 oasu.SolrCoreState.decrefSolrCoreState Closing SolrCoreState
   [junit4]   2> 1851405 T6496 oasu.DefaultSolrCoreState.closeIndexWriter SolrCoreState ref count has reached 0 - closing IndexWriter
   [junit4]   2> 1851405 T6496 oasu.DefaultSolrCoreState.closeIndexWriter closing IndexWriter with IndexWriterCloser
   [junit4]   2> 1851407 T6496 oasc.SolrCore.closeSearcher [collection1] Closing main searcher on request.
   [junit4]   2> 1851407 T6496 oasc.CachingDirectoryFactory.close Closing MockDirectoryFactory - 2 directories currently being tracked
   [junit4]   2> 1851407 T6496 oasc.CachingDirectoryFactory.closeCacheValue looking to close /Users/jenkins/workspace/Lucene-Solr-4.x-MacOSX/solr/build/solr-core/test/J0/./solr.handler.admin.InfoHandlerTest-2EAE098B4D94C291-001/init-core-data-001/index [CachedDir<<refCount=0;path=/Users/jenkins/workspace/Lucene-Solr-4.x-MacOSX/solr/build/solr-core/test/J0/./solr.handler.admin.InfoHandlerTest-2EAE098B4D94C291-001/init-core-data-001/index;done=false>>]
   [junit4]   2> 1851408 T6496 oasc.CachingDirectoryFactory.close Closing directory: /Users/jenkins/workspace/Lucene-Solr-4.x-MacOSX/solr/build/solr-core/test/J0/./solr.handler.admin.InfoHandlerTest-2EAE098B4D94C291-001/init-core-data-001/index
   [junit4]   2> 1851408 T6496 oasc.CachingDirectoryFactory.closeCacheValue looking to close /Users/jenkins/workspace/Lucene-Solr-4.x-MacOSX/solr/build/solr-core/test/J0/./solr.handler.admin.InfoHandlerTest-2EAE098B4D94C291-001/init-core-data-001 [CachedDir<<refCount=0;path=/Users/jenkins/workspace/Lucene-Solr-4.x-MacOSX/solr/build/solr-core/test/J0/./solr.handler.admin.InfoHandlerTest-2EAE098B4D94C291-001/init-core-data-001;done=false>>]
   [junit4]   2> 1851408 T6496 oasc.CachingDirectoryFactory.close Closing directory: /Users/jenkins/workspace/Lucene-Solr-4.x-MacOSX/solr/build/solr-core/test/J0/./solr.handler.admin.InfoHandlerTest-2EAE098B4D94C291-001/init-core-data-001
   [junit4]   2> NOTE: leaving temporary files on disk at: /Users/jenkins/workspace/Lucene-Solr-4.x-MacOSX/solr/build/solr-core/test/J0/./solr.handler.admin.InfoHandlerTest-2EAE098B4D94C291-001
   [junit4]   2> NOTE: test params are: codec=Lucene40, sim=RandomSimilarityProvider(queryNorm=false,coord=yes): {}, locale=ar, timezone=Pacific/Chuuk
   [junit4]   2> NOTE: Mac OS X 10.8.5 x86_64/Oracle Corporation 1.7.0_60 (64-bit)/cpus=2,threads=1,free=285604016,total=536870912
   [junit4]   2> NOTE: All tests run in this JVM: [HdfsDirectoryTest, MultiThreadedOCPTest, TestDistribDocBasedVersion, TestSchemaResource, CursorMarkTest, SpatialFilterTest, TestUtils, EnumFieldTest, ParsingFieldUpdateProcessorsTest, TestStressVersions, TestElisionMultitermQuery, TestLuceneMatchVersion, DistributedQueryComponentCustomSortTest, TestSimpleQParserPlugin, TestCharFilters, PreAnalyzedUpdateProcessorTest, IndexSchemaTest, ExternalFileFieldSortTest, TestReversedWildcardFilterFactory, SpellCheckCollatorTest, TestDFRSimilarityFactory, TestCodecSupport, NotRequiredUniqueKeyTest, HighlighterTest, DateFieldTest, BlockCacheTest, TestAnalyzedSuggestions, SOLR749Test, ResourceLoaderTest, TestPseudoReturnFields, ReturnFieldsTest, XsltUpdateRequestHandlerTest, CacheHeaderTest, DebugComponentTest, TestSweetSpotSimilarityFactory, TestCSVResponseWriter, SliceStateUpdateTest, SuggesterWFSTTest, SolrXmlInZkTest, DeleteReplicaTest, TestSolrXml, ZkCLITest, TestReplicationHandler, BinaryUpdateRequestHandlerTest, PreAnalyzedFieldTest, HdfsRecoveryZkTest, TestMaxScoreQueryParser, TestDocBasedVersionConstraints, AddSchemaFieldsUpdateProcessorFactoryTest, OverseerCollectionProcessorTest, QueryEqualityTest, DirectUpdateHandlerOptimizeTest, TestManagedResourceStorage, AliasIntegrationTest, LoggingHandlerTest, IndexSchemaRuntimeFieldTest, DistributedSuggestComponentTest, AtomicUpdatesTest, TestJmxIntegration, TestSolrDeletionPolicy1, SchemaVersionSpecificBehaviorTest, FullSolrCloudDistribCmdsTest, ClusterStateTest, TestHighlightDedupGrouping, TestSolrDeletionPolicy2, TriLevelCompositeIdRoutingTest, OverseerStatusTest, QueryResultKeyTest, TestSolrQueryParserDefaultOperatorResource, CurrencyFieldOpenExchangeTest, TestPostingsSolrHighlighter, TestSearcherReuse, RAMDirectoryFactoryTest, TestDistributedMissingSort, LeaderElectionTest, TestDistributedGrouping, HdfsBasicDistributedZkTest, BJQParserTest, RegexBoostProcessorTest, TestCSVLoader, MergeStrategyTest, TestRequestStatusCollectionAPI, FastVectorHighlighterTest, TestZkChroot, SpellCheckComponentTest, TestCloudManagedSchema, TestQuerySenderListener, SolrTestCaseJ4Test, TestManagedStopFilterFactory, TestSolrXmlPersistor, StatsComponentTest, QueryParsingTest, LeaderElectionIntegrationTest, TestSolrQueryParser, RequiredFieldsTest, RequestHandlersTest, TestNonNRTOpen, NoCacheHeaderTest, TestCollationFieldDocValues, TestBlendedInfixSuggestions, TestRestManager, DeleteShardTest, ZkSolrClientTest, TestFastOutputStream, DocumentBuilderTest, CircularListTest, MinimalSchemaTest, TestPhraseSuggestions, TestFieldSortValues, TestStressLucene, TestLMJelinekMercerSimilarityFactory, TestLRUCache, TestSolrIndexConfig, CSVRequestHandlerTest, DirectSolrConnectionTest, TestManagedResource, TestFunctionQuery, SolrRequestParserTest, SystemInfoHandlerTest, FileUtilsTest, TestRTGBase, TestDefaultSearchFieldResource, DistributedQueryComponentOptimizationTest, FieldMutatingUpdateProcessorTest, OverseerRolesTest, TestSort, TestReRankQParserPlugin, PolyFieldTest, DistribDocExpirationUpdateProcessorTest, URLClassifyProcessorTest, SolrCmdDistributorTest, TestFaceting, SynonymTokenizerTest, HdfsCollectionsAPIDistributedZkTest, IndexBasedSpellCheckerTest, TestIndexSearcher, TestBadConfig, TestQueryUtils, TestFreeTextSuggestions, TestDocSet, TimeZoneUtilsTest, HdfsLockFactoryTest, TestCollationField, AsyncMigrateRouteKeyTest, HdfsChaosMonkeySafeLeaderTest, TestDefaultSimilarityFactory, UnloadDistributedZkTest, HighlighterConfigTest, UUIDFieldTest, TestWriterPerf, TestStressRecovery, SolrInfoMBeanTest, TestClassNameShortening, TestSerializedLuceneMatchVersion, TestReload, TestUpdate, LukeRequestHandlerTest, SimplePostToolTest, TestCustomSort, DocValuesTest, TestShardHandlerFactory, TestConfigSets, TestSolr4Spatial, TestCopyFieldCollectionResource, SuggesterTSTTest, ConnectionManagerTest, TestJmxMonitoredMap, TestExtendedDismaxParser, TestFastLRUCache, TestDistributedSearch, TestRecoveryHdfs, TermVectorComponentTest, SolrCoreTest, DistanceFunctionTest, DefaultValueUpdateProcessorTest, FileBasedSpellCheckerTest, TestBM25SimilarityFactory, UpdateRequestProcessorFactoryTest, MigrateRouteKeyTest, TestMergePolicyConfig, PrimitiveFieldTypeTest, CustomCollectionTest, HdfsWriteToMultipleCollectionsTest, DocValuesMissingTest, TestMultiCoreConfBootstrap, InfoHandlerTest]
   [junit4] Completed in 1.79s, 2 tests, 1 error <<< FAILURES!

[...truncated 665 lines...]
BUILD FAILED
/Users/jenkins/workspace/Lucene-Solr-4.x-MacOSX/build.xml:467: The following error occurred while executing this line:
/Users/jenkins/workspace/Lucene-Solr-4.x-MacOSX/build.xml:447: The following error occurred while executing this line:
/Users/jenkins/workspace/Lucene-Solr-4.x-MacOSX/build.xml:45: The following error occurred while executing this line:
/Users/jenkins/workspace/Lucene-Solr-4.x-MacOSX/extra-targets.xml:37: The following error occurred while executing this line:
/Users/jenkins/workspace/Lucene-Solr-4.x-MacOSX/solr/build.xml:189: The following error occurred while executing this line:
/Users/jenkins/workspace/Lucene-Solr-4.x-MacOSX/solr/common-build.xml:496: The following error occurred while executing this line:
/Users/jenkins/workspace/Lucene-Solr-4.x-MacOSX/lucene/common-build.xml:1297: The following error occurred while executing this line:
/Users/jenkins/workspace/Lucene-Solr-4.x-MacOSX/lucene/common-build.xml:921: There were test failures: 405 suites, 1655 tests, 2 errors, 42 ignored (15 assumptions)

Total time: 124 minutes 58 seconds
Build step 'Invoke Ant' marked build as failure
Description set: Java: 64bit/jdk1.7.0 -XX:-UseCompressedOops -XX:+UseG1GC
Archiving artifacts
Recording test results
Email was triggered for: Failure - Any
Sending email for trigger: Failure - Any



Re: [JENKINS] Lucene-Solr-4.x-MacOSX (64bit/jdk1.7.0) - Build # 1621 - Still Failing!

Posted by Chris Hostetter <ho...@apache.org>.
: Error Message:
: posix_spawn is not a supported process launch mechanism on this platform.

does anybody understand what's going on here?

My mail log shows that this has happend 8 times since April 4th on 
policeman jenkin's MacOS builds of both trunk & 4x, using both jdk7 & jdk8


reading between the lines of some related google hits, it smells like 
maybe this has something to do classpath bleeding between differnet 
version of the JDK? ... most mentions of it i find relate to people who 
had problems with various software that magically went away when they 
un-installed an older (or newer) JDK that they weren't using.


-Hoss

---------------------------------------------------------------------
To unsubscribe, e-mail: dev-unsubscribe@lucene.apache.org
For additional commands, e-mail: dev-help@lucene.apache.org