You are viewing a plain text version of this content. The canonical link for it is here.
Posted to builds@beam.apache.org by Apache Jenkins Server <je...@builds.apache.org> on 2023/09/04 00:20:31 UTC

Build failed in Jenkins: beam_PostCommit_XVR_Direct #4555

See <https://ci-beam.apache.org/job/beam_PostCommit_XVR_Direct/4555/display/redirect>

Changes:


------------------------------------------
[...truncated 2.45 MB...]
INFO     apache_beam.utils.subprocess_server:subprocess_server.py:126 Sep 04, 2023 12:19:07 AM org.apache.beam.sdk.expansion.service.ExpansionService loadRegisteredTransforms
INFO     apache_beam.utils.subprocess_server:subprocess_server.py:126 INFO: Registering external transforms: [beam:external:java:sql:v1, beam:transform:org.apache.beam:pubsub_read:v1, beam:transform:org.apache.beam:pubsub_write:v1, beam:transform:org.apache.beam:pubsublite_write:v1, beam:transform:org.apache.beam:pubsublite_read:v1, beam:transform:org.apache.beam:spanner_insert:v1, beam:transform:org.apache.beam:spanner_update:v1, beam:transform:org.apache.beam:spanner_replace:v1, beam:transform:org.apache.beam:spanner_insert_or_update:v1, beam:transform:org.apache.beam:spanner_delete:v1, beam:transform:org.apache.beam:spanner_read:v1, beam:transform:org.apache.beam:kafka_read_with_metadata:v1, beam:transform:org.apache.beam:kafka_read_without_metadata:v1, beam:transform:org.apache.beam:kafka_write:v1, beam:external:java:generate_sequence:v1]
INFO     apache_beam.utils.subprocess_server:subprocess_server.py:126 
INFO     apache_beam.utils.subprocess_server:subprocess_server.py:126 Registered transforms:
INFO     apache_beam.utils.subprocess_server:subprocess_server.py:126 	beam:external:java:sql:v1: org.apache.beam.sdk.expansion.service.ExpansionService$ExternalTransformRegistrarLoader$1@3c46e67a
INFO     apache_beam.utils.subprocess_server:subprocess_server.py:126 	beam:transform:org.apache.beam:pubsub_read:v1: org.apache.beam.sdk.expansion.service.ExpansionService$ExternalTransformRegistrarLoader$1@c730b35
INFO     apache_beam.utils.subprocess_server:subprocess_server.py:126 	beam:transform:org.apache.beam:pubsub_write:v1: org.apache.beam.sdk.expansion.service.ExpansionService$ExternalTransformRegistrarLoader$1@206a70ef
INFO     apache_beam.utils.subprocess_server:subprocess_server.py:126 	beam:transform:org.apache.beam:pubsublite_write:v1: org.apache.beam.sdk.expansion.service.ExpansionService$ExternalTransformRegistrarLoader$1@292b08d6
INFO     apache_beam.utils.subprocess_server:subprocess_server.py:126 	beam:transform:org.apache.beam:pubsublite_read:v1: org.apache.beam.sdk.expansion.service.ExpansionService$ExternalTransformRegistrarLoader$1@22555ebf
INFO     apache_beam.utils.subprocess_server:subprocess_server.py:126 	beam:transform:org.apache.beam:spanner_insert:v1: org.apache.beam.sdk.expansion.service.ExpansionService$ExternalTransformRegistrarLoader$1@36ebc363
INFO     apache_beam.utils.subprocess_server:subprocess_server.py:126 	beam:transform:org.apache.beam:spanner_update:v1: org.apache.beam.sdk.expansion.service.ExpansionService$ExternalTransformRegistrarLoader$1@45752059
INFO     apache_beam.utils.subprocess_server:subprocess_server.py:126 	beam:transform:org.apache.beam:spanner_replace:v1: org.apache.beam.sdk.expansion.service.ExpansionService$ExternalTransformRegistrarLoader$1@34e9fd99
INFO     apache_beam.utils.subprocess_server:subprocess_server.py:126 	beam:transform:org.apache.beam:spanner_insert_or_update:v1: org.apache.beam.sdk.expansion.service.ExpansionService$ExternalTransformRegistrarLoader$1@3c41ed1d
INFO     apache_beam.utils.subprocess_server:subprocess_server.py:126 	beam:transform:org.apache.beam:spanner_delete:v1: org.apache.beam.sdk.expansion.service.ExpansionService$ExternalTransformRegistrarLoader$1@54d9d12d
INFO     apache_beam.utils.subprocess_server:subprocess_server.py:126 	beam:transform:org.apache.beam:spanner_read:v1: org.apache.beam.sdk.expansion.service.ExpansionService$ExternalTransformRegistrarLoader$1@38425407
INFO     apache_beam.utils.subprocess_server:subprocess_server.py:126 	beam:transform:org.apache.beam:kafka_read_with_metadata:v1: org.apache.beam.sdk.expansion.service.ExpansionService$ExternalTransformRegistrarLoader$1@43bc63a3
INFO     apache_beam.utils.subprocess_server:subprocess_server.py:126 	beam:transform:org.apache.beam:kafka_read_without_metadata:v1: org.apache.beam.sdk.expansion.service.ExpansionService$ExternalTransformRegistrarLoader$1@702657cc
INFO     apache_beam.utils.subprocess_server:subprocess_server.py:126 	beam:transform:org.apache.beam:kafka_write:v1: org.apache.beam.sdk.expansion.service.ExpansionService$ExternalTransformRegistrarLoader$1@6a6cb05c
INFO     apache_beam.utils.subprocess_server:subprocess_server.py:126 	beam:external:java:generate_sequence:v1: org.apache.beam.sdk.expansion.service.ExpansionService$ExternalTransformRegistrarLoader$1@40a4337a
INFO     apache_beam.utils.subprocess_server:subprocess_server.py:126 
INFO     apache_beam.utils.subprocess_server:subprocess_server.py:126 Registered SchemaTransformProviders:
INFO     apache_beam.utils.subprocess_server:subprocess_server.py:126 	beam:schematransform:org.apache.beam:spanner_cdc_read:v1
INFO     apache_beam.utils.subprocess_server:subprocess_server.py:126 	beam:schematransform:org.apache.beam:bigtable_write:v1
INFO     apache_beam.utils.subprocess_server:subprocess_server.py:126 	beam:schematransform:org.apache.beam:spanner_write:v1
INFO     apache_beam.utils.subprocess_server:subprocess_server.py:126 	beam:schematransform:org.apache.beam:pubsublite_read:v1
INFO     apache_beam.utils.subprocess_server:subprocess_server.py:126 	beam:schematransform:org.apache.beam:bigquery_storage_read:v1
INFO     apache_beam.utils.subprocess_server:subprocess_server.py:126 	beam:schematransform:org.apache.beam:bigquery_fileloads_write:v1
INFO     apache_beam.utils.subprocess_server:subprocess_server.py:126 	beam:schematransform:org.apache.beam:bigquery_export_read:v1
INFO     apache_beam.utils.subprocess_server:subprocess_server.py:126 	beam:schematransform:org.apache.beam:kafka_read:v1
INFO     apache_beam.utils.subprocess_server:subprocess_server.py:126 	beam:schematransform:org.apache.beam:kafka_write:v1
INFO     apache_beam.utils.subprocess_server:subprocess_server.py:126 	beam:schematransform:org.apache.beam:bigquery_storage_write:v1
INFO     apache_beam.utils.subprocess_server:subprocess_server.py:126 	schematransform:org.apache.beam:sql_transform:v1
INFO     apache_beam.utils.subprocess_server:subprocess_server.py:126 	beam:schematransform:org.apache.beam:pubsub_read:v1
INFO     apache_beam.utils.subprocess_server:subprocess_server.py:126 	beam:schematransform:org.apache.beam:pubsub_write:v1
INFO     apache_beam.utils.subprocess_server:subprocess_server.py:126 	beam:schematransform:org.apache.beam:bigtable_read:v1
INFO     apache_beam.utils.subprocess_server:subprocess_server.py:126 	beam:schematransform:org.apache.beam:pubsublite_write:v1
WARNING  root:subprocess_server.py:95 Waiting for grpc channel to be ready at localhost:51921.
INFO     apache_beam.utils.subprocess_server:subprocess_server.py:126 Sep 04, 2023 12:19:11 AM org.apache.beam.sdk.expansion.service.ExpansionService expand
INFO     apache_beam.utils.subprocess_server:subprocess_server.py:126 INFO: Expanding 'SqlTransform(beam:external:java:sql:v1)' with URN 'beam:external:java:sql:v1'
INFO     apache_beam.utils.subprocess_server:subprocess_server.py:126 Dependencies list: {}
INFO     apache_beam.utils.subprocess_server:subprocess_server.py:126 Sep 04, 2023 12:19:11 AM org.apache.beam.sdk.expansion.service.ExpansionService$ExternalTransformRegistrarLoader payloadToConfig
INFO     apache_beam.utils.subprocess_server:subprocess_server.py:126 WARNING: Configuration class 'org.apache.beam.sdk.extensions.sql.expansion.ExternalSqlTransformRegistrar$Configuration' has no schema registered. Attempting to construct with setter approach.
INFO     apache_beam.utils.subprocess_server:subprocess_server.py:126 Sep 04, 2023 12:19:11 AM org.apache.beam.sdk.expansion.service.ExpansionService$ExternalTransformRegistrarLoader payloadToConfig
INFO     apache_beam.utils.subprocess_server:subprocess_server.py:126 WARNING: Configuration class 'org.apache.beam.sdk.extensions.sql.expansion.ExternalSqlTransformRegistrar$Configuration' has no schema registered. Attempting to construct with setter approach.
INFO     apache_beam.utils.subprocess_server:subprocess_server.py:126 Sep 04, 2023 12:19:14 AM com.google.zetasql.io.grpc.NameResolverRegistry getDefaultRegistry
INFO     apache_beam.utils.subprocess_server:subprocess_server.py:126 WARNING: No NameResolverProviders found via ServiceLoader, including for DNS. This is probably due to a broken build. If using ProGuard, check your configuration
INFO     apache_beam.utils.subprocess_server:subprocess_server.py:126 Sep 04, 2023 12:19:15 AM org.apache.beam.sdk.extensions.sql.zetasql.ZetaSQLQueryPlanner convertToBeamRelInternal
INFO     apache_beam.utils.subprocess_server:subprocess_server.py:126 INFO: BEAMPlan>
INFO     apache_beam.utils.subprocess_server:subprocess_server.py:126 BeamZetaSqlCalcRel(expr#0=[{inputs}], expr#1=[1:BIGINT], expr#2=['foo':VARCHAR], expr#3=[3.1400000000000001243E0:DOUBLE], int=[$t1], str=[$t2], flt=[$t3])
INFO     apache_beam.utils.subprocess_server:subprocess_server.py:126   BeamValuesRel(tuples=[[{ 0 }]])
INFO     apache_beam.utils.subprocess_server:subprocess_server.py:126 
INFO     root:environments.py:317 No image given, using default Python SDK image
INFO     root:environments.py:320 Python SDK container image set to "apache/beam_python3.11_sdk:2.51.0.dev" for Docker environment
INFO     apache_beam.runners.portability.fn_api_runner.translations:translations.py:712 ==================== <function pack_combiners at 0x7f08577d3ec0> ====================
INFO     apache_beam.runners.portability.fn_api_runner.translations:translations.py:712 ==================== <function lift_combiners at 0x7f08577d3f60> ====================
INFO     apache_beam.runners.portability.fn_api_runner.translations:translations.py:712 ==================== <function sort_stages at 0x7f08577dc7c0> ====================
INFO     apache_beam.runners.portability.portable_runner:portable_runner.py:549 Job state changed to STOPPED
INFO     apache_beam.runners.portability.portable_runner:portable_runner.py:549 Job state changed to STARTING
INFO     apache_beam.runners.portability.portable_runner:portable_runner.py:549 Job state changed to RUNNING
INFO     root:portable_runner.py:542 ==================== <function annotate_downstream_side_inputs at 0x7f42f391dda0> ====================
INFO     root:portable_runner.py:542 ==================== <function fix_side_input_pcoll_coders at 0x7f42f391dee0> ====================
INFO     root:portable_runner.py:542 ==================== <function pack_combiners at 0x7f42f391e480> ====================
INFO     root:portable_runner.py:542 ==================== <function lift_combiners at 0x7f42f391e520> ====================
INFO     root:portable_runner.py:542 ==================== <function expand_sdf at 0x7f42f391e700> ====================
INFO     root:portable_runner.py:542 ==================== <function expand_gbk at 0x7f42f391e7a0> ====================
INFO     root:portable_runner.py:542 ==================== <function sink_flattens at 0x7f42f391e8e0> ====================
INFO     root:portable_runner.py:542 ==================== <function greedily_fuse at 0x7f42f391e980> ====================
INFO     root:portable_runner.py:542 ==================== <function read_to_impulse at 0x7f42f391ea20> ====================
INFO     root:portable_runner.py:542 ==================== <function impulse_to_input at 0x7f42f391eac0> ====================
INFO     root:portable_runner.py:542 ==================== <function sort_stages at 0x7f42f391ed40> ====================
INFO     root:portable_runner.py:542 ==================== <function add_impulse_to_dangling_transforms at 0x7f42f391ee80> ====================
INFO     root:portable_runner.py:542 ==================== <function setup_timer_mapping at 0x7f42f391eca0> ====================
INFO     root:portable_runner.py:542 ==================== <function populate_data_channel_coders at 0x7f42f391ede0> ====================
INFO     root:portable_runner.py:542 starting control server on port 39817
INFO     root:portable_runner.py:542 starting data server on port 43781
INFO     root:portable_runner.py:542 starting state server on port 43085
INFO     root:portable_runner.py:542 starting logging server on port 44413
INFO     root:portable_runner.py:542 Created Worker handler <apache_beam.runners.portability.fn_api_runner.worker_handlers.DockerSdkWorkerHandler object at 0x7f42f3820510> for environment ref_Environment_default_environment_2 (beam:env:docker:v1, b'\n%apache/beam_python3.11_sdk:2.51.0.dev')
INFO     root:portable_runner.py:542 Attempting to pull image apache/beam_python3.11_sdk:2.51.0.dev
INFO     root:portable_runner.py:542 Unable to pull image apache/beam_python3.11_sdk:2.51.0.dev, defaulting to local image if it exists
INFO     root:portable_runner.py:542 Waiting for docker to start up. Current status is running
INFO     root:portable_runner.py:542 Docker container is running. container_id = b'2c3a5a749dbeb2d8363cd209a80b41ed65e5724eb7b9361f02181dd92012d05e', worker_id = worker_62
INFO     root:portable_runner.py:542 Created Worker handler <apache_beam.runners.portability.fn_api_runner.worker_handlers.DockerSdkWorkerHandler object at 0x7f42f3844a50> for environment external_9beam:env:docker:v1 (beam:env:docker:v1, b'\n apache/beam_java8_sdk:2.51.0.dev')
INFO     root:portable_runner.py:542 Attempting to pull image apache/beam_java8_sdk:2.51.0.dev
INFO     root:portable_runner.py:542 Unable to pull image apache/beam_java8_sdk:2.51.0.dev, defaulting to local image if it exists
INFO     root:portable_runner.py:542 Waiting for docker to start up. Current status is running
INFO     root:portable_runner.py:542 Docker container is running. container_id = b'f4f98af927998480c27fd8d2d851cb3b113204c7e7625a8503064566f758f0ce', worker_id = worker_63
=============================== warnings summary ===============================
../../build/gradleenv/1922375555/lib/python3.11/site-packages/hdfs/config.py:28
  <https://ci-beam.apache.org/job/beam_PostCommit_XVR_Direct/ws/src/build/gradleenv/1922375555/lib/python3.11/site-packages/hdfs/config.py>:28: DeprecationWarning: the imp module is deprecated in favour of importlib and slated for removal in Python 3.12; see the module's documentation for alternative uses
    from imp import load_source

../../build/gradleenv/1922375555/lib/python3.11/site-packages/google/rpc/__init__.py:18
  <https://ci-beam.apache.org/job/beam_PostCommit_XVR_Direct/ws/src/build/gradleenv/1922375555/lib/python3.11/site-packages/google/rpc/__init__.py>:18: DeprecationWarning: pkg_resources is deprecated as an API. See https://setuptools.pypa.io/en/latest/pkg_resources.html
    import pkg_resources

../../build/gradleenv/1922375555/lib/python3.11/site-packages/pkg_resources/__init__.py:2871: 20 warnings
  <https://ci-beam.apache.org/job/beam_PostCommit_XVR_Direct/ws/src/build/gradleenv/1922375555/lib/python3.11/site-packages/pkg_resources/__init__.py>:2871: DeprecationWarning: Deprecated call to `pkg_resources.declare_namespace('google')`.
  Implementing implicit namespace packages (as specified in PEP 420) is preferred to `pkg_resources.declare_namespace`. See https://setuptools.pypa.io/en/latest/references/keywords.html#keyword-namespace-packages
    declare_namespace(pkg)

../../build/gradleenv/1922375555/lib/python3.11/site-packages/pkg_resources/__init__.py:2871: 16 warnings
  <https://ci-beam.apache.org/job/beam_PostCommit_XVR_Direct/ws/src/build/gradleenv/1922375555/lib/python3.11/site-packages/pkg_resources/__init__.py>:2871: DeprecationWarning: Deprecated call to `pkg_resources.declare_namespace('google.cloud')`.
  Implementing implicit namespace packages (as specified in PEP 420) is preferred to `pkg_resources.declare_namespace`. See https://setuptools.pypa.io/en/latest/references/keywords.html#keyword-namespace-packages
    declare_namespace(pkg)

../../build/gradleenv/1922375555/lib/python3.11/site-packages/pkg_resources/__init__.py:2350
../../build/gradleenv/1922375555/lib/python3.11/site-packages/pkg_resources/__init__.py:2350
../../build/gradleenv/1922375555/lib/python3.11/site-packages/pkg_resources/__init__.py:2350
../../build/gradleenv/1922375555/lib/python3.11/site-packages/pkg_resources/__init__.py:2350
  <https://ci-beam.apache.org/job/beam_PostCommit_XVR_Direct/ws/src/build/gradleenv/1922375555/lib/python3.11/site-packages/pkg_resources/__init__.py>:2350: DeprecationWarning: Deprecated call to `pkg_resources.declare_namespace('google')`.
  Implementing implicit namespace packages (as specified in PEP 420) is preferred to `pkg_resources.declare_namespace`. See https://setuptools.pypa.io/en/latest/references/keywords.html#keyword-namespace-packages
    declare_namespace(parent)

../../build/gradleenv/1922375555/lib/python3.11/site-packages/pkg_resources/__init__.py:2871
  <https://ci-beam.apache.org/job/beam_PostCommit_XVR_Direct/ws/src/build/gradleenv/1922375555/lib/python3.11/site-packages/pkg_resources/__init__.py>:2871: DeprecationWarning: Deprecated call to `pkg_resources.declare_namespace('google.logging')`.
  Implementing implicit namespace packages (as specified in PEP 420) is preferred to `pkg_resources.declare_namespace`. See https://setuptools.pypa.io/en/latest/references/keywords.html#keyword-namespace-packages
    declare_namespace(pkg)

../../build/gradleenv/1922375555/lib/python3.11/site-packages/pkg_resources/__init__.py:2871
  <https://ci-beam.apache.org/job/beam_PostCommit_XVR_Direct/ws/src/build/gradleenv/1922375555/lib/python3.11/site-packages/pkg_resources/__init__.py>:2871: DeprecationWarning: Deprecated call to `pkg_resources.declare_namespace('google.iam')`.
  Implementing implicit namespace packages (as specified in PEP 420) is preferred to `pkg_resources.declare_namespace`. See https://setuptools.pypa.io/en/latest/references/keywords.html#keyword-namespace-packages
    declare_namespace(pkg)

../../build/gradleenv/1922375555/lib/python3.11/site-packages/google/rpc/__init__.py:20
  <https://ci-beam.apache.org/job/beam_PostCommit_XVR_Direct/ws/src/build/gradleenv/1922375555/lib/python3.11/site-packages/google/rpc/__init__.py>:20: DeprecationWarning: Deprecated call to `pkg_resources.declare_namespace('google.rpc')`.
  Implementing implicit namespace packages (as specified in PEP 420) is preferred to `pkg_resources.declare_namespace`. See https://setuptools.pypa.io/en/latest/references/keywords.html#keyword-namespace-packages
    pkg_resources.declare_namespace(__name__)

../../build/gradleenv/1922375555/lib/python3.11/site-packages/google/api_core/operations_v1/abstract_operations_client.py:17
  <https://ci-beam.apache.org/job/beam_PostCommit_XVR_Direct/ws/src/build/gradleenv/1922375555/lib/python3.11/site-packages/google/api_core/operations_v1/abstract_operations_client.py>:17: DeprecationWarning: The distutils package is deprecated and slated for removal in Python 3.12. Use setuptools or check PEP 632 for potential alternatives
    from distutils import util

apache_beam/transforms/sql_test.py::SqlTransformTest::test_agg
apache_beam/transforms/sql_test.py::SqlTransformTest::test_filter
apache_beam/transforms/sql_test.py::SqlTransformTest::test_generate_data
apache_beam/transforms/sql_test.py::SqlTransformTest::test_map
apache_beam/transforms/sql_test.py::SqlTransformTest::test_project
apache_beam/transforms/sql_test.py::SqlTransformTest::test_row
apache_beam/transforms/sql_test.py::SqlTransformTest::test_tagged_join
apache_beam/transforms/sql_test.py::SqlTransformTest::test_windowing_before_sql
apache_beam/transforms/sql_test.py::SqlTransformTest::test_zetasql_generate_data
  <https://ci-beam.apache.org/job/beam_PostCommit_XVR_Direct/ws/src/sdks/python/apache_beam/transforms/external.py>:679: BeamDeprecationWarning: options is deprecated since First stable release. References to <pipeline>.options will not be supported
    self._expansion_service, pipeline.options)

apache_beam/transforms/sql_test.py::SqlTransformTest::test_tagged_join
  <https://ci-beam.apache.org/job/beam_PostCommit_XVR_Direct/ws/src/build/gradleenv/1922375555/lib/python3.11/site-packages/_pytest/threadexception.py>:73: PytestUnhandledThreadExceptionWarning: Exception in thread wait_until_finish_read
  
  Traceback (most recent call last):
    File "/usr/lib/python3.11/threading.py", line 1038, in _bootstrap_inner
      self.run()
    File "/usr/lib/python3.11/threading.py", line 975, in run
      self._target(*self._args, **self._kwargs)
    File "<https://ci-beam.apache.org/job/beam_PostCommit_XVR_Direct/ws/src/sdks/python/apache_beam/runners/portability/portable_runner.py",> line 540, in read_messages
      for message in self._message_stream:
    File "<https://ci-beam.apache.org/job/beam_PostCommit_XVR_Direct/ws/src/build/gradleenv/1922375555/lib/python3.11/site-packages/grpc/_channel.py",> line 541, in __next__
      return self._next()
             ^^^^^^^^^^^^
    File "<https://ci-beam.apache.org/job/beam_PostCommit_XVR_Direct/ws/src/build/gradleenv/1922375555/lib/python3.11/site-packages/grpc/_channel.py",> line 967, in _next
      raise self
  grpc._channel._MultiThreadedRendezvous: <_MultiThreadedRendezvous of RPC that terminated with:
  	status = StatusCode.DEADLINE_EXCEEDED
  	details = "Deadline Exceeded"
  	debug_error_string = "UNKNOWN:Error received from peer ipv4:127.0.0.1:42669 {grpc_message:"Deadline Exceeded", grpc_status:4, created_time:"2023-09-04T00:17:48.643109993+00:00"}"
  >
  
    warnings.warn(pytest.PytestUnhandledThreadExceptionWarning(msg))

apache_beam/transforms/sql_test.py::SqlTransformTest::test_windowing_before_sql
  <https://ci-beam.apache.org/job/beam_PostCommit_XVR_Direct/ws/src/build/gradleenv/1922375555/lib/python3.11/site-packages/_pytest/threadexception.py>:73: PytestUnhandledThreadExceptionWarning: Exception in thread wait_until_finish_read
  
  Traceback (most recent call last):
    File "/usr/lib/python3.11/threading.py", line 1038, in _bootstrap_inner
      self.run()
    File "/usr/lib/python3.11/threading.py", line 975, in run
      self._target(*self._args, **self._kwargs)
    File "<https://ci-beam.apache.org/job/beam_PostCommit_XVR_Direct/ws/src/sdks/python/apache_beam/runners/portability/portable_runner.py",> line 540, in read_messages
      for message in self._message_stream:
    File "<https://ci-beam.apache.org/job/beam_PostCommit_XVR_Direct/ws/src/build/gradleenv/1922375555/lib/python3.11/site-packages/grpc/_channel.py",> line 541, in __next__
      return self._next()
             ^^^^^^^^^^^^
    File "<https://ci-beam.apache.org/job/beam_PostCommit_XVR_Direct/ws/src/build/gradleenv/1922375555/lib/python3.11/site-packages/grpc/_channel.py",> line 967, in _next
      raise self
  grpc._channel._MultiThreadedRendezvous: <_MultiThreadedRendezvous of RPC that terminated with:
  	status = StatusCode.DEADLINE_EXCEEDED
  	details = "Deadline Exceeded"
  	debug_error_string = "UNKNOWN:Error received from peer ipv4:127.0.0.1:42669 {created_time:"2023-09-04T00:19:04.918041145+00:00", grpc_status:4, grpc_message:"Deadline Exceeded"}"
  >
  
    warnings.warn(pytest.PytestUnhandledThreadExceptionWarning(msg))

-- Docs: https://docs.pytest.org/en/stable/how-to/capture-warnings.html
- generated xml file: <https://ci-beam.apache.org/job/beam_PostCommit_XVR_Direct/ws/src/sdks/python/pytest_xlangSqlValidateRunner.xml> -
=========================== short test summary info ============================
FAILED apache_beam/transforms/sql_test.py::SqlTransformTest::test_tagged_join - grpc._channel._MultiThreadedRendezvous: <_MultiThreadedRendezvous of RPC that terminated with:
	status = StatusCode.DEADLINE_EXCEEDED
	details = "Deadline Exceeded"
	debug_error_string = "UNKNOWN:Error received from peer ipv4:127.0.0.1:42669 {created_time:"2023-09-04T00:17:48.642207706+00:00", grpc_status:4, grpc_message:"Deadline Exceeded"}"
>
FAILED apache_beam/transforms/sql_test.py::SqlTransformTest::test_windowing_before_sql - grpc._channel._MultiThreadedRendezvous: <_MultiThreadedRendezvous of RPC that terminated with:
	status = StatusCode.DEADLINE_EXCEEDED
	details = "Deadline Exceeded"
	debug_error_string = "UNKNOWN:Error received from peer ipv4:127.0.0.1:42669 {created_time:"2023-09-04T00:19:04.917145443+00:00", grpc_status:4, grpc_message:"Deadline Exceeded"}"
>
FAILED apache_beam/transforms/sql_test.py::SqlTransformTest::test_zetasql_generate_data - grpc._channel._MultiThreadedRendezvous: <_MultiThreadedRendezvous of RPC that terminated with:
	status = StatusCode.DEADLINE_EXCEEDED
	details = "Deadline Exceeded"
	debug_error_string = "UNKNOWN:Error received from peer ipv4:127.0.0.1:42669 {created_time:"2023-09-04T00:20:23.210103609+00:00", grpc_status:4, grpc_message:"Deadline Exceeded"}"
>
= 3 failed, 6 passed, 17 skipped, 7151 deselected, 57 warnings in 440.43s (0:07:20) =

> Task :sdks:python:test-suites:direct:xlang:validatesCrossLanguageRunnerPythonUsingSql FAILED

> Task :sdks:python:test-suites:direct:xlang:fnApiJobServerCleanup
Killing process at 211633

> Task :sdks:python:test-suites:direct:xlang:validatesCrossLanguageRunnerCleanup
Stopping expansion service pid: 212806.
Stopping expansion service pid: 212807.

FAILURE: Build failed with an exception.

* What went wrong:
Execution failed for task ':sdks:python:test-suites:direct:xlang:validatesCrossLanguageRunnerPythonUsingSql'.
> Process 'command 'sh'' finished with non-zero exit value 1

* Try:
> Run with --stacktrace option to get the stack trace.
> Run with --info or --debug option to get more log output.

* Get more help at https://help.gradle.org

Deprecated Gradle features were used in this build, making it incompatible with Gradle 8.0.

You can use '--warning-mode all' to show the individual deprecation warnings and determine if they come from your own scripts or plugins.

See https://docs.gradle.org/7.6.2/userguide/command_line_interface.html#sec:command_line_warnings

Execution optimizations have been disabled for 1 invalid unit(s) of work during this build to ensure correctness.
Please consult deprecation warnings for more details.

BUILD FAILED in 33m 39s
171 actionable tasks: 26 executed, 145 up-to-date

Publishing build scan...
https://ge.apache.org/s/xgmnupwgih6l2

Build step 'Invoke Gradle script' changed build result to FAILURE
Build step 'Invoke Gradle script' marked build as failure

---------------------------------------------------------------------
To unsubscribe, e-mail: builds-unsubscribe@beam.apache.org
For additional commands, e-mail: builds-help@beam.apache.org


Jenkins build is back to normal : beam_PostCommit_XVR_Direct #4558

Posted by Apache Jenkins Server <je...@builds.apache.org>.
See <https://ci-beam.apache.org/job/beam_PostCommit_XVR_Direct/4558/display/redirect>


---------------------------------------------------------------------
To unsubscribe, e-mail: builds-unsubscribe@beam.apache.org
For additional commands, e-mail: builds-help@beam.apache.org


Build failed in Jenkins: beam_PostCommit_XVR_Direct #4557

Posted by Apache Jenkins Server <je...@builds.apache.org>.
See <https://ci-beam.apache.org/job/beam_PostCommit_XVR_Direct/4557/display/redirect>

Changes:


------------------------------------------
[...truncated 2.48 MB...]
INFO     apache_beam.utils.subprocess_server:subprocess_server.py:126 INFO: Registering external transforms: [beam:external:java:sql:v1, beam:transform:org.apache.beam:pubsub_read:v1, beam:transform:org.apache.beam:pubsub_write:v1, beam:transform:org.apache.beam:pubsublite_write:v1, beam:transform:org.apache.beam:pubsublite_read:v1, beam:transform:org.apache.beam:spanner_insert:v1, beam:transform:org.apache.beam:spanner_update:v1, beam:transform:org.apache.beam:spanner_replace:v1, beam:transform:org.apache.beam:spanner_insert_or_update:v1, beam:transform:org.apache.beam:spanner_delete:v1, beam:transform:org.apache.beam:spanner_read:v1, beam:transform:org.apache.beam:kafka_read_with_metadata:v1, beam:transform:org.apache.beam:kafka_read_without_metadata:v1, beam:transform:org.apache.beam:kafka_write:v1, beam:external:java:generate_sequence:v1]
INFO     apache_beam.utils.subprocess_server:subprocess_server.py:126 
INFO     apache_beam.utils.subprocess_server:subprocess_server.py:126 Registered transforms:
INFO     apache_beam.utils.subprocess_server:subprocess_server.py:126 	beam:external:java:sql:v1: org.apache.beam.sdk.expansion.service.ExpansionService$ExternalTransformRegistrarLoader$1@3c46e67a
INFO     apache_beam.utils.subprocess_server:subprocess_server.py:126 	beam:transform:org.apache.beam:pubsub_read:v1: org.apache.beam.sdk.expansion.service.ExpansionService$ExternalTransformRegistrarLoader$1@c730b35
INFO     apache_beam.utils.subprocess_server:subprocess_server.py:126 	beam:transform:org.apache.beam:pubsub_write:v1: org.apache.beam.sdk.expansion.service.ExpansionService$ExternalTransformRegistrarLoader$1@206a70ef
INFO     apache_beam.utils.subprocess_server:subprocess_server.py:126 	beam:transform:org.apache.beam:pubsublite_write:v1: org.apache.beam.sdk.expansion.service.ExpansionService$ExternalTransformRegistrarLoader$1@292b08d6
INFO     apache_beam.utils.subprocess_server:subprocess_server.py:126 	beam:transform:org.apache.beam:pubsublite_read:v1: org.apache.beam.sdk.expansion.service.ExpansionService$ExternalTransformRegistrarLoader$1@22555ebf
INFO     apache_beam.utils.subprocess_server:subprocess_server.py:126 	beam:transform:org.apache.beam:spanner_insert:v1: org.apache.beam.sdk.expansion.service.ExpansionService$ExternalTransformRegistrarLoader$1@36ebc363
INFO     apache_beam.utils.subprocess_server:subprocess_server.py:126 	beam:transform:org.apache.beam:spanner_update:v1: org.apache.beam.sdk.expansion.service.ExpansionService$ExternalTransformRegistrarLoader$1@45752059
INFO     apache_beam.utils.subprocess_server:subprocess_server.py:126 	beam:transform:org.apache.beam:spanner_replace:v1: org.apache.beam.sdk.expansion.service.ExpansionService$ExternalTransformRegistrarLoader$1@34e9fd99
INFO     apache_beam.utils.subprocess_server:subprocess_server.py:126 	beam:transform:org.apache.beam:spanner_insert_or_update:v1: org.apache.beam.sdk.expansion.service.ExpansionService$ExternalTransformRegistrarLoader$1@3c41ed1d
INFO     apache_beam.utils.subprocess_server:subprocess_server.py:126 	beam:transform:org.apache.beam:spanner_delete:v1: org.apache.beam.sdk.expansion.service.ExpansionService$ExternalTransformRegistrarLoader$1@54d9d12d
INFO     apache_beam.utils.subprocess_server:subprocess_server.py:126 	beam:transform:org.apache.beam:spanner_read:v1: org.apache.beam.sdk.expansion.service.ExpansionService$ExternalTransformRegistrarLoader$1@38425407
INFO     apache_beam.utils.subprocess_server:subprocess_server.py:126 	beam:transform:org.apache.beam:kafka_read_with_metadata:v1: org.apache.beam.sdk.expansion.service.ExpansionService$ExternalTransformRegistrarLoader$1@43bc63a3
INFO     apache_beam.utils.subprocess_server:subprocess_server.py:126 	beam:transform:org.apache.beam:kafka_read_without_metadata:v1: org.apache.beam.sdk.expansion.service.ExpansionService$ExternalTransformRegistrarLoader$1@702657cc
INFO     apache_beam.utils.subprocess_server:subprocess_server.py:126 	beam:transform:org.apache.beam:kafka_write:v1: org.apache.beam.sdk.expansion.service.ExpansionService$ExternalTransformRegistrarLoader$1@6a6cb05c
INFO     apache_beam.utils.subprocess_server:subprocess_server.py:126 	beam:external:java:generate_sequence:v1: org.apache.beam.sdk.expansion.service.ExpansionService$ExternalTransformRegistrarLoader$1@40a4337a
INFO     apache_beam.utils.subprocess_server:subprocess_server.py:126 
INFO     apache_beam.utils.subprocess_server:subprocess_server.py:126 Registered SchemaTransformProviders:
INFO     apache_beam.utils.subprocess_server:subprocess_server.py:126 	beam:schematransform:org.apache.beam:spanner_cdc_read:v1
INFO     apache_beam.utils.subprocess_server:subprocess_server.py:126 	beam:schematransform:org.apache.beam:bigtable_write:v1
INFO     apache_beam.utils.subprocess_server:subprocess_server.py:126 	beam:schematransform:org.apache.beam:spanner_write:v1
INFO     apache_beam.utils.subprocess_server:subprocess_server.py:126 	beam:schematransform:org.apache.beam:pubsublite_read:v1
INFO     apache_beam.utils.subprocess_server:subprocess_server.py:126 	beam:schematransform:org.apache.beam:bigquery_storage_read:v1
INFO     apache_beam.utils.subprocess_server:subprocess_server.py:126 	beam:schematransform:org.apache.beam:bigquery_fileloads_write:v1
INFO     apache_beam.utils.subprocess_server:subprocess_server.py:126 	beam:schematransform:org.apache.beam:bigquery_export_read:v1
INFO     apache_beam.utils.subprocess_server:subprocess_server.py:126 	beam:schematransform:org.apache.beam:kafka_read:v1
INFO     apache_beam.utils.subprocess_server:subprocess_server.py:126 	beam:schematransform:org.apache.beam:kafka_write:v1
INFO     apache_beam.utils.subprocess_server:subprocess_server.py:126 	beam:schematransform:org.apache.beam:bigquery_storage_write:v1
INFO     apache_beam.utils.subprocess_server:subprocess_server.py:126 	schematransform:org.apache.beam:sql_transform:v1
INFO     apache_beam.utils.subprocess_server:subprocess_server.py:126 	beam:schematransform:org.apache.beam:pubsub_read:v1
INFO     apache_beam.utils.subprocess_server:subprocess_server.py:126 	beam:schematransform:org.apache.beam:pubsub_write:v1
INFO     apache_beam.utils.subprocess_server:subprocess_server.py:126 	beam:schematransform:org.apache.beam:bigtable_read:v1
INFO     apache_beam.utils.subprocess_server:subprocess_server.py:126 	beam:schematransform:org.apache.beam:pubsublite_write:v1
INFO     apache_beam.utils.subprocess_server:subprocess_server.py:126 Sep 04, 2023 12:19:11 PM org.apache.beam.sdk.expansion.service.ExpansionService expand
INFO     apache_beam.utils.subprocess_server:subprocess_server.py:126 INFO: Expanding 'SqlTransform(beam:external:java:sql:v1)' with URN 'beam:external:java:sql:v1'
INFO     apache_beam.utils.subprocess_server:subprocess_server.py:126 Dependencies list: {}
INFO     apache_beam.utils.subprocess_server:subprocess_server.py:126 Sep 04, 2023 12:19:12 PM org.apache.beam.sdk.expansion.service.ExpansionService$ExternalTransformRegistrarLoader payloadToConfig
INFO     apache_beam.utils.subprocess_server:subprocess_server.py:126 WARNING: Configuration class 'org.apache.beam.sdk.extensions.sql.expansion.ExternalSqlTransformRegistrar$Configuration' has no schema registered. Attempting to construct with setter approach.
INFO     apache_beam.utils.subprocess_server:subprocess_server.py:126 Sep 04, 2023 12:19:12 PM org.apache.beam.sdk.expansion.service.ExpansionService$ExternalTransformRegistrarLoader payloadToConfig
INFO     apache_beam.utils.subprocess_server:subprocess_server.py:126 WARNING: Configuration class 'org.apache.beam.sdk.extensions.sql.expansion.ExternalSqlTransformRegistrar$Configuration' has no schema registered. Attempting to construct with setter approach.
INFO     apache_beam.utils.subprocess_server:subprocess_server.py:126 Sep 04, 2023 12:19:14 PM org.apache.beam.sdk.extensions.sql.impl.CalciteQueryPlanner convertToBeamRel
INFO     apache_beam.utils.subprocess_server:subprocess_server.py:126 INFO: SQL:
INFO     apache_beam.utils.subprocess_server:subprocess_server.py:126 SELECT `PCOLLECTION`.`a` * `PCOLLECTION`.`a` AS `s`, `LENGTH`(`PCOLLECTION`.`b`) AS `c`
INFO     apache_beam.utils.subprocess_server:subprocess_server.py:126 FROM `beam`.`PCOLLECTION` AS `PCOLLECTION`
INFO     apache_beam.utils.subprocess_server:subprocess_server.py:126 Sep 04, 2023 12:19:14 PM org.apache.beam.sdk.extensions.sql.impl.CalciteQueryPlanner convertToBeamRel
INFO     apache_beam.utils.subprocess_server:subprocess_server.py:126 INFO: SQLPlan>
INFO     apache_beam.utils.subprocess_server:subprocess_server.py:126 LogicalProject(s=[*($0, $0)], c=[LENGTH($1)])
INFO     apache_beam.utils.subprocess_server:subprocess_server.py:126   BeamIOSourceRel(table=[[beam, PCOLLECTION]])
INFO     apache_beam.utils.subprocess_server:subprocess_server.py:126 
INFO     apache_beam.utils.subprocess_server:subprocess_server.py:126 Sep 04, 2023 12:19:14 PM org.apache.beam.sdk.extensions.sql.impl.CalciteQueryPlanner convertToBeamRel
INFO     apache_beam.utils.subprocess_server:subprocess_server.py:126 INFO: BEAMPlan>
INFO     apache_beam.utils.subprocess_server:subprocess_server.py:126 BeamCalcRel(expr#0..1=[{inputs}], expr#2=[*($t0, $t0)], expr#3=[LENGTH($t1)], s=[$t2], c=[$t3])
INFO     apache_beam.utils.subprocess_server:subprocess_server.py:126   BeamIOSourceRel(table=[[beam, PCOLLECTION]])
INFO     apache_beam.utils.subprocess_server:subprocess_server.py:126 
INFO     root:environments.py:317 No image given, using default Python SDK image
INFO     root:environments.py:320 Python SDK container image set to "apache/beam_python3.11_sdk:2.51.0.dev" for Docker environment
INFO     apache_beam.runners.portability.fn_api_runner.translations:translations.py:712 ==================== <function pack_combiners at 0x7f8bc1b98720> ====================
INFO     apache_beam.runners.portability.fn_api_runner.translations:translations.py:712 ==================== <function lift_combiners at 0x7f8bc1b987c0> ====================
INFO     apache_beam.runners.portability.fn_api_runner.translations:translations.py:712 ==================== <function sort_stages at 0x7f8bc1b98fe0> ====================
INFO     apache_beam.runners.portability.portable_runner:portable_runner.py:549 Job state changed to STOPPED
INFO     apache_beam.runners.portability.portable_runner:portable_runner.py:549 Job state changed to STARTING
INFO     apache_beam.runners.portability.portable_runner:portable_runner.py:549 Job state changed to RUNNING
INFO     root:portable_runner.py:542 ==================== <function annotate_downstream_side_inputs at 0x7f11788a1da0> ====================
INFO     root:portable_runner.py:542 ==================== <function fix_side_input_pcoll_coders at 0x7f11788a1ee0> ====================
INFO     root:portable_runner.py:542 ==================== <function pack_combiners at 0x7f11788a2480> ====================
INFO     root:portable_runner.py:542 ==================== <function lift_combiners at 0x7f11788a2520> ====================
INFO     root:portable_runner.py:542 ==================== <function expand_sdf at 0x7f11788a2700> ====================
INFO     root:portable_runner.py:542 ==================== <function expand_gbk at 0x7f11788a27a0> ====================
INFO     root:portable_runner.py:542 ==================== <function sink_flattens at 0x7f11788a28e0> ====================
INFO     root:portable_runner.py:542 ==================== <function greedily_fuse at 0x7f11788a2980> ====================
INFO     root:portable_runner.py:542 ==================== <function read_to_impulse at 0x7f11788a2a20> ====================
INFO     root:portable_runner.py:542 ==================== <function impulse_to_input at 0x7f11788a2ac0> ====================
INFO     root:portable_runner.py:542 ==================== <function sort_stages at 0x7f11788a2d40> ====================
INFO     root:portable_runner.py:542 ==================== <function add_impulse_to_dangling_transforms at 0x7f11788a2e80> ====================
INFO     root:portable_runner.py:542 ==================== <function setup_timer_mapping at 0x7f11788a2ca0> ====================
INFO     root:portable_runner.py:542 ==================== <function populate_data_channel_coders at 0x7f11788a2de0> ====================
INFO     root:portable_runner.py:542 starting control server on port 39491
INFO     root:portable_runner.py:542 starting data server on port 45785
INFO     root:portable_runner.py:542 starting state server on port 38801
INFO     root:portable_runner.py:542 starting logging server on port 42735
INFO     root:portable_runner.py:542 Created Worker handler <apache_beam.runners.portability.fn_api_runner.worker_handlers.DockerSdkWorkerHandler object at 0x7f117448c450> for environment ref_Environment_default_environment_2 (beam:env:docker:v1, b'\n%apache/beam_python3.11_sdk:2.51.0.dev')
INFO     root:portable_runner.py:542 Attempting to pull image apache/beam_python3.11_sdk:2.51.0.dev
INFO     root:portable_runner.py:542 Unable to pull image apache/beam_python3.11_sdk:2.51.0.dev, defaulting to local image if it exists
INFO     root:portable_runner.py:542 Waiting for docker to start up. Current status is running
INFO     root:portable_runner.py:542 Docker container is running. container_id = b'd767b4eef7e05e848f31c6676653570a974ebd3624fec7d7042699d4d453f49c', worker_id = worker_56
=============================== warnings summary ===============================
../../build/gradleenv/1922375555/lib/python3.11/site-packages/hdfs/config.py:28
  <https://ci-beam.apache.org/job/beam_PostCommit_XVR_Direct/ws/src/build/gradleenv/1922375555/lib/python3.11/site-packages/hdfs/config.py>:28: DeprecationWarning: the imp module is deprecated in favour of importlib and slated for removal in Python 3.12; see the module's documentation for alternative uses
    from imp import load_source

../../build/gradleenv/1922375555/lib/python3.11/site-packages/google/rpc/__init__.py:18
  <https://ci-beam.apache.org/job/beam_PostCommit_XVR_Direct/ws/src/build/gradleenv/1922375555/lib/python3.11/site-packages/google/rpc/__init__.py>:18: DeprecationWarning: pkg_resources is deprecated as an API. See https://setuptools.pypa.io/en/latest/pkg_resources.html
    import pkg_resources

../../build/gradleenv/1922375555/lib/python3.11/site-packages/pkg_resources/__init__.py:2871: 20 warnings
  <https://ci-beam.apache.org/job/beam_PostCommit_XVR_Direct/ws/src/build/gradleenv/1922375555/lib/python3.11/site-packages/pkg_resources/__init__.py>:2871: DeprecationWarning: Deprecated call to `pkg_resources.declare_namespace('google')`.
  Implementing implicit namespace packages (as specified in PEP 420) is preferred to `pkg_resources.declare_namespace`. See https://setuptools.pypa.io/en/latest/references/keywords.html#keyword-namespace-packages
    declare_namespace(pkg)

../../build/gradleenv/1922375555/lib/python3.11/site-packages/pkg_resources/__init__.py:2871: 16 warnings
  <https://ci-beam.apache.org/job/beam_PostCommit_XVR_Direct/ws/src/build/gradleenv/1922375555/lib/python3.11/site-packages/pkg_resources/__init__.py>:2871: DeprecationWarning: Deprecated call to `pkg_resources.declare_namespace('google.cloud')`.
  Implementing implicit namespace packages (as specified in PEP 420) is preferred to `pkg_resources.declare_namespace`. See https://setuptools.pypa.io/en/latest/references/keywords.html#keyword-namespace-packages
    declare_namespace(pkg)

../../build/gradleenv/1922375555/lib/python3.11/site-packages/pkg_resources/__init__.py:2350
../../build/gradleenv/1922375555/lib/python3.11/site-packages/pkg_resources/__init__.py:2350
../../build/gradleenv/1922375555/lib/python3.11/site-packages/pkg_resources/__init__.py:2350
../../build/gradleenv/1922375555/lib/python3.11/site-packages/pkg_resources/__init__.py:2350
  <https://ci-beam.apache.org/job/beam_PostCommit_XVR_Direct/ws/src/build/gradleenv/1922375555/lib/python3.11/site-packages/pkg_resources/__init__.py>:2350: DeprecationWarning: Deprecated call to `pkg_resources.declare_namespace('google')`.
  Implementing implicit namespace packages (as specified in PEP 420) is preferred to `pkg_resources.declare_namespace`. See https://setuptools.pypa.io/en/latest/references/keywords.html#keyword-namespace-packages
    declare_namespace(parent)

../../build/gradleenv/1922375555/lib/python3.11/site-packages/pkg_resources/__init__.py:2871
  <https://ci-beam.apache.org/job/beam_PostCommit_XVR_Direct/ws/src/build/gradleenv/1922375555/lib/python3.11/site-packages/pkg_resources/__init__.py>:2871: DeprecationWarning: Deprecated call to `pkg_resources.declare_namespace('google.logging')`.
  Implementing implicit namespace packages (as specified in PEP 420) is preferred to `pkg_resources.declare_namespace`. See https://setuptools.pypa.io/en/latest/references/keywords.html#keyword-namespace-packages
    declare_namespace(pkg)

../../build/gradleenv/1922375555/lib/python3.11/site-packages/pkg_resources/__init__.py:2871
  <https://ci-beam.apache.org/job/beam_PostCommit_XVR_Direct/ws/src/build/gradleenv/1922375555/lib/python3.11/site-packages/pkg_resources/__init__.py>:2871: DeprecationWarning: Deprecated call to `pkg_resources.declare_namespace('google.iam')`.
  Implementing implicit namespace packages (as specified in PEP 420) is preferred to `pkg_resources.declare_namespace`. See https://setuptools.pypa.io/en/latest/references/keywords.html#keyword-namespace-packages
    declare_namespace(pkg)

../../build/gradleenv/1922375555/lib/python3.11/site-packages/google/rpc/__init__.py:20
  <https://ci-beam.apache.org/job/beam_PostCommit_XVR_Direct/ws/src/build/gradleenv/1922375555/lib/python3.11/site-packages/google/rpc/__init__.py>:20: DeprecationWarning: Deprecated call to `pkg_resources.declare_namespace('google.rpc')`.
  Implementing implicit namespace packages (as specified in PEP 420) is preferred to `pkg_resources.declare_namespace`. See https://setuptools.pypa.io/en/latest/references/keywords.html#keyword-namespace-packages
    pkg_resources.declare_namespace(__name__)

../../build/gradleenv/1922375555/lib/python3.11/site-packages/google/api_core/operations_v1/abstract_operations_client.py:17
  <https://ci-beam.apache.org/job/beam_PostCommit_XVR_Direct/ws/src/build/gradleenv/1922375555/lib/python3.11/site-packages/google/api_core/operations_v1/abstract_operations_client.py>:17: DeprecationWarning: The distutils package is deprecated and slated for removal in Python 3.12. Use setuptools or check PEP 632 for potential alternatives
    from distutils import util

apache_beam/transforms/sql_test.py::SqlTransformTest::test_agg
apache_beam/transforms/sql_test.py::SqlTransformTest::test_filter
apache_beam/transforms/sql_test.py::SqlTransformTest::test_generate_data
apache_beam/transforms/sql_test.py::SqlTransformTest::test_map
apache_beam/transforms/sql_test.py::SqlTransformTest::test_project
apache_beam/transforms/sql_test.py::SqlTransformTest::test_row
apache_beam/transforms/sql_test.py::SqlTransformTest::test_tagged_join
apache_beam/transforms/sql_test.py::SqlTransformTest::test_windowing_before_sql
apache_beam/transforms/sql_test.py::SqlTransformTest::test_zetasql_generate_data
  <https://ci-beam.apache.org/job/beam_PostCommit_XVR_Direct/ws/src/sdks/python/apache_beam/transforms/external.py>:679: BeamDeprecationWarning: options is deprecated since First stable release. References to <pipeline>.options will not be supported
    self._expansion_service, pipeline.options)

apache_beam/transforms/sql_test.py::SqlTransformTest::test_generate_data
  <https://ci-beam.apache.org/job/beam_PostCommit_XVR_Direct/ws/src/build/gradleenv/1922375555/lib/python3.11/site-packages/_pytest/threadexception.py>:73: PytestUnhandledThreadExceptionWarning: Exception in thread wait_until_finish_read
  
  Traceback (most recent call last):
    File "/usr/lib/python3.11/threading.py", line 1038, in _bootstrap_inner
      self.run()
    File "/usr/lib/python3.11/threading.py", line 975, in run
      self._target(*self._args, **self._kwargs)
    File "<https://ci-beam.apache.org/job/beam_PostCommit_XVR_Direct/ws/src/sdks/python/apache_beam/runners/portability/portable_runner.py",> line 540, in read_messages
      for message in self._message_stream:
    File "<https://ci-beam.apache.org/job/beam_PostCommit_XVR_Direct/ws/src/build/gradleenv/1922375555/lib/python3.11/site-packages/grpc/_channel.py",> line 541, in __next__
      return self._next()
             ^^^^^^^^^^^^
    File "<https://ci-beam.apache.org/job/beam_PostCommit_XVR_Direct/ws/src/build/gradleenv/1922375555/lib/python3.11/site-packages/grpc/_channel.py",> line 967, in _next
      raise self
  grpc._channel._MultiThreadedRendezvous: <_MultiThreadedRendezvous of RPC that terminated with:
  	status = StatusCode.DEADLINE_EXCEEDED
  	details = "Deadline Exceeded"
  	debug_error_string = "UNKNOWN:Error received from peer ipv4:127.0.0.1:36405 {grpc_message:"Deadline Exceeded", grpc_status:4, created_time:"2023-09-04T12:17:13.851032309+00:00"}"
  >
  
    warnings.warn(pytest.PytestUnhandledThreadExceptionWarning(msg))

apache_beam/transforms/sql_test.py::SqlTransformTest::test_map
  <https://ci-beam.apache.org/job/beam_PostCommit_XVR_Direct/ws/src/build/gradleenv/1922375555/lib/python3.11/site-packages/_pytest/threadexception.py>:73: PytestUnhandledThreadExceptionWarning: Exception in thread wait_until_finish_read
  
  Traceback (most recent call last):
    File "/usr/lib/python3.11/threading.py", line 1038, in _bootstrap_inner
      self.run()
    File "/usr/lib/python3.11/threading.py", line 975, in run
      self._target(*self._args, **self._kwargs)
    File "<https://ci-beam.apache.org/job/beam_PostCommit_XVR_Direct/ws/src/sdks/python/apache_beam/runners/portability/portable_runner.py",> line 540, in read_messages
      for message in self._message_stream:
    File "<https://ci-beam.apache.org/job/beam_PostCommit_XVR_Direct/ws/src/build/gradleenv/1922375555/lib/python3.11/site-packages/grpc/_channel.py",> line 541, in __next__
      return self._next()
             ^^^^^^^^^^^^
    File "<https://ci-beam.apache.org/job/beam_PostCommit_XVR_Direct/ws/src/build/gradleenv/1922375555/lib/python3.11/site-packages/grpc/_channel.py",> line 967, in _next
      raise self
  grpc._channel._MultiThreadedRendezvous: <_MultiThreadedRendezvous of RPC that terminated with:
  	status = StatusCode.DEADLINE_EXCEEDED
  	details = "Deadline Exceeded"
  	debug_error_string = "UNKNOWN:Error received from peer ipv4:127.0.0.1:36405 {grpc_message:"Deadline Exceeded", grpc_status:4, created_time:"2023-09-04T12:18:27.0470803+00:00"}"
  >
  
    warnings.warn(pytest.PytestUnhandledThreadExceptionWarning(msg))

-- Docs: https://docs.pytest.org/en/stable/how-to/capture-warnings.html
- generated xml file: <https://ci-beam.apache.org/job/beam_PostCommit_XVR_Direct/ws/src/sdks/python/pytest_xlangSqlValidateRunner.xml> -
=========================== short test summary info ============================
FAILED apache_beam/transforms/sql_test.py::SqlTransformTest::test_generate_data - grpc._channel._MultiThreadedRendezvous: <_MultiThreadedRendezvous of RPC that terminated with:
	status = StatusCode.DEADLINE_EXCEEDED
	details = "Deadline Exceeded"
	debug_error_string = "UNKNOWN:Error received from peer ipv4:127.0.0.1:36405 {grpc_message:"Deadline Exceeded", grpc_status:4, created_time:"2023-09-04T12:17:13.850119673+00:00"}"
>
FAILED apache_beam/transforms/sql_test.py::SqlTransformTest::test_map - grpc._channel._MultiThreadedRendezvous: <_MultiThreadedRendezvous of RPC that terminated with:
	status = StatusCode.DEADLINE_EXCEEDED
	details = "Deadline Exceeded"
	debug_error_string = "UNKNOWN:Error received from peer ipv4:127.0.0.1:36405 {created_time:"2023-09-04T12:18:27.045164187+00:00", grpc_status:4, grpc_message:"Deadline Exceeded"}"
>
FAILED apache_beam/transforms/sql_test.py::SqlTransformTest::test_row - grpc._channel._MultiThreadedRendezvous: <_MultiThreadedRendezvous of RPC that terminated with:
	status = StatusCode.DEADLINE_EXCEEDED
	details = "Deadline Exceeded"
	debug_error_string = "UNKNOWN:Error received from peer ipv4:127.0.0.1:36405 {created_time:"2023-09-04T12:20:22.890150741+00:00", grpc_status:4, grpc_message:"Deadline Exceeded"}"
>
= 3 failed, 6 passed, 17 skipped, 7151 deselected, 57 warnings in 430.65s (0:07:10) =

> Task :sdks:python:test-suites:direct:xlang:validatesCrossLanguageRunnerPythonUsingSql FAILED

> Task :sdks:python:test-suites:direct:xlang:fnApiJobServerCleanup
Killing process at 666584

> Task :sdks:python:test-suites:direct:xlang:validatesCrossLanguageRunnerCleanup
Stopping expansion service pid: 667361.
Stopping expansion service pid: 667362.

FAILURE: Build failed with an exception.

* What went wrong:
Execution failed for task ':sdks:python:test-suites:direct:xlang:validatesCrossLanguageRunnerPythonUsingSql'.
> Process 'command 'sh'' finished with non-zero exit value 1

* Try:
> Run with --stacktrace option to get the stack trace.
> Run with --info or --debug option to get more log output.

* Get more help at https://help.gradle.org

Deprecated Gradle features were used in this build, making it incompatible with Gradle 8.0.

You can use '--warning-mode all' to show the individual deprecation warnings and determine if they come from your own scripts or plugins.

See https://docs.gradle.org/7.6.2/userguide/command_line_interface.html#sec:command_line_warnings

Execution optimizations have been disabled for 1 invalid unit(s) of work during this build to ensure correctness.
Please consult deprecation warnings for more details.

BUILD FAILED in 34m 9s
171 actionable tasks: 26 executed, 145 up-to-date

Publishing build scan...
https://ge.apache.org/s/zeef56z5l7y2s

Build step 'Invoke Gradle script' changed build result to FAILURE
Build step 'Invoke Gradle script' marked build as failure

---------------------------------------------------------------------
To unsubscribe, e-mail: builds-unsubscribe@beam.apache.org
For additional commands, e-mail: builds-help@beam.apache.org


Build failed in Jenkins: beam_PostCommit_XVR_Direct #4556

Posted by Apache Jenkins Server <je...@builds.apache.org>.
See <https://ci-beam.apache.org/job/beam_PostCommit_XVR_Direct/4556/display/redirect>

Changes:


------------------------------------------
[...truncated 123.33 KB...]

#20 [16/16] COPY target/profiler/* /opt/google_cloud_profiler/
#20 DONE 0.9s

#21 exporting to image
#21 exporting layers
#21 exporting layers 0.6s done
#21 writing image sha256:479eb4a26975f3987f9978e4abb5bc1db1b573b5e1534f13cfc77bdd7c7ba923 done
#21 naming to docker.io/apache/beam_java8_sdk:2.51.0.dev done
#21 DONE 0.6s

> Task :release:go-licenses:py:createLicenses
> Task :sdks:python:container:py38:copyGolangLicenses
> Task :sdks:python:container:py38:dockerPrepare

> Task :sdks:python:container:py38:docker FAILED
#1 [internal] load build definition from Dockerfile
#1 transferring dockerfile: 4.99kB done
#1 DONE 0.0s

#2 [internal] load .dockerignore
#2 transferring context: 2B done
#2 DONE 0.0s

#3 [internal] load metadata for docker.io/library/python:3.8-bullseye
#3 DONE 0.3s

#4 [beam 1/5] FROM docker.io/library/python:3.8-bullseye@sha256:7482ccf7b8ad5e5ada830a315d051b166d83f84c281e76508762505cf929c385
#4 resolve docker.io/library/python:3.8-bullseye@sha256:7482ccf7b8ad5e5ada830a315d051b166d83f84c281e76508762505cf929c385 0.0s done
#4 CACHED

#5 [internal] load build context
#5 transferring context: 2.45MB 0.0s done
#5 DONE 0.1s

#6 [beam 2/5] COPY target/base_image_requirements.txt /tmp/base_image_requirements.txt
#6 CACHED

#7 [beam 3/5] COPY target/apache-beam.tar.gz /opt/apache/beam/tars/
#7 CACHED

#8 [beam 4/5] COPY target/launcher/linux_amd64/boot target/LICENSE target/NOTICE target/LICENSE.python /opt/apache/beam/
#8 ERROR: "/target/launcher/linux_amd64/boot" not found: not found
------
 > [beam 4/5] COPY target/launcher/linux_amd64/boot target/LICENSE target/NOTICE target/LICENSE.python /opt/apache/beam/:
------
ERROR: failed to solve: failed to compute cache key: "/target/launcher/linux_amd64/boot" not found: not found

> Task :sdks:python:installGcpTest
Using cached scikit_learn-1.3.0-cp38-cp38-manylinux_2_17_x86_64.manylinux2014_x86_64.whl (11.1 MB)
Using cached SQLAlchemy-1.4.49-cp38-cp38-manylinux_2_5_x86_64.manylinux1_x86_64.manylinux_2_17_x86_64.manylinux2014_x86_64.whl (1.6 MB)
Using cached tenacity-8.2.3-py3-none-any.whl (24 kB)
Using cached botocore-1.31.40-py3-none-any.whl (11.2 MB)
Using cached certifi-2023.7.22-py3-none-any.whl (158 kB)
Using cached charset_normalizer-3.2.0-cp38-cp38-manylinux_2_17_x86_64.manylinux2014_x86_64.whl (199 kB)
Using cached dnspython-2.4.2-py3-none-any.whl (300 kB)
Using cached docker-6.1.3-py3-none-any.whl (148 kB)
Using cached exceptiongroup-1.1.3-py3-none-any.whl (14 kB)
Using cached execnet-2.0.2-py3-none-any.whl (37 kB)
Using cached google_cloud_resource_manager-1.10.3-py2.py3-none-any.whl (320 kB)
Using cached google_cloud_storage-2.10.0-py2.py3-none-any.whl (114 kB)
Using cached googleapis_common_protos-1.60.0-py2.py3-none-any.whl (227 kB)
Using cached greenlet-3.0.0rc1-cp38-cp38-manylinux_2_17_x86_64.manylinux2014_x86_64.whl (615 kB)
Using cached grpcio_status-1.58.0rc1-py3-none-any.whl (14 kB)
Using cached msal-1.24.0b1-py2.py3-none-any.whl (90 kB)
Using cached pyparsing-3.1.1-py3-none-any.whl (103 kB)
Using cached s3transfer-0.6.2-py3-none-any.whl (79 kB)
Using cached threadpoolctl-3.2.0-py3-none-any.whl (15 kB)
Using cached urllib3-1.26.16-py2.py3-none-any.whl (143 kB)
Using cached PyMySQL-1.1.0-py3-none-any.whl (44 kB)
Using cached websocket_client-1.6.2-py3-none-any.whl (57 kB)
Using cached PyJWT-2.8.0-py3-none-any.whl (22 kB)
Building wheels for collected packages: apache-beam
  Building wheel for apache-beam (setup.py): started

> Task :sdks:java:extensions:sql:expansion-service:shadowJar

> Task :release:go-licenses:go:dockerRun
cloud.google.com/go/compute/metadata,https://github.com/googleapis/google-cloud-go/blob/compute/metadata/v0.2.3/compute/metadata/LICENSE,Apache-2.0
cloud.google.com/go/iam,https://github.com/googleapis/google-cloud-go/blob/iam/v1.1.1/iam/LICENSE,Apache-2.0
cloud.google.com/go/internal,https://github.com/googleapis/google-cloud-go/blob/v0.110.4/LICENSE,Apache-2.0
cloud.google.com/go/storage,https://github.com/googleapis/google-cloud-go/blob/storage/v1.31.0/storage/LICENSE,Apache-2.0
github.com/apache/beam/sdks/v2/go,https://github.com/apache/beam/blob/sdks/v2.50.0/sdks/go/README.md,Apache-2.0
github.com/golang/groupcache/lru,https://github.com/golang/groupcache/blob/41bb18bfe9da/LICENSE,Apache-2.0
github.com/golang/protobuf,https://github.com/golang/protobuf/blob/v1.5.3/LICENSE,BSD-3-Clause
github.com/google/go-cmp/cmp,https://github.com/google/go-cmp/blob/v0.5.9/LICENSE,BSD-3-Clause
github.com/google/s2a-go,https://github.com/google/s2a-go/blob/v0.1.4/LICENSE.md,Apache-2.0
github.com/google/uuid,https://github.com/google/uuid/blob/v1.3.0/LICENSE,BSD-3-Clause
github.com/googleapis/enterprise-certificate-proxy/client,https://github.com/googleapis/enterprise-certificate-proxy/blob/v0.2.5/LICENSE,Apache-2.0
github.com/googleapis/gax-go/v2,https://github.com/googleapis/gax-go/blob/v2.12.0/v2/LICENSE,BSD-3-Clause
go.opencensus.io,https://github.com/census-instrumentation/opencensus-go/blob/v0.24.0/LICENSE,Apache-2.0
golang.org/x/crypto,https://cs.opensource.google/go/x/crypto/+/v0.12.0:LICENSE,BSD-3-Clause
golang.org/x/net,https://cs.opensource.google/go/x/net/+/v0.14.0:LICENSE,BSD-3-Clause
golang.org/x/oauth2,https://cs.opensource.google/go/x/oauth2/+/v0.11.0:LICENSE,BSD-3-Clause
golang.org/x/sync/semaphore,https://cs.opensource.google/go/x/sync/+/v0.3.0:LICENSE,BSD-3-Clause
golang.org/x/sys,https://cs.opensource.google/go/x/sys/+/v0.11.0:LICENSE,BSD-3-Clause
golang.org/x/text,https://cs.opensource.google/go/x/text/+/v0.12.0:LICENSE,BSD-3-Clause
golang.org/x/xerrors,https://cs.opensource.google/go/x/xerrors/+/04be3eba:LICENSE,BSD-3-Clause
google.golang.org/api,https://github.com/googleapis/google-api-go-client/blob/v0.135.0/LICENSE,BSD-3-Clause
google.golang.org/api/internal/third_party/uritemplates,https://github.com/googleapis/google-api-go-client/blob/v0.135.0/internal/third_party/uritemplates/LICENSE,BSD-3-Clause
google.golang.org/appengine,https://github.com/golang/appengine/blob/v1.6.7/LICENSE,Apache-2.0
google.golang.org/genproto/googleapis/api,https://github.com/googleapis/go-genproto/blob/ccb25ca9f130/googleapis/api/LICENSE,Apache-2.0
google.golang.org/genproto/googleapis/rpc,https://github.com/googleapis/go-genproto/blob/23370e0ffb3e/googleapis/rpc/LICENSE,Apache-2.0
google.golang.org/genproto/googleapis/type,https://github.com/googleapis/go-genproto/blob/ccb25ca9f130/LICENSE,Apache-2.0
google.golang.org/grpc,https://github.com/grpc/grpc-go/blob/v1.57.0/LICENSE,Apache-2.0
google.golang.org/protobuf,https://github.com/protocolbuffers/protobuf-go/blob/v1.31.0/LICENSE,BSD-3-Clause
+ chmod -R a+w /output/licenses

> Task :release:go-licenses:go:createLicenses
> Task :sdks:go:container:copyGolangLicenses

> Task :sdks:python:installGcpTest
  Building wheel for apache-beam (setup.py): finished with status 'done'
  Created wheel for apache-beam: filename=apache_beam-2.51.0.dev0-py3-none-any.whl size=3299113 sha256=44e1ca4bb991bd0ea615a2fb6e84fe4ec751b5406b2f13bab091a3cbbafcf128
  Stored in directory: /home/jenkins/.cache/pip/wheels/c0/01/10/5a028b724cdf5b5d2643067a82afc4660de8e5639d060da291
Successfully built apache-beam
Installing collected packages: sortedcontainers, pytz, docopt, crcmod, zstandard, wrapt, websocket-client, urllib3, threadpoolctl, tenacity, sqlparse, six, shapely, scipy, regex, pyyaml, pyparsing, pymysql, PyJWT, pyhamcrest, pycparser, pyasn1, pyarrow, psycopg2-binary, protobuf, portalocker, parameterized, overrides, orjson, objsize, mock, joblib, jmespath, iniconfig, idna, greenlet, google-crc32c, fasteners, fastavro, execnet, exceptiongroup, dnspython, dill, deprecation, cloudpickle, charset-normalizer, certifi, attrs, sqlalchemy, scikit-learn, rsa, requests, python-dateutil, pytest, pymongo, pydot, pyasn1-modules, proto-plus, isodate, hypothesis, httplib2, googleapis-common-protos, google-resumable-media, cffi, requests_mock, pytest-xdist, pytest-timeout, pandas, oauth2client, hdfs, grpcio-status, google-auth, freezegun, docker, cryptography, botocore, azure-core, testcontainers, s3transfer, grpc-google-iam-v1, google-auth-httplib2, google-apitools, google-api-core, azure-storage-blob, apache-beam, msal, google-cloud-core, boto3, msal-extensions, google-cloud-vision, google-cloud-videointelligence, google-cloud-storage, google-cloud-spanner, google-cloud-resource-manager, google-cloud-recommendations-ai, google-cloud-pubsub, google-cloud-language, google-cloud-dlp, google-cloud-datastore, google-cloud-bigtable, google-cloud-bigquery-storage, google-cloud-bigquery, google-cloud-pubsublite, google-cloud-aiplatform, azure-identity

> Task :sdks:go:container:dockerPrepare
> Task :sdks:java:extensions:sql:expansion-service:shadowJar FROM-CACHE
> Task :sdks:java:io:google-cloud-platform:expansion-service:analyzeClassesDependencies FROM-CACHE
> Task :sdks:java:io:google-cloud-platform:expansion-service:analyzeTestClassesDependencies SKIPPED
> Task :sdks:java:io:google-cloud-platform:expansion-service:analyzeDependencies UP-TO-DATE
> Task :sdks:java:io:google-cloud-platform:expansion-service:checkstyleMain NO-SOURCE
> Task :sdks:java:io:google-cloud-platform:expansion-service:checkstyleTest NO-SOURCE
> Task :sdks:java:io:google-cloud-platform:expansion-service:javadoc NO-SOURCE
> Task :sdks:java:io:google-cloud-platform:expansion-service:spotbugsMain NO-SOURCE
> Task :sdks:java:io:google-cloud-platform:expansion-service:spotbugsTest SKIPPED
> Task :sdks:java:io:google-cloud-platform:expansion-service:test NO-SOURCE
> Task :sdks:java:io:google-cloud-platform:expansion-service:check UP-TO-DATE
> Task :sdks:java:io:google-cloud-platform:expansion-service:build

> Task :sdks:go:container:docker
#1 [internal] load build definition from Dockerfile
#1 transferring dockerfile: 1.70kB done
#1 DONE 0.0s

#2 [internal] load .dockerignore
#2 transferring context: 2B done
#2 DONE 0.0s

#3 [internal] load metadata for docker.io/library/debian:bullseye
#3 DONE 0.3s

#4 [1/7] FROM docker.io/library/debian:bullseye@sha256:1beb7cf458bdfe71b5220cb2069eb45e3fc7eb77a1ccfb169eaebf5f6c4809ab
#4 CACHED

#5 [internal] load build context
#5 transferring context: 24.28MB 0.3s done
#5 DONE 0.3s

#6 [2/7] RUN apt-get update &&     DEBIAN_FRONTEND=noninteractive apt-get install -y         ca-certificates         &&     rm -rf /var/lib/apt/lists/*
#6 0.960 Get:1 http://deb.debian.org/debian bullseye InRelease [116 kB]
#6 1.022 Get:2 http://deb.debian.org/debian-security bullseye-security InRelease [48.4 kB]
#6 1.045 Get:3 http://deb.debian.org/debian bullseye-updates InRelease [44.1 kB]
#6 1.227 Get:4 http://deb.debian.org/debian bullseye/main amd64 Packages [8183 kB]
#6 1.426 Get:5 http://deb.debian.org/debian-security bullseye-security/main amd64 Packages [245 kB]
#6 1.472 Get:6 http://deb.debian.org/debian bullseye-updates/main amd64 Packages [17.5 kB]
#6 2.790 Fetched 8653 kB in 2s (4483 kB/s)
#6 2.790 Reading package lists...
#6 3.489 Reading package lists...
#6 4.154 Building dependency tree...
#6 4.325 Reading state information...
#6 4.500 The following additional packages will be installed:
#6 4.500   openssl
#6 4.527 The following NEW packages will be installed:
#6 4.528   ca-certificates openssl
#6 4.613 0 upgraded, 2 newly installed, 0 to remove and 0 not upgraded.
#6 4.613 Need to get 1012 kB of archives.
#6 4.613 After this operation, 1892 kB of additional disk space will be used.
#6 4.613 Get:1 http://deb.debian.org/debian-security bullseye-security/main amd64 openssl amd64 1.1.1n-0+deb11u5 [854 kB]
#6 4.786 Get:2 http://deb.debian.org/debian bullseye/main amd64 ca-certificates all 20210119 [158 kB]
#6 5.140 debconf: delaying package configuration, since apt-utils is not installed
#6 5.219 Fetched 1012 kB in 0s (3975 kB/s)
#6 5.531 Selecting previously unselected package openssl.
#6 5.531 (Reading database ... (Reading database ... 5%(Reading database ... 10%(Reading database ... 15%(Reading database ... 20%(Reading database ... 25%(Reading database ... 30%(Reading database ... 35%(Reading database ... 40%(Reading database ... 45%(Reading database ... 50%(Reading database ... 55%(Reading database ... 60%(Reading database ... 65%(Reading database ... 70%(Reading database ... 75%(Reading database ... 80%(Reading database ... 85%(Reading database ... 90%(Reading database ... 95%(Reading database ... 100%(Reading database ... 6664 files and directories currently installed.)
#6 5.545 Preparing to unpack .../openssl_1.1.1n-0+deb11u5_amd64.deb ...
#6 5.556 Unpacking openssl (1.1.1n-0+deb11u5) ...
#6 6.082 Selecting previously unselected package ca-certificates.
#6 6.083 Preparing to unpack .../ca-certificates_20210119_all.deb ...
#6 6.087 Unpacking ca-certificates (20210119) ...
#6 6.158 Setting up openssl (1.1.1n-0+deb11u5) ...
#6 6.177 Setting up ca-certificates (20210119) ...
#6 6.982 Updating certificates in /etc/ssl/certs...
#6 7.724 129 added, 0 removed; done.
#6 7.789 Processing triggers for ca-certificates (20210119) ...
#6 7.799 Updating certificates in /etc/ssl/certs...
#6 8.353 0 added, 0 removed; done.
#6 8.353 Running hooks in /etc/ca-certificates/update.d...
#6 8.356 done.
#6 DONE 12.9s

#7 [3/7] ADD target/linux_amd64/boot /opt/apache/beam/
#7 DONE 0.4s

#8 [4/7] COPY target/LICENSE /opt/apache/beam/
#8 DONE 0.2s

#9 [5/7] COPY target/NOTICE /opt/apache/beam/
#9 DONE 0.1s

#10 [6/7] COPY target/go-licenses/* /opt/apache/beam/third_party_licenses/golang/
#10 DONE 0.2s

#11 [7/7] RUN if [ "true" = "false" ] ; then     rm -rf /opt/apache/beam/third_party_licenses ;    fi
#11 DONE 0.4s

#12 exporting to image
#12 exporting layers
#12 exporting layers 0.2s done
#12 writing image sha256:eacfd195676fea5ed7613af8cc4aae9410da18f2eaf13a0912d98918d0246862 done
#12 naming to docker.io/apache/beam_go_sdk:latest done
#12 DONE 0.2s

> Task :sdks:python:installGcpTest
Successfully installed PyJWT-2.8.0 apache-beam-2.51.0.dev0 attrs-23.1.0 azure-core-1.29.3 azure-identity-1.14.0 azure-storage-blob-12.18.0b1 boto3-1.28.40 botocore-1.31.40 certifi-2023.7.22 cffi-1.15.1 charset-normalizer-3.2.0 cloudpickle-2.2.1 crcmod-1.7 cryptography-41.0.3 deprecation-2.1.0 dill-0.3.1.1 dnspython-2.4.2 docker-6.1.3 docopt-0.6.2 exceptiongroup-1.1.3 execnet-2.0.2 fastavro-1.8.2 fasteners-0.18 freezegun-1.2.2 google-api-core-2.12.0.dev1 google-apitools-0.5.31 google-auth-2.22.0 google-auth-httplib2-0.1.0 google-cloud-aiplatform-1.31.1 google-cloud-bigquery-3.11.4 google-cloud-bigquery-storage-2.22.0 google-cloud-bigtable-2.21.0 google-cloud-core-2.3.3 google-cloud-datastore-2.17.0 google-cloud-dlp-3.12.2 google-cloud-language-2.11.0 google-cloud-pubsub-2.18.3 google-cloud-pubsublite-1.8.3 google-cloud-recommendations-ai-0.10.4 google-cloud-resource-manager-1.10.3 google-cloud-spanner-3.40.1 google-cloud-storage-2.10.0 google-cloud-videointelligence-2.11.3 google-cloud-vision-3.4.4 google-crc32c-1.5.0 google-resumable-media-2.5.0 googleapis-common-protos-1.60.0 greenlet-3.0.0rc1 grpc-google-iam-v1-0.12.6 grpcio-status-1.58.0rc1 hdfs-2.7.2 httplib2-0.22.0 hypothesis-6.83.1 idna-3.4 iniconfig-2.0.0 isodate-0.6.1 jmespath-1.0.1 joblib-1.3.2 mock-5.1.0 msal-1.24.0b1 msal-extensions-1.0.0 oauth2client-4.1.3 objsize-0.6.1 orjson-3.9.5 overrides-6.5.0 pandas-1.5.3 parameterized-0.9.0 portalocker-2.7.0 proto-plus-1.22.3 protobuf-4.23.4 psycopg2-binary-2.9.7 pyarrow-11.0.0 pyasn1-0.5.0 pyasn1-modules-0.3.0 pycparser-2.21 pydot-1.4.2 pyhamcrest-2.0.4 pymongo-4.5.0 pymysql-1.1.0 pyparsing-3.1.1 pytest-7.4.1 pytest-timeout-2.1.0 pytest-xdist-3.3.1 python-dateutil-2.8.2 pytz-2023.3 pyyaml-6.0.1 regex-2023.8.8 requests-2.31.0 requests_mock-1.11.0 rsa-4.9 s3transfer-0.6.2 scikit-learn-1.3.0 scipy-1.10.1 shapely-1.8.5.post1 six-1.16.0 sortedcontainers-2.4.0 sqlalchemy-1.4.49 sqlparse-0.4.4 tenacity-8.2.3 testcontainers-3.7.1 threadpoolctl-3.2.0 urllib3-1.26.16 websocket-client-1.6.2 wrapt-1.15.0 zstandard-0.21.0

> Task :sdks:python:test-suites:direct:xlang:fnApiJobServerSetup
> Task :sdks:python:test-suites:direct:xlang:fnApiJobServerCleanup

FAILURE: Build failed with an exception.

* What went wrong:
Execution failed for task ':sdks:python:container:py38:docker'.
> Process 'command 'docker'' finished with non-zero exit value 1

* Try:
> Run with --stacktrace option to get the stack trace.
> Run with --info or --debug option to get more log output.

* Get more help at https://help.gradle.org

Deprecated Gradle features were used in this build, making it incompatible with Gradle 8.0.

You can use '--warning-mode all' to show the individual deprecation warnings and determine if they come from your own scripts or plugins.

See https://docs.gradle.org/7.6.2/userguide/command_line_interface.html#sec:command_line_warnings

Execution optimizations have been disabled for 1 invalid unit(s) of work during this build to ensure correctness.
Please consult deprecation warnings for more details.

BUILD FAILED in 2m 39s
251 actionable tasks: 160 executed, 79 from cache, 12 up-to-date

Publishing build scan...
https://ge.apache.org/s/6mh6ixu7urc6w

Build step 'Invoke Gradle script' changed build result to FAILURE
Build step 'Invoke Gradle script' marked build as failure

---------------------------------------------------------------------
To unsubscribe, e-mail: builds-unsubscribe@beam.apache.org
For additional commands, e-mail: builds-help@beam.apache.org