You are viewing a plain text version of this content. The canonical link for it is here.
Posted to builds@beam.apache.org by Apache Jenkins Server <je...@builds.apache.org> on 2019/05/08 17:29:53 UTC

Build failed in Jenkins: beam_PostCommit_Java_PortabilityApi #1769

See <https://builds.apache.org/job/beam_PostCommit_Java_PortabilityApi/1769/display/redirect?page=changes>

Changes:

[jkp] Loosen up dependency specifications

[github] Add upper bounds.

------------------------------------------
[...truncated 43.62 KB...]
> Task :beam-sdks-java-io-google-cloud-platform:compileJava FROM-CACHE
> Task :beam-sdks-java-io-google-cloud-platform:classes UP-TO-DATE
> Task :beam-sdks-java-io-google-cloud-platform:shadowJar
> Task :beam-runners-google-cloud-dataflow-java:compileJava FROM-CACHE
> Task :beam-runners-google-cloud-dataflow-java:classes
> Task :beam-examples-java:compileJava FROM-CACHE
> Task :beam-examples-java:classes UP-TO-DATE
> Task :beam-examples-java:compileTestJava FROM-CACHE
> Task :beam-examples-java:testClasses
> Task :beam-runners-google-cloud-dataflow-java:shadowJar
> Task :beam-sdks-java-core:shadowTestJar
> Task :beam-sdks-java-extensions-google-cloud-platform-core:compileTestJava FROM-CACHE
> Task :beam-sdks-java-extensions-google-cloud-platform-core:testClasses UP-TO-DATE
> Task :beam-sdks-java-extensions-google-cloud-platform-core:shadowTestJar
> Task :beam-sdks-java-harness:shadowJar
> Task :beam-sdks-java-harness:jar
> Task :beam-sdks-java-container:copyDockerfileDependencies
> Task :beam-runners-java-fn-execution:compileJava FROM-CACHE
> Task :beam-runners-java-fn-execution:classes UP-TO-DATE
> Task :beam-runners-java-fn-execution:shadowJar
> Task :beam-runners-direct-java:compileJava FROM-CACHE
> Task :beam-runners-direct-java:classes UP-TO-DATE
> Task :beam-runners-google-cloud-dataflow-java-fn-api-worker:compileJava FROM-CACHE
> Task :beam-runners-google-cloud-dataflow-java-fn-api-worker:classes
> Task :beam-runners-direct-java:shadowJar
> Task :beam-sdks-java-io-google-cloud-platform:compileTestJava FROM-CACHE
> Task :beam-sdks-java-io-google-cloud-platform:testClasses UP-TO-DATE
> Task :beam-sdks-java-io-google-cloud-platform:shadowTestJar
> Task :beam-examples-java:shadowJar
> Task :beam-examples-java:shadowTestJar
> Task :beam-runners-google-cloud-dataflow-java-fn-api-worker:shadowJar

> Task :beam-sdks-go:resolveBuildDependencies
Resolving google.golang.org/api: commit='386d4e5f4f92f86e6aec85985761bba4b938a2d5', urls=[https://code.googlesource.com/google-api-go-client]
Resolving google.golang.org/genproto: commit='2b5a72b8730b0b16380010cfe5286c42108d88e7', urls=[https://github.com/google/go-genproto]
Resolving google.golang.org/grpc: commit='7646b5360d049a7ca31e9133315db43456f39e2e', urls=[https://github.com/grpc/grpc-go]
Resolving cached github.com/coreos/etcd: commit='11214aa33bf5a47d3d9d8dafe0f6b97237dfe921', urls=[https://github.com/coreos/etcd.git, git@github.com:coreos/etcd.git]
Resolving cached github.com/coreos/etcd: commit='11214aa33bf5a47d3d9d8dafe0f6b97237dfe921', urls=[https://github.com/coreos/etcd.git, git@github.com:coreos/etcd.git]

> Task :beam-sdks-go:installDependencies
> Task :beam-sdks-go:buildLinuxAmd64
> Task :beam-sdks-go:goBuild

> Task :beam-sdks-java-container:resolveBuildDependencies
Resolving ./github.com/apache/beam/sdks/go@<https://builds.apache.org/job/beam_PostCommit_Java_PortabilityApi/ws/src/sdks/go>

> Task :beam-sdks-java-container:installDependencies
> Task :beam-sdks-java-container:buildLinuxAmd64
> Task :beam-sdks-java-container:goBuild
> Task :beam-sdks-java-container:dockerPrepare
> Task :beam-sdks-java-container:docker

> Task :beam-runners-google-cloud-dataflow-java:buildAndPushDockerContainer
WARNING: `gcloud docker` will not be supported for Docker client versions above 18.03.

As an alternative, use `gcloud auth configure-docker` to configure `docker` to
use `gcloud` as a credential helper, then use `docker` as you would for non-GCR
registries, e.g. `docker pull gcr.io/project-id/my-image`. Add
`--verbosity=error` to silence this warning: `gcloud docker
--verbosity=error -- pull gcr.io/project-id/my-image`.

See: https://cloud.google.com/container-registry/docs/support/deprecation-notices#gcloud-docker

The push refers to repository [us.gcr.io/apache-beam-testing/java-postcommit-it/java]
940b4fb09470: Preparing
1313e4a1bd19: Preparing
8d0c7489f10f: Preparing
150134b77bf0: Preparing
f7d12d471667: Preparing
f350d0146bb3: Preparing
e38df31d449c: Preparing
af5ae4841776: Preparing
b17cc31e431b: Preparing
f350d0146bb3: Waiting
12cb127eee44: Preparing
af5ae4841776: Waiting
604829a174eb: Preparing
fbb641a8b943: Preparing
12cb127eee44: Waiting
604829a174eb: Waiting
fbb641a8b943: Waiting
150134b77bf0: Layer already exists
8d0c7489f10f: Layer already exists
940b4fb09470: Layer already exists
f7d12d471667: Layer already exists
1313e4a1bd19: Layer already exists
f350d0146bb3: Layer already exists
e38df31d449c: Layer already exists
b17cc31e431b: Layer already exists
af5ae4841776: Layer already exists
12cb127eee44: Layer already exists
fbb641a8b943: Layer already exists
604829a174eb: Layer already exists
20190403225916: digest: sha256:113fa82e6d8fced5253734660525f85a82b72d7b5313e19474602d26be100c80 size: 2841
58cf26f8c710: Preparing
59620c3022e0: Preparing
3cc8432a83a6: Preparing
698bd8ad0795: Preparing
0b56e618512c: Preparing
cfbeb1cda5ca: Preparing
f7d12d471667: Preparing
f350d0146bb3: Preparing
e38df31d449c: Preparing
af5ae4841776: Preparing
b17cc31e431b: Preparing
12cb127eee44: Preparing
604829a174eb: Preparing
fbb641a8b943: Preparing
f350d0146bb3: Waiting
e38df31d449c: Waiting
af5ae4841776: Waiting
b17cc31e431b: Waiting
12cb127eee44: Waiting
cfbeb1cda5ca: Waiting
604829a174eb: Waiting
fbb641a8b943: Waiting
f7d12d471667: Waiting
58cf26f8c710: Layer already exists
3cc8432a83a6: Layer already exists
f350d0146bb3: Layer already exists
f7d12d471667: Layer already exists
b17cc31e431b: Layer already exists
e38df31d449c: Layer already exists
af5ae4841776: Layer already exists
12cb127eee44: Layer already exists
604829a174eb: Layer already exists
fbb641a8b943: Layer already exists
59620c3022e0: Layer already exists
0b56e618512c: Layer already exists
698bd8ad0795: Layer already exists
cfbeb1cda5ca: Layer already exists
20190502120024: digest: sha256:fc33e9968bd410d46995289968b2946f23e3fb335bb6eef22293f32aa61f2e24 size: 3262
fe9ff35b95e0: Preparing
e9b0c4cd49ce: Preparing
b145a031c279: Preparing
c6558b0d9004: Preparing
0c24f6146e52: Preparing
bf962ff5e309: Preparing
f7d12d471667: Preparing
f350d0146bb3: Preparing
e38df31d449c: Preparing
af5ae4841776: Preparing
b17cc31e431b: Preparing
12cb127eee44: Preparing
604829a174eb: Preparing
fbb641a8b943: Preparing
af5ae4841776: Waiting
b17cc31e431b: Waiting
604829a174eb: Waiting
12cb127eee44: Waiting
e38df31d449c: Waiting
fbb641a8b943: Waiting
f7d12d471667: Waiting
f350d0146bb3: Waiting
bf962ff5e309: Waiting
e9b0c4cd49ce: Pushed
b145a031c279: Pushed
f7d12d471667: Layer already exists
f350d0146bb3: Layer already exists
e38df31d449c: Layer already exists
af5ae4841776: Layer already exists
b17cc31e431b: Layer already exists
604829a174eb: Layer already exists
fbb641a8b943: Layer already exists
12cb127eee44: Layer already exists
0c24f6146e52: Pushed
bf962ff5e309: Pushed
fe9ff35b95e0: Pushed
c6558b0d9004: Pushed
20190508164103: digest: sha256:22de474b9b534a98bf4687418de5f65d03e894eb1391db71f4a78551efb65736 size: 3262

> Task :beam-runners-google-cloud-dataflow-java:coreSDKJavaFnApiWorkerIntegrationTest NO-SOURCE
> Task :beam-runners-google-cloud-dataflow-java:examplesJavaFnApiWorkerIntegrationTest

org.apache.beam.examples.cookbook.BigQueryTornadoesIT > testE2EBigQueryTornadoesWithExport FAILED
    java.lang.RuntimeException at BigQueryTornadoesIT.java:70

org.apache.beam.examples.cookbook.BigQueryTornadoesIT > testE2eBigQueryTornadoesWithStorageApi FAILED
    java.lang.RuntimeException at BigQueryTornadoesIT.java:70

2 tests completed, 2 failed

> Task :beam-runners-google-cloud-dataflow-java:examplesJavaFnApiWorkerIntegrationTest FAILED
> Task :beam-runners-google-cloud-dataflow-java:googleCloudPlatformFnApiWorkerIntegrationTest

org.apache.beam.sdk.io.gcp.bigquery.BigQueryToTableIT > testNewTypesQueryWithReshuffle FAILED
    java.lang.RuntimeException at BigQueryToTableIT.java:118

org.apache.beam.sdk.io.gcp.bigquery.BigQueryToTableIT > testLegacyQueryWithoutReshuffle FAILED
    java.lang.RuntimeException at BigQueryToTableIT.java:118

org.apache.beam.sdk.io.gcp.bigquery.BigQueryToTableIT > testNewTypesQueryWithoutReshuffle FAILED
    java.lang.RuntimeException at BigQueryToTableIT.java:118

org.apache.beam.sdk.io.gcp.bigquery.BigQueryToTableIT > testStandardQueryWithoutCustom FAILED
    java.lang.RuntimeException at BigQueryToTableIT.java:118

7 tests completed, 4 failed

> Task :beam-runners-google-cloud-dataflow-java:googleCloudPlatformFnApiWorkerIntegrationTest FAILED

> Task :beam-runners-google-cloud-dataflow-java:cleanUpDockerImages
Untagged: us.gcr.io/apache-beam-testing/java-postcommit-it/java:20190508164103
Untagged: us.gcr.io/apache-beam-testing/java-postcommit-it/java@sha256:22de474b9b534a98bf4687418de5f65d03e894eb1391db71f4a78551efb65736
Digests:
- us.gcr.io/apache-beam-testing/java-postcommit-it/java@sha256:22de474b9b534a98bf4687418de5f65d03e894eb1391db71f4a78551efb65736
  Associated tags:
 - 20190508164103
Tags:
- us.gcr.io/apache-beam-testing/java-postcommit-it/java:20190508164103
Deleted [us.gcr.io/apache-beam-testing/java-postcommit-it/java:20190508164103].
Deleted [us.gcr.io/apache-beam-testing/java-postcommit-it/java@sha256:22de474b9b534a98bf4687418de5f65d03e894eb1391db71f4a78551efb65736].

FAILURE: Build completed with 2 failures.

1: Task failed with an exception.
-----------
* What went wrong:
Execution failed for task ':beam-runners-google-cloud-dataflow-java:examplesJavaFnApiWorkerIntegrationTest'.
> There were failing tests. See the report at: file://<https://builds.apache.org/job/beam_PostCommit_Java_PortabilityApi/ws/src/runners/google-cloud-dataflow-java/build/reports/tests/examplesJavaFnApiWorkerIntegrationTest/index.html>

* Try:
Run with --stacktrace option to get the stack trace. Run with --info or --debug option to get more log output. Run with --scan to get full insights.
==============================================================================

2: Task failed with an exception.
-----------
* What went wrong:
Execution failed for task ':beam-runners-google-cloud-dataflow-java:googleCloudPlatformFnApiWorkerIntegrationTest'.
> There were failing tests. See the report at: file://<https://builds.apache.org/job/beam_PostCommit_Java_PortabilityApi/ws/src/runners/google-cloud-dataflow-java/build/reports/tests/googleCloudPlatformFnApiWorkerIntegrationTest/index.html>

* Try:
Run with --stacktrace option to get the stack trace. Run with --info or --debug option to get more log output. Run with --scan to get full insights.
==============================================================================

* Get more help at https://help.gradle.org

Deprecated Gradle features were used in this build, making it incompatible with Gradle 6.0.
Use '--warning-mode all' to show the individual deprecation warnings.
See https://docs.gradle.org/5.2.1/userguide/command_line_interface.html#sec:command_line_warnings

BUILD FAILED in 48m 58s
92 actionable tasks: 66 executed, 25 from cache, 1 up-to-date

Publishing build scan...
https://gradle.com/s/u27e24w5cixfg

Build step 'Invoke Gradle script' changed build result to FAILURE
Build step 'Invoke Gradle script' marked build as failure

---------------------------------------------------------------------
To unsubscribe, e-mail: builds-unsubscribe@beam.apache.org
For additional commands, e-mail: builds-help@beam.apache.org