You are viewing a plain text version of this content. The canonical link for it is here.
Posted to commits@phoenix.apache.org by Apache Jenkins Server <je...@builds.apache.org> on 2015/09/09 02:52:59 UTC

Build failed in Jenkins: Phoenix-4.x-HBase-1.0 #160

See <https://builds.apache.org/job/Phoenix-4.x-HBase-1.0/160/changes>

Changes:

[jamestaylor] PHOENIX-2194 order by should not require all PK fields with = constraint

------------------------------------------
[...truncated 118738 lines...]
Tests run: 11, Failures: 0, Errors: 0, Skipped: 0, Time elapsed: 10.513 sec - in org.apache.phoenix.end2end.RegexpSplitFunctionIT
Running org.apache.phoenix.end2end.RegexpReplaceFunctionIT
Tests run: 1, Failures: 0, Errors: 0, Skipped: 0, Time elapsed: 4.768 sec - in org.apache.phoenix.end2end.GetSetByteBitFunctionEnd2EndIT
Running org.apache.phoenix.end2end.StatementHintsIT
Tests run: 5, Failures: 0, Errors: 0, Skipped: 0, Time elapsed: 13.861 sec - in org.apache.phoenix.end2end.salted.SaltedTableUpsertSelectIT
Running org.apache.phoenix.end2end.ReverseFunctionIT
Tests run: 2, Failures: 0, Errors: 0, Skipped: 0, Time elapsed: 4.983 sec - in org.apache.phoenix.end2end.RegexpReplaceFunctionIT
Running org.apache.phoenix.end2end.DecodeFunctionIT
Tests run: 2, Failures: 0, Errors: 0, Skipped: 0, Time elapsed: 4.563 sec - in org.apache.phoenix.end2end.StatementHintsIT
Running org.apache.phoenix.end2end.ReadOnlyIT
Tests run: 5, Failures: 0, Errors: 0, Skipped: 0, Time elapsed: 4.542 sec - in org.apache.phoenix.end2end.ReverseFunctionIT
Running org.apache.phoenix.end2end.UpsertSelectAutoCommitIT
Tests run: 6, Failures: 0, Errors: 0, Skipped: 0, Time elapsed: 7.463 sec - in org.apache.phoenix.end2end.DecodeFunctionIT
Running org.apache.phoenix.end2end.OctetLengthFunctionEnd2EndIT
Tests run: 1, Failures: 0, Errors: 0, Skipped: 0, Time elapsed: 8.354 sec - in org.apache.phoenix.end2end.ReadOnlyIT
Tests run: 1, Failures: 0, Errors: 0, Skipped: 0, Time elapsed: 3.385 sec - in org.apache.phoenix.end2end.OctetLengthFunctionEnd2EndIT
Running org.apache.phoenix.end2end.LpadFunctionIT
Running org.apache.phoenix.end2end.SpooledTmpFileDeleteIT
Tests run: 1, Failures: 0, Errors: 0, Skipped: 0, Time elapsed: 3.608 sec - in org.apache.phoenix.end2end.SpooledTmpFileDeleteIT
Tests run: 3, Failures: 0, Errors: 0, Skipped: 0, Time elapsed: 13.196 sec - in org.apache.phoenix.end2end.UpsertSelectAutoCommitIT
Running org.apache.phoenix.end2end.CoalesceFunctionIT
Running org.apache.phoenix.end2end.ArrayAppendFunctionIT
Tests run: 10, Failures: 0, Errors: 0, Skipped: 0, Time elapsed: 16.803 sec - in org.apache.phoenix.end2end.CoalesceFunctionIT
Tests run: 20, Failures: 0, Errors: 0, Skipped: 0, Time elapsed: 203.326 sec - in org.apache.phoenix.end2end.index.LocalIndexIT
Running org.apache.phoenix.end2end.RTrimFunctionIT
Running org.apache.phoenix.end2end.SortMergeJoinIT
Tests run: 34, Failures: 0, Errors: 0, Skipped: 0, Time elapsed: 17.693 sec - in org.apache.phoenix.end2end.ArrayAppendFunctionIT
Running org.apache.phoenix.end2end.AlterTableWithViewsIT
Tests run: 12, Failures: 0, Errors: 0, Skipped: 0, Time elapsed: 25.739 sec - in org.apache.phoenix.end2end.LpadFunctionIT
Tests run: 2, Failures: 0, Errors: 0, Skipped: 0, Time elapsed: 3.515 sec - in org.apache.phoenix.end2end.RTrimFunctionIT
Running org.apache.phoenix.end2end.SqrtFunctionEnd2EndIT
Running org.apache.phoenix.end2end.RegexpSubstrFunctionIT
Tests run: 2, Failures: 0, Errors: 0, Skipped: 0, Time elapsed: 2.452 sec - in org.apache.phoenix.end2end.RegexpSubstrFunctionIT
Running org.apache.phoenix.end2end.MappingTableDataTypeIT
Tests run: 2, Failures: 0, Errors: 0, Skipped: 0, Time elapsed: 7.222 sec - in org.apache.phoenix.end2end.SqrtFunctionEnd2EndIT
Running org.apache.phoenix.end2end.ModulusExpressionIT
Tests run: 1, Failures: 0, Errors: 0, Skipped: 0, Time elapsed: 8.15 sec - in org.apache.phoenix.end2end.MappingTableDataTypeIT
Running org.apache.phoenix.end2end.ConvertTimezoneFunctionIT
Tests run: 7, Failures: 0, Errors: 0, Skipped: 0, Time elapsed: 3.343 sec - in org.apache.phoenix.end2end.ConvertTimezoneFunctionIT
Running org.apache.phoenix.end2end.InListIT
Tests run: 11, Failures: 0, Errors: 0, Skipped: 0, Time elapsed: 10.388 sec - in org.apache.phoenix.end2end.ModulusExpressionIT
Running org.apache.phoenix.end2end.SubqueryUsingSortMergeJoinIT
Tests run: 28, Failures: 0, Errors: 0, Skipped: 0, Time elapsed: 79.003 sec - in org.apache.phoenix.end2end.InListIT
Running org.apache.phoenix.end2end.SubqueryIT
Tests run: 15, Failures: 0, Errors: 0, Skipped: 0, Time elapsed: 88.575 sec - in org.apache.phoenix.end2end.SubqueryUsingSortMergeJoinIT
Running org.apache.phoenix.end2end.ArithmeticQueryIT
Tests run: 26, Failures: 0, Errors: 0, Skipped: 0, Time elapsed: 37.56 sec - in org.apache.phoenix.end2end.ArithmeticQueryIT
Running org.apache.phoenix.end2end.StoreNullsIT
Tests run: 21, Failures: 0, Errors: 0, Skipped: 0, Time elapsed: 54.401 sec - in org.apache.phoenix.end2end.SubqueryIT
Running org.apache.phoenix.end2end.UpgradeIT
Tests run: 15, Failures: 0, Errors: 0, Skipped: 0, Time elapsed: 170.453 sec - in org.apache.phoenix.end2end.AlterTableWithViewsIT
Running org.apache.phoenix.end2end.IsNullIT
Tests run: 3, Failures: 0, Errors: 0, Skipped: 0, Time elapsed: 23.391 sec - in org.apache.phoenix.end2end.StoreNullsIT
Running org.apache.phoenix.end2end.AutoCommitIT
Tests run: 3, Failures: 0, Errors: 0, Skipped: 0, Time elapsed: 5.712 sec - in org.apache.phoenix.end2end.IsNullIT
Running org.apache.phoenix.end2end.ReverseScanIT
Tests run: 1, Failures: 0, Errors: 0, Skipped: 0, Time elapsed: 3.121 sec - in org.apache.phoenix.end2end.AutoCommitIT
Running org.apache.phoenix.end2end.StddevIT
Tests run: 3, Failures: 0, Errors: 0, Skipped: 0, Time elapsed: 5.655 sec - in org.apache.phoenix.end2end.ReverseScanIT
Running org.apache.phoenix.end2end.ExecuteStatementsIT
Tests run: 4, Failures: 0, Errors: 0, Skipped: 0, Time elapsed: 5.97 sec - in org.apache.phoenix.end2end.StddevIT
Running org.apache.phoenix.end2end.MD5FunctionIT
Tests run: 3, Failures: 0, Errors: 0, Skipped: 0, Time elapsed: 6.204 sec - in org.apache.phoenix.end2end.MD5FunctionIT
Running org.apache.phoenix.end2end.SpooledSortMergeJoinIT
Tests run: 6, Failures: 0, Errors: 0, Skipped: 0, Time elapsed: 42.337 sec - in org.apache.phoenix.end2end.UpgradeIT
Running org.apache.phoenix.end2end.ArrayToStringFunctionIT
Tests run: 2, Failures: 0, Errors: 0, Skipped: 0, Time elapsed: 17.517 sec - in org.apache.phoenix.end2end.ExecuteStatementsIT
Running org.apache.phoenix.end2end.NthValueFunctionIT
Tests run: 11, Failures: 0, Errors: 0, Skipped: 0, Time elapsed: 7.359 sec - in org.apache.phoenix.end2end.NthValueFunctionIT
Running org.apache.phoenix.end2end.TenantIdTypeIT
Tests run: 36, Failures: 0, Errors: 0, Skipped: 0, Time elapsed: 16.032 sec - in org.apache.phoenix.end2end.ArrayToStringFunctionIT
Running org.apache.phoenix.end2end.HashJoinLocalIndexIT
Tests run: 1, Failures: 0, Errors: 0, Skipped: 0, Time elapsed: 16.624 sec - in org.apache.phoenix.end2end.HashJoinLocalIndexIT
Running org.apache.phoenix.end2end.InstrFunctionIT
Tests run: 8, Failures: 0, Errors: 0, Skipped: 0, Time elapsed: 4.911 sec - in org.apache.phoenix.end2end.InstrFunctionIT
Running org.apache.phoenix.end2end.StringToArrayFunctionIT
Tests run: 22, Failures: 0, Errors: 0, Skipped: 0, Time elapsed: 13.291 sec - in org.apache.phoenix.end2end.StringToArrayFunctionIT
Running org.apache.phoenix.end2end.SkipScanAfterManualSplitIT
Tests run: 15, Failures: 0, Errors: 0, Skipped: 0, Time elapsed: 67.515 sec - in org.apache.phoenix.end2end.TenantIdTypeIT
Running org.apache.phoenix.end2end.QueryMoreIT
Tests run: 3, Failures: 0, Errors: 0, Skipped: 0, Time elapsed: 34.582 sec - in org.apache.phoenix.end2end.SkipScanAfterManualSplitIT
Running org.apache.phoenix.end2end.MinMaxAggregateFunctionIT
Tests run: 1, Failures: 0, Errors: 0, Skipped: 0, Time elapsed: 3.031 sec - in org.apache.phoenix.end2end.MinMaxAggregateFunctionIT
Running org.apache.phoenix.end2end.LnLogFunctionEnd2EndIT
Tests run: 108, Failures: 0, Errors: 0, Skipped: 0, Time elapsed: 436.42 sec - in org.apache.phoenix.end2end.HashJoinIT
Tests run: 1, Failures: 0, Errors: 0, Skipped: 0, Time elapsed: 4.974 sec - in org.apache.phoenix.end2end.LnLogFunctionEnd2EndIT
Running org.apache.phoenix.end2end.ArraysWithNullsIT
Running org.apache.phoenix.end2end.PhoenixRuntimeIT
Tests run: 5, Failures: 0, Errors: 0, Skipped: 0, Time elapsed: 17.852 sec - in org.apache.phoenix.end2end.QueryMoreIT
Running org.apache.phoenix.end2end.DateTimeIT
Tests run: 19, Failures: 0, Errors: 0, Skipped: 0, Time elapsed: 12.673 sec - in org.apache.phoenix.end2end.DateTimeIT
Running org.apache.phoenix.rpc.UpdateCacheIT
Tests run: 2, Failures: 0, Errors: 0, Skipped: 0, Time elapsed: 18.82 sec - in org.apache.phoenix.end2end.PhoenixRuntimeIT
Running org.apache.phoenix.iterate.RoundRobinResultIteratorIT
Tests run: 1, Failures: 0, Errors: 0, Skipped: 0, Time elapsed: 3.42 sec - in org.apache.phoenix.rpc.UpdateCacheIT
Running org.apache.phoenix.trace.PhoenixTracingEndToEndIT
Tests run: 16, Failures: 0, Errors: 0, Skipped: 0, Time elapsed: 39.129 sec - in org.apache.phoenix.end2end.ArraysWithNullsIT
Running org.apache.phoenix.trace.PhoenixTableMetricsWriterIT
Tests run: 2, Failures: 0, Errors: 0, Skipped: 0, Time elapsed: 1.984 sec - in org.apache.phoenix.trace.PhoenixTableMetricsWriterIT
Running org.apache.phoenix.trace.PhoenixTraceReaderIT
Tests run: 2, Failures: 0, Errors: 0, Skipped: 0, Time elapsed: 0.538 sec - in org.apache.phoenix.trace.PhoenixTraceReaderIT
Tests run: 9, Failures: 0, Errors: 0, Skipped: 0, Time elapsed: 64.02 sec - in org.apache.phoenix.iterate.RoundRobinResultIteratorIT
Tests run: 6, Failures: 0, Errors: 0, Skipped: 0, Time elapsed: 88.01 sec - in org.apache.phoenix.trace.PhoenixTracingEndToEndIT
Tests run: 108, Failures: 0, Errors: 0, Skipped: 0, Time elapsed: 411.59 sec - in org.apache.phoenix.end2end.SortMergeJoinIT
Tests run: 108, Failures: 0, Errors: 0, Skipped: 0, Time elapsed: 439.494 sec - in org.apache.phoenix.end2end.SpooledSortMergeJoinIT

Results :

Failed tests: 
  SortOrderIT.descVarLengthAscPKLTE:401->runQueryTest:552->runQuery:603 Unexpected result for query SELECT k1 FROM DescColumnSortOrderTest WHERE 'bb' <= k2: arrays first differed at element [0]; expected:<1> but was:<4>
  SortOrderIT.descVarLengthDescPKGT:383->runQueryTest:552->runQuery:603 Unexpected result for query SELECT k1 FROM DescColumnSortOrderTest WHERE k2 > 'b': arrays first differed at element [0]; expected:<3> but was:<5>
  SortOrderIT.descVarLengthDescPKLTE:392->runQueryTest:552->runQuery:603 Unexpected result for query SELECT k1 FROM DescColumnSortOrderTest WHERE k2 <= 'bb': arrays first differed at element [0]; expected:<2> but was:<3>
  SortOrderIT.testNonPKCompare:440->testCompareCompositeKey:483 t_null_DECIMAL_DESC expected:<2> but was:<3>
  SortOrderIT.testSkipScanCompare:456->testCompareCompositeKey:482 t_null_DECIMAL_DESC



Tests run: 1165, Failures: 5, Errors: 0, Skipped: 0

[INFO] 
[INFO] --- maven-failsafe-plugin:2.18:integration-test (NeedTheirOwnClusterTests) @ phoenix-core ---
[INFO] Failsafe report directory: /x1/jenkins/jenkins-slave/workspace/Phoenix-4.x-HBase-1.0/phoenix-core/target/failsafe-reports
[INFO] parallel='none', perCoreThreadCount=true, threadCount=0, useUnlimitedThreads=false, threadCountSuites=0, threadCountClasses=0, threadCountMethods=0, parallelOptimized=true

-------------------------------------------------------
 T E S T S
-------------------------------------------------------
Running org.apache.hadoop.hbase.regionserver.wal.WALReplayWithIndexWritesAndUncompressedWALInHBase_094_9_IT
Running org.apache.hadoop.hbase.regionserver.wal.WALReplayWithIndexWritesAndCompressedWALIT
Running org.apache.phoenix.monitoring.PhoenixMetricsIT
Running org.apache.phoenix.end2end.TenantSpecificTablesDDLIT
Running org.apache.phoenix.execute.PartialCommitIT
Tests run: 1, Failures: 0, Errors: 0, Skipped: 0, Time elapsed: 28.344 sec - in org.apache.hadoop.hbase.regionserver.wal.WALReplayWithIndexWritesAndCompressedWALIT
Tests run: 1, Failures: 0, Errors: 0, Skipped: 0, Time elapsed: 28.441 sec - in org.apache.hadoop.hbase.regionserver.wal.WALReplayWithIndexWritesAndUncompressedWALInHBase_094_9_IT
Tests run: 6, Failures: 0, Errors: 0, Skipped: 0, Time elapsed: 4.626 sec - in org.apache.phoenix.execute.PartialCommitIT
Running org.apache.phoenix.end2end.CountDistinctCompressionIT
Running org.apache.phoenix.end2end.ContextClassloaderIT
Tests run: 1, Failures: 0, Errors: 0, Skipped: 0, Time elapsed: 4.914 sec - in org.apache.phoenix.end2end.CountDistinctCompressionIT
Running org.apache.phoenix.end2end.index.MutableIndexFailureIT
Tests run: 3, Failures: 0, Errors: 0, Skipped: 0, Time elapsed: 12.372 sec - in org.apache.phoenix.end2end.ContextClassloaderIT
Tests run: 17, Failures: 0, Errors: 0, Skipped: 0, Time elapsed: 44.936 sec - in org.apache.phoenix.end2end.TenantSpecificTablesDDLIT
Tests run: 17, Failures: 0, Errors: 0, Skipped: 0, Time elapsed: 56.447 sec - in org.apache.phoenix.monitoring.PhoenixMetricsIT
Running org.apache.phoenix.end2end.index.ImmutableIndexWithStatsIT
Running org.apache.phoenix.end2end.index.MutableIndexReplicationIT
Tests run: 1, Failures: 0, Errors: 0, Skipped: 0, Time elapsed: 7.432 sec - in org.apache.phoenix.end2end.index.ImmutableIndexWithStatsIT
Running org.apache.phoenix.end2end.TenantSpecificTablesDMLIT
Tests run: 1, Failures: 0, Errors: 0, Skipped: 0, Time elapsed: 19.933 sec - in org.apache.phoenix.end2end.index.MutableIndexReplicationIT
Running org.apache.phoenix.end2end.StatsCollectorIT
Running org.apache.phoenix.end2end.SaltedViewIT
Tests run: 16, Failures: 0, Errors: 0, Skipped: 0, Time elapsed: 38.544 sec - in org.apache.phoenix.end2end.TenantSpecificTablesDMLIT
Tests run: 2, Failures: 0, Errors: 0, Skipped: 0, Time elapsed: 17.06 sec - in org.apache.phoenix.end2end.SaltedViewIT
Running org.apache.phoenix.end2end.KeyOnlyIT
Running org.apache.phoenix.end2end.ParallelIteratorsIT
Tests run: 4, Failures: 0, Errors: 0, Skipped: 0, Time elapsed: 57.219 sec - in org.apache.phoenix.end2end.StatsCollectorIT
Tests run: 3, Failures: 0, Errors: 0, Skipped: 0, Time elapsed: 17.521 sec - in org.apache.phoenix.end2end.KeyOnlyIT
Tests run: 2, Failures: 0, Errors: 0, Skipped: 0, Time elapsed: 17.489 sec - in org.apache.phoenix.end2end.ParallelIteratorsIT
Running org.apache.phoenix.end2end.QueryWithLimitIT
Running org.apache.phoenix.end2end.StatsCollectorWithSplitsAndMultiCFIT
Tests run: 2, Failures: 0, Errors: 0, Skipped: 0, Time elapsed: 7.902 sec - in org.apache.phoenix.end2end.QueryWithLimitIT
Running org.apache.phoenix.end2end.MultiCfQueryExecIT
Running org.apache.phoenix.end2end.ViewIT
Tests run: 7, Failures: 0, Errors: 0, Skipped: 0, Time elapsed: 18.041 sec - in org.apache.phoenix.end2end.MultiCfQueryExecIT
Tests run: 3, Failures: 0, Errors: 0, Skipped: 0, Time elapsed: 167.03 sec - in org.apache.phoenix.end2end.index.MutableIndexFailureIT
Tests run: 2, Failures: 0, Errors: 0, Skipped: 0, Time elapsed: 34.957 sec - in org.apache.phoenix.end2end.StatsCollectorWithSplitsAndMultiCFIT
Running org.apache.phoenix.end2end.QueryTimeoutIT
Running org.apache.phoenix.end2end.UnionAllIT
Running org.apache.phoenix.end2end.UserDefinedFunctionsIT
Tests run: 1, Failures: 0, Errors: 0, Skipped: 0, Time elapsed: 18.435 sec - in org.apache.phoenix.end2end.QueryTimeoutIT
Tests run: 11, Failures: 0, Errors: 0, Skipped: 0, Time elapsed: 20.229 sec - in org.apache.phoenix.end2end.UnionAllIT
Tests run: 13, Failures: 0, Errors: 0, Skipped: 0, Time elapsed: 19.572 sec - in org.apache.phoenix.end2end.UserDefinedFunctionsIT
Tests run: 22, Failures: 0, Errors: 0, Skipped: 0, Time elapsed: 48.567 sec - in org.apache.phoenix.end2end.ViewIT
Running org.apache.phoenix.rpc.PhoenixClientRpcIT
Running org.apache.phoenix.end2end.SpillableGroupByIT
Tests run: 1, Failures: 0, Errors: 0, Skipped: 0, Time elapsed: 6.98 sec - in org.apache.phoenix.end2end.SpillableGroupByIT
Tests run: 2, Failures: 0, Errors: 0, Skipped: 0, Time elapsed: 11.035 sec - in org.apache.phoenix.rpc.PhoenixClientRpcIT
Running org.apache.phoenix.mapreduce.IndexToolIT
Running org.apache.phoenix.rpc.PhoenixServerRpcIT
Running org.apache.phoenix.iterate.RoundRobinResultIteratorWithStatsIT
Tests run: 1, Failures: 0, Errors: 0, Skipped: 0, Time elapsed: 10.765 sec - in org.apache.phoenix.iterate.RoundRobinResultIteratorWithStatsIT
Tests run: 2, Failures: 0, Errors: 0, Skipped: 0, Time elapsed: 19.835 sec - in org.apache.phoenix.rpc.PhoenixServerRpcIT
Running org.apache.phoenix.mapreduce.CsvBulkLoadToolIT
Running org.apache.phoenix.hbase.index.balancer.IndexLoadBalancerIT
Running org.apache.phoenix.hbase.index.covered.EndToEndCoveredColumnsIndexBuilderIT
Tests run: 2, Failures: 0, Errors: 0, Skipped: 0, Time elapsed: 9.368 sec - in org.apache.phoenix.hbase.index.covered.EndToEndCoveredColumnsIndexBuilderIT
Running org.apache.phoenix.hbase.index.covered.example.EndToEndCoveredIndexingIT
Tests run: 11, Failures: 0, Errors: 0, Skipped: 0, Time elapsed: 68.833 sec - in org.apache.phoenix.hbase.index.covered.example.EndToEndCoveredIndexingIT
Running org.apache.phoenix.hbase.index.covered.example.EndtoEndIndexingWithCompressionIT
Tests run: 9, Failures: 0, Errors: 0, Skipped: 0, Time elapsed: 165.83 sec - in org.apache.phoenix.hbase.index.balancer.IndexLoadBalancerIT
Running org.apache.phoenix.hbase.index.covered.example.FailWithoutRetriesIT
Tests run: 11, Failures: 0, Errors: 0, Skipped: 0, Time elapsed: 69.865 sec - in org.apache.phoenix.hbase.index.covered.example.EndtoEndIndexingWithCompressionIT
Running org.apache.phoenix.hbase.index.FailForUnsupportedHBaseVersionsIT
Tests run: 1, Failures: 0, Errors: 0, Skipped: 0, Time elapsed: 9.227 sec - in org.apache.phoenix.hbase.index.covered.example.FailWithoutRetriesIT
Tests run: 2, Failures: 0, Errors: 0, Skipped: 0, Time elapsed: 17.986 sec - in org.apache.phoenix.hbase.index.FailForUnsupportedHBaseVersionsIT
Tests run: 6, Failures: 0, Errors: 0, Skipped: 0, Time elapsed: 315.063 sec - in org.apache.phoenix.mapreduce.CsvBulkLoadToolIT
Tests run: 9, Failures: 0, Errors: 0, Skipped: 0, Time elapsed: 401.66 sec - in org.apache.phoenix.mapreduce.IndexToolIT
Running org.apache.phoenix.end2end.AlterTableIT
Tests run: 51, Failures: 0, Errors: 0, Skipped: 0, Time elapsed: 328.275 sec - in org.apache.phoenix.end2end.AlterTableIT

Results :




Tests run: 244, Failures: 0, Errors: 0, Skipped: 0

[INFO] 
[INFO] --- maven-failsafe-plugin:2.18:verify (ClientManagedTimeTests) @ phoenix-core ---
[INFO] Failsafe report directory: /x1/jenkins/jenkins-slave/workspace/Phoenix-4.x-HBase-1.0/phoenix-core/target/failsafe-reports
[INFO] ------------------------------------------------------------------------
[INFO] Reactor Summary:
[INFO] 
[INFO] Apache Phoenix .................................... SUCCESS [3.255s]
[INFO] Phoenix Core ...................................... FAILURE [54:01.529s]
[INFO] Phoenix - Flume ................................... SKIPPED
[INFO] Phoenix - Pig ..................................... SKIPPED
[INFO] Phoenix Query Server Client ....................... SKIPPED
[INFO] Phoenix Query Server .............................. SKIPPED
[INFO] Phoenix - Pherf ................................... SKIPPED
[INFO] Phoenix - Spark ................................... SKIPPED
[INFO] Phoenix Assembly .................................. SKIPPED
[INFO] ------------------------------------------------------------------------
[INFO] BUILD FAILURE
[INFO] ------------------------------------------------------------------------
[INFO] Total time: 54:05.850s
[INFO] Finished at: Wed Sep 09 00:49:46 UTC 2015
[INFO] Final Memory: 44M/755M
[INFO] ------------------------------------------------------------------------
[ERROR] Failed to execute goal org.apache.maven.plugins:maven-failsafe-plugin:2.18:verify (ClientManagedTimeTests) on project phoenix-core: There are test failures.
[ERROR] 
[ERROR] Please refer to /x1/jenkins/jenkins-slave/workspace/Phoenix-4.x-HBase-1.0/phoenix-core/target/failsafe-reports for the individual test results.
[ERROR] -> [Help 1]
[ERROR] 
[ERROR] To see the full stack trace of the errors, re-run Maven with the -e switch.
[ERROR] Re-run Maven using the -X switch to enable full debug logging.
[ERROR] 
[ERROR] For more information about the errors and possible solutions, please read the following articles:
[ERROR] [Help 1] http://cwiki.apache.org/confluence/display/MAVEN/MojoFailureException
[ERROR] 
[ERROR] After correcting the problems, you can resume the build with the command
[ERROR]   mvn <goals> -rf :phoenix-core
Build step 'Invoke top-level Maven targets' marked build as failure
Archiving artifacts
Sending artifact delta relative to Phoenix-4.x-HBase-1.0 #159
Archived 1345 artifacts
Archive block size is 32768
Received 24161 blocks and 596803401 bytes
Compression is 57.0%
Took 3 min 10 sec
Recording test results

Jenkins build is back to normal : Phoenix-4.x-HBase-1.0 #164

Posted by Apache Jenkins Server <je...@builds.apache.org>.
See <https://builds.apache.org/job/Phoenix-4.x-HBase-1.0/164/changes>


Build failed in Jenkins: Phoenix-4.x-HBase-1.0 #163

Posted by Apache Jenkins Server <je...@builds.apache.org>.
See <https://builds.apache.org/job/Phoenix-4.x-HBase-1.0/163/changes>

Changes:

[jtaylor] PHOENIX-2137 Range query on DECIMAL DESC sometimes incorrect

[jtaylor] PHOENIX-2171 DOUBLE and FLOAT DESC are stored as ASC

------------------------------------------
[...truncated 117311 lines...]
#
#  SIGSEGV (0xb) at pc=0x6623552c, pid=10433, tid=1585609536
#
# JRE version: 7.0_25-b15
# Java VM: Java HotSpot(TM) Server VM (23.25-b01 mixed mode linux-x86 )
# Problematic frame:
# C  [libnet.so+0x352c]  _init+0x620
#
# Failed to write core dump. Core dumps have been disabled. To enable core dumping, try "ulimit -c unlimited" before starting Java again
#
# An error report file with more information is saved as:
# <https://builds.apache.org/job/Phoenix-4.x-HBase-1.0/ws/phoenix-pherf/hs_err_pid10433.log>
#
# If you would like to submit a bug report, please visit:
#   http://bugreport.sun.com/bugreport/crash.jsp
# The crash happened outside the Java Virtual Machine in native code.
# See problematic frame for where to report the bug.
#
Aborted
#
# A fatal error has been detected by the Java Runtime Environment:
#
#  SIGSEGV (0xb) at pc=0x65e6d52c, pid=10425, tid=1582275392
#
# JRE version: 7.0_25-b15
# Java VM: Java HotSpot(TM) Server VM (23.25-b01 mixed mode linux-x86 )
# Problematic frame:
# C  [libnet.so+0x352c]  _init+0x620
#
# Failed to write core dump. Core dumps have been disabled. To enable core dumping, try "ulimit -c unlimited" before starting Java again
#
# An error report file with more information is saved as:
# <https://builds.apache.org/job/Phoenix-4.x-HBase-1.0/ws/phoenix-pherf/hs_err_pid10425.log>
#
# If you would like to submit a bug report, please visit:
#   http://bugreport.sun.com/bugreport/crash.jsp
# The crash happened outside the Java Virtual Machine in native code.
# See problematic frame for where to report the bug.
#
Aborted

Results :




Tests run: 0, Failures: 0, Errors: 0, Skipped: 0

[INFO] 
[INFO] --- maven-failsafe-plugin:2.18:integration-test (NeedTheirOwnClusterTests) @ phoenix-pherf ---
[INFO] Failsafe report directory: <https://builds.apache.org/job/Phoenix-4.x-HBase-1.0/ws/phoenix-pherf/target/failsafe-reports>
[INFO] parallel='none', perCoreThreadCount=true, threadCount=0, useUnlimitedThreads=false, threadCountSuites=0, threadCountClasses=0, threadCountMethods=0, parallelOptimized=true

-------------------------------------------------------
 T E S T S
-------------------------------------------------------

Results :




Tests run: 0, Failures: 0, Errors: 0, Skipped: 0

[INFO] 
[INFO] --- maven-failsafe-plugin:2.18:verify (ClientManagedTimeTests) @ phoenix-pherf ---
[INFO] Failsafe report directory: <https://builds.apache.org/job/Phoenix-4.x-HBase-1.0/ws/phoenix-pherf/target/failsafe-reports>
[INFO] 
[INFO] --- maven-failsafe-plugin:2.18:verify (HBaseManagedTimeTests) @ phoenix-pherf ---
[INFO] Failsafe report directory: <https://builds.apache.org/job/Phoenix-4.x-HBase-1.0/ws/phoenix-pherf/target/failsafe-reports>
[INFO] 
[INFO] --- maven-failsafe-plugin:2.18:verify (NeedTheirOwnClusterTests) @ phoenix-pherf ---
[INFO] Failsafe report directory: <https://builds.apache.org/job/Phoenix-4.x-HBase-1.0/ws/phoenix-pherf/target/failsafe-reports>
[INFO] 
[INFO] --- maven-install-plugin:2.5.1:install (default-install) @ phoenix-pherf ---
[INFO] Installing <https://builds.apache.org/job/Phoenix-4.x-HBase-1.0/163/artifact/phoenix-pherf/target/phoenix-pherf-4.6.0-HBase-1.0-SNAPSHOT.jar> to /home/jenkins/.m2/repository/org/apache/phoenix/phoenix-pherf/4.6.0-HBase-1.0-SNAPSHOT/phoenix-pherf-4.6.0-HBase-1.0-SNAPSHOT.jar
[INFO] Installing <https://builds.apache.org/job/Phoenix-4.x-HBase-1.0/ws/phoenix-pherf/pom.xml> to /home/jenkins/.m2/repository/org/apache/phoenix/phoenix-pherf/4.6.0-HBase-1.0-SNAPSHOT/phoenix-pherf-4.6.0-HBase-1.0-SNAPSHOT.pom
[INFO] Installing <https://builds.apache.org/job/Phoenix-4.x-HBase-1.0/163/artifact/phoenix-pherf/target/phoenix-pherf-4.6.0-HBase-1.0-SNAPSHOT-sources.jar> to /home/jenkins/.m2/repository/org/apache/phoenix/phoenix-pherf/4.6.0-HBase-1.0-SNAPSHOT/phoenix-pherf-4.6.0-HBase-1.0-SNAPSHOT-sources.jar
[INFO] Installing <https://builds.apache.org/job/Phoenix-4.x-HBase-1.0/163/artifact/phoenix-pherf/target/phoenix-pherf-4.6.0-HBase-1.0-SNAPSHOT-tests.jar> to /home/jenkins/.m2/repository/org/apache/phoenix/phoenix-pherf/4.6.0-HBase-1.0-SNAPSHOT/phoenix-pherf-4.6.0-HBase-1.0-SNAPSHOT-tests.jar
[INFO] Installing <https://builds.apache.org/job/Phoenix-4.x-HBase-1.0/163/artifact/phoenix-pherf/target/phoenix-pherf-4.6.0-HBase-1.0-SNAPSHOT-jar-with-dependencies.jar> to /home/jenkins/.m2/repository/org/apache/phoenix/phoenix-pherf/4.6.0-HBase-1.0-SNAPSHOT/phoenix-pherf-4.6.0-HBase-1.0-SNAPSHOT-jar-with-dependencies.jar
[INFO] Installing <https://builds.apache.org/job/Phoenix-4.x-HBase-1.0/163/artifact/phoenix-pherf/target/phoenix-pherf-4.6.0-HBase-1.0-SNAPSHOT-minimal.jar> to /home/jenkins/.m2/repository/org/apache/phoenix/phoenix-pherf/4.6.0-HBase-1.0-SNAPSHOT/phoenix-pherf-4.6.0-HBase-1.0-SNAPSHOT-minimal.jar
[INFO] Installing <https://builds.apache.org/job/Phoenix-4.x-HBase-1.0/ws/phoenix-pherf/target/phoenix-pherf-4.6.0-HBase-1.0-SNAPSHOT-standalone.zip> to /home/jenkins/.m2/repository/org/apache/phoenix/phoenix-pherf/4.6.0-HBase-1.0-SNAPSHOT/phoenix-pherf-4.6.0-HBase-1.0-SNAPSHOT-standalone.zip
[INFO] Installing <https://builds.apache.org/job/Phoenix-4.x-HBase-1.0/ws/phoenix-pherf/target/phoenix-pherf-4.6.0-HBase-1.0-SNAPSHOT-cluster.zip> to /home/jenkins/.m2/repository/org/apache/phoenix/phoenix-pherf/4.6.0-HBase-1.0-SNAPSHOT/phoenix-pherf-4.6.0-HBase-1.0-SNAPSHOT-cluster.zip
[INFO]                                                                         
[INFO] ------------------------------------------------------------------------
[INFO] Building Phoenix - Spark 4.6.0-HBase-1.0-SNAPSHOT
[INFO] ------------------------------------------------------------------------
[INFO] 
[INFO] --- maven-clean-plugin:2.5:clean (default-clean) @ phoenix-spark ---
[INFO] Deleting <https://builds.apache.org/job/Phoenix-4.x-HBase-1.0/ws/phoenix-spark/target>
[INFO] 
[INFO] --- maven-checkstyle-plugin:2.13:check (validate) @ phoenix-spark ---
[INFO] Starting audit...
Audit done.

[INFO] 
[INFO] --- maven-remote-resources-plugin:1.5:process (default) @ phoenix-spark ---
[INFO] 
[INFO] --- maven-resources-plugin:2.6:resources (default-resources) @ phoenix-spark ---
[INFO] Using 'UTF-8' encoding to copy filtered resources.
[INFO] skip non existing resourceDirectory <https://builds.apache.org/job/Phoenix-4.x-HBase-1.0/ws/phoenix-spark/src/main/resources>
[INFO] Copying 3 resources
[INFO] 
[INFO] --- scala-maven-plugin:3.2.0:add-source (scala-compile-first) @ phoenix-spark ---
[INFO] Add Source directory: <https://builds.apache.org/job/Phoenix-4.x-HBase-1.0/ws/phoenix-spark/src/main/scala>
[INFO] 
[INFO] --- scala-maven-plugin:3.2.0:compile (scala-compile-first) @ phoenix-spark ---
[WARNING]  Expected all dependencies to require Scala version: 2.10.4
[WARNING]  org.apache.phoenix:phoenix-spark:4.6.0-HBase-1.0-SNAPSHOT requires scala version: 2.10.4
[WARNING]  com.twitter:chill_2.10:0.5.0 requires scala version: 2.10.4
[WARNING]  org.spark-project.akka:akka-remote_2.10:2.3.4-spark requires scala version: 2.10.4
[WARNING]  org.spark-project.akka:akka-actor_2.10:2.3.4-spark requires scala version: 2.10.4
[WARNING]  org.spark-project.akka:akka-slf4j_2.10:2.3.4-spark requires scala version: 2.10.4
[WARNING]  org.apache.spark:spark-core_2.10:1.4.0 requires scala version: 2.10.4
[WARNING]  org.json4s:json4s-jackson_2.10:3.2.10 requires scala version: 2.10.0
[WARNING] Multiple versions of scala libraries detected!
[INFO] <https://builds.apache.org/job/Phoenix-4.x-HBase-1.0/ws/phoenix-spark/src/main/scala>:-1: info: compiling
[INFO] Compiling 10 source files to <https://builds.apache.org/job/Phoenix-4.x-HBase-1.0/ws/phoenix-spark/target/classes> at 1441961905576
[WARNING] warning: Class org.joda.convert.FromString not found - continuing with a stub.
[WARNING] warning: Class org.joda.convert.ToString not found - continuing with a stub.
[WARNING] warning: Class org.joda.convert.ToString not found - continuing with a stub.
[WARNING] warning: Class org.joda.convert.FromString not found - continuing with a stub.
[WARNING] warning: Class org.joda.convert.ToString not found - continuing with a stub.
[WARNING] warning: Class org.joda.convert.FromString not found - continuing with a stub.
[WARNING] warning: Class org.joda.convert.FromString not found - continuing with a stub.
[WARNING] warning: there were 5 feature warning(s); re-run with -feature for details
[WARNING] 8 warnings found
[INFO] prepare-compile in 0 s
[INFO] compile in 8 s
[INFO] 
[INFO] --- maven-compiler-plugin:3.0:compile (default-compile) @ phoenix-spark ---
[INFO] Changes detected - recompiling the module!
[INFO] 
[INFO] --- maven-resources-plugin:2.6:testResources (default-testResources) @ phoenix-spark ---
[INFO] Using 'UTF-8' encoding to copy filtered resources.
[INFO] Copying 2 resources
[INFO] Copying 3 resources
[INFO] 
[INFO] --- scala-maven-plugin:3.2.0:testCompile (scala-test-compile) @ phoenix-spark ---
[WARNING]  Expected all dependencies to require Scala version: 2.10.4
[WARNING]  org.apache.phoenix:phoenix-spark:4.6.0-HBase-1.0-SNAPSHOT requires scala version: 2.10.4
[WARNING]  com.twitter:chill_2.10:0.5.0 requires scala version: 2.10.4
[WARNING]  org.spark-project.akka:akka-remote_2.10:2.3.4-spark requires scala version: 2.10.4
[WARNING]  org.spark-project.akka:akka-actor_2.10:2.3.4-spark requires scala version: 2.10.4
[WARNING]  org.spark-project.akka:akka-slf4j_2.10:2.3.4-spark requires scala version: 2.10.4
[WARNING]  org.apache.spark:spark-core_2.10:1.4.0 requires scala version: 2.10.4
[WARNING]  org.json4s:json4s-jackson_2.10:3.2.10 requires scala version: 2.10.0
[WARNING] Multiple versions of scala libraries detected!
[INFO] <https://builds.apache.org/job/Phoenix-4.x-HBase-1.0/ws/phoenix-spark/src/it/scala>:-1: info: compiling
[INFO] Compiling 1 source files to <https://builds.apache.org/job/Phoenix-4.x-HBase-1.0/ws/phoenix-spark/target/test-classes> at 1441961914630
[WARNING] warning: Class org.joda.convert.FromString not found - continuing with a stub.
[WARNING] warning: Class org.joda.convert.ToString not found - continuing with a stub.
[WARNING] warning: Class org.joda.convert.ToString not found - continuing with a stub.
[WARNING] warning: Class org.joda.convert.FromString not found - continuing with a stub.
[WARNING] warning: Class org.joda.convert.ToString not found - continuing with a stub.
[WARNING] warning: Class org.joda.convert.FromString not found - continuing with a stub.
[WARNING] warning: Class org.joda.convert.FromString not found - continuing with a stub.
[WARNING] warning: Class org.apache.hadoop.mapred.MiniMRCluster not found - continuing with a stub.
[WARNING] warning: there were 5 deprecation warning(s); re-run with -deprecation for details
[WARNING] 9 warnings found
[INFO] prepare-compile in 0 s
[INFO] compile in 8 s
[INFO] 
[INFO] --- maven-compiler-plugin:3.0:testCompile (default-testCompile) @ phoenix-spark ---
[INFO] Changes detected - recompiling the module!
[INFO] 
[INFO] --- maven-surefire-plugin:2.18:test (default-test) @ phoenix-spark ---
[INFO] 
[INFO] --- scalatest-maven-plugin:1.0:test (test) @ phoenix-spark ---
[INFO] Tests are skipped.
[INFO] 
[INFO] --- maven-source-plugin:2.2.1:jar-no-fork (attach-sources) @ phoenix-spark ---
[INFO] Building jar: <https://builds.apache.org/job/Phoenix-4.x-HBase-1.0/163/artifact/phoenix-spark/target/phoenix-spark-4.6.0-HBase-1.0-SNAPSHOT-sources.jar>
[INFO] 
[INFO] --- maven-jar-plugin:2.4:test-jar (default) @ phoenix-spark ---
[INFO] Building jar: <https://builds.apache.org/job/Phoenix-4.x-HBase-1.0/163/artifact/phoenix-spark/target/phoenix-spark-4.6.0-HBase-1.0-SNAPSHOT-tests.jar>
[INFO] 
[INFO] --- maven-jar-plugin:2.4:jar (default-jar) @ phoenix-spark ---
[INFO] Building jar: <https://builds.apache.org/job/Phoenix-4.x-HBase-1.0/163/artifact/phoenix-spark/target/phoenix-spark-4.6.0-HBase-1.0-SNAPSHOT.jar>
[INFO] 
[INFO] --- maven-site-plugin:3.2:attach-descriptor (attach-descriptor) @ phoenix-spark ---
[INFO] 
[INFO] --- scalatest-maven-plugin:1.0:test (integration-test) @ phoenix-spark ---
WARNING: -c has been deprecated and will be reused for a different (but still very cool) purpose in ScalaTest 2.0. Please change all uses of -c to -P.
Discovery starting.
Discovery completed in 298 milliseconds.
Run starting. Expected test count is: 18
PhoenixSparkIT:
Formatting using clusterid: testClusterID
#
# A fatal error has been detected by the Java Runtime Environment:
#
#  SIGSEGV (0xb) at pc=0x4c90852c, pid=11547, tid=1162488640
#
# JRE version: 7.0_25-b15
# Java VM: Java HotSpot(TM) Server VM (23.25-b01 mixed mode linux-x86 )
# Problematic frame:
# C  [libnet.so+0x352c]  _init+0x620
#
# Failed to write core dump. Core dumps have been disabled. To enable core dumping, try "ulimit -c unlimited" before starting Java again
#
# An error report file with more information is saved as:
# <https://builds.apache.org/job/Phoenix-4.x-HBase-1.0/ws/phoenix-spark/hs_err_pid11547.log>
#
# If you would like to submit a bug report, please visit:
#   http://bugreport.sun.com/bugreport/crash.jsp
# The crash happened outside the Java Virtual Machine in native code.
# See problematic frame for where to report the bug.
#
Aborted
[INFO] ------------------------------------------------------------------------
[INFO] Reactor Summary:
[INFO] 
[INFO] Apache Phoenix .................................... SUCCESS [3.773s]
[INFO] Phoenix Core ...................................... SUCCESS [4:08.082s]
[INFO] Phoenix - Flume ................................... SUCCESS [8.879s]
[INFO] Phoenix - Pig ..................................... SUCCESS [12.072s]
[INFO] Phoenix Query Server Client ....................... SUCCESS [1.197s]
[INFO] Phoenix Query Server .............................. SUCCESS [26.373s]
[INFO] Phoenix - Pherf ................................... SUCCESS [50.030s]
[INFO] Phoenix - Spark ................................... FAILURE [28.798s]
[INFO] Phoenix Assembly .................................. SKIPPED
[INFO] Phoenix - Tracing Web Application ................. SKIPPED
[INFO] ------------------------------------------------------------------------
[INFO] BUILD FAILURE
[INFO] ------------------------------------------------------------------------
[INFO] Total time: 6:19.790s
[INFO] Finished at: Fri Sep 11 08:58:50 UTC 2015
[INFO] Final Memory: 89M/1231M
[INFO] ------------------------------------------------------------------------
[ERROR] Failed to execute goal org.scalatest:scalatest-maven-plugin:1.0:test (integration-test) on project phoenix-spark: There are test failures -> [Help 1]
[ERROR] 
[ERROR] To see the full stack trace of the errors, re-run Maven with the -e switch.
[ERROR] Re-run Maven using the -X switch to enable full debug logging.
[ERROR] 
[ERROR] For more information about the errors and possible solutions, please read the following articles:
[ERROR] [Help 1] http://cwiki.apache.org/confluence/display/MAVEN/MojoFailureException
[ERROR] 
[ERROR] After correcting the problems, you can resume the build with the command
[ERROR]   mvn <goals> -rf :phoenix-spark
Build step 'Invoke top-level Maven targets' marked build as failure
Archiving artifacts
Sending artifact delta relative to Phoenix-4.x-HBase-1.0 #159
Archived 421 artifacts
Archive block size is 32768
Received 6633 blocks and 49877869 bytes
Compression is 81.3%
Took 1 min 13 sec
Recording test results

Build failed in Jenkins: Phoenix-4.x-HBase-1.0 #162

Posted by Apache Jenkins Server <je...@builds.apache.org>.
See <https://builds.apache.org/job/Phoenix-4.x-HBase-1.0/162/changes>

Changes:

[ndimiduk] PHOENIX-2186 Creating backend services for the Phoenix Tracing Web App (Nishani)

[ndimiduk] PHOENIX-2187 Creating the front-end application for Phoenix Tracing Web App (Nishani)

[mujtaba] PHOENIX-2240 Duplicate keys generated by performance.py

[mujtaba] PHOENIX-2247 Fix rat violations in Pherf

------------------------------------------
[...truncated 117240 lines...]
#  SIGSEGV (0xb) at pc=0x6603252c, pid=2940, tid=1584241472
#
# JRE version: 7.0_25-b15
# Java VM: Java HotSpot(TM) Server VM (23.25-b01 mixed mode linux-x86 )
# Problematic frame:
# C  [libnet.so+0x352c]  _init+0x620
#
# Failed to write core dump. Core dumps have been disabled. To enable core dumping, try "ulimit -c unlimited" before starting Java again
#
# An error report file with more information is saved as:
# <https://builds.apache.org/job/Phoenix-4.x-HBase-1.0/ws/phoenix-pherf/hs_err_pid2940.log>
#
# A fatal error has been detected by the Java Runtime Environment:
#
#  SIGSEGV (0xb) at pc=0x6604552c, pid=2933, tid=1582873408
#
# JRE version: 7.0_25-b15
# Java VM: Java HotSpot(TM) Server VM (23.25-b01 mixed mode linux-x86 )
# Problematic frame:
*** Error in `/home/jenkins/tools/java/jdk1.7.0_25-32/jre/bin/java': malloc(): memory corruption: 0x6db13578 ***
#
# If you would like to submit a bug report, please visit:
#   http://bugreport.sun.com/bugreport/crash.jsp
# The crash happened outside the Java Virtual Machine in native code.
# See problematic frame for where to report the bug.
#
Aborted
# C  [libnet.so+0x352c]
Aborted
#
# A fatal error has been detected by the Java Runtime Environment:
#
#  SIGSEGV (0xb) at pc=0x65e6d52c, pid=2930, tid=1580575552
#
# JRE version: 7.0_25-b15
# Java VM: Java HotSpot(TM) Server VM (23.25-b01 mixed mode linux-x86 )
# Problematic frame:
# C  [libnet.so+0x352c]  _init+0x620
#
# Failed to write core dump. Core dumps have been disabled. To enable core dumping, try "ulimit -c unlimited" before starting Java again
#
# An error report file with more information is saved as:
# <https://builds.apache.org/job/Phoenix-4.x-HBase-1.0/ws/phoenix-pherf/hs_err_pid2930.log>
*** Error in `/home/jenkins/tools/java/jdk1.7.0_25-32/jre/bin/java': free(): invalid next size (fast): 0x6db16330 ***
Aborted

Results :




Tests run: 0, Failures: 0, Errors: 0, Skipped: 0

[INFO] 
[INFO] --- maven-failsafe-plugin:2.18:integration-test (NeedTheirOwnClusterTests) @ phoenix-pherf ---
[INFO] Failsafe report directory: <https://builds.apache.org/job/Phoenix-4.x-HBase-1.0/ws/phoenix-pherf/target/failsafe-reports>
[INFO] parallel='none', perCoreThreadCount=true, threadCount=0, useUnlimitedThreads=false, threadCountSuites=0, threadCountClasses=0, threadCountMethods=0, parallelOptimized=true

-------------------------------------------------------
 T E S T S
-------------------------------------------------------

Results :




Tests run: 0, Failures: 0, Errors: 0, Skipped: 0

[INFO] 
[INFO] --- maven-failsafe-plugin:2.18:verify (ClientManagedTimeTests) @ phoenix-pherf ---
[INFO] Failsafe report directory: <https://builds.apache.org/job/Phoenix-4.x-HBase-1.0/ws/phoenix-pherf/target/failsafe-reports>
[INFO] 
[INFO] --- maven-failsafe-plugin:2.18:verify (HBaseManagedTimeTests) @ phoenix-pherf ---
[INFO] Failsafe report directory: <https://builds.apache.org/job/Phoenix-4.x-HBase-1.0/ws/phoenix-pherf/target/failsafe-reports>
[INFO] 
[INFO] --- maven-failsafe-plugin:2.18:verify (NeedTheirOwnClusterTests) @ phoenix-pherf ---
[INFO] Failsafe report directory: <https://builds.apache.org/job/Phoenix-4.x-HBase-1.0/ws/phoenix-pherf/target/failsafe-reports>
[INFO] 
[INFO] --- maven-install-plugin:2.5.1:install (default-install) @ phoenix-pherf ---
[INFO] Installing <https://builds.apache.org/job/Phoenix-4.x-HBase-1.0/162/artifact/phoenix-pherf/target/phoenix-pherf-4.6.0-HBase-1.0-SNAPSHOT.jar> to /home/jenkins/.m2/repository/org/apache/phoenix/phoenix-pherf/4.6.0-HBase-1.0-SNAPSHOT/phoenix-pherf-4.6.0-HBase-1.0-SNAPSHOT.jar
[INFO] Installing <https://builds.apache.org/job/Phoenix-4.x-HBase-1.0/ws/phoenix-pherf/pom.xml> to /home/jenkins/.m2/repository/org/apache/phoenix/phoenix-pherf/4.6.0-HBase-1.0-SNAPSHOT/phoenix-pherf-4.6.0-HBase-1.0-SNAPSHOT.pom
[INFO] Installing <https://builds.apache.org/job/Phoenix-4.x-HBase-1.0/162/artifact/phoenix-pherf/target/phoenix-pherf-4.6.0-HBase-1.0-SNAPSHOT-sources.jar> to /home/jenkins/.m2/repository/org/apache/phoenix/phoenix-pherf/4.6.0-HBase-1.0-SNAPSHOT/phoenix-pherf-4.6.0-HBase-1.0-SNAPSHOT-sources.jar
[INFO] Installing <https://builds.apache.org/job/Phoenix-4.x-HBase-1.0/162/artifact/phoenix-pherf/target/phoenix-pherf-4.6.0-HBase-1.0-SNAPSHOT-tests.jar> to /home/jenkins/.m2/repository/org/apache/phoenix/phoenix-pherf/4.6.0-HBase-1.0-SNAPSHOT/phoenix-pherf-4.6.0-HBase-1.0-SNAPSHOT-tests.jar
[INFO] Installing <https://builds.apache.org/job/Phoenix-4.x-HBase-1.0/162/artifact/phoenix-pherf/target/phoenix-pherf-4.6.0-HBase-1.0-SNAPSHOT-jar-with-dependencies.jar> to /home/jenkins/.m2/repository/org/apache/phoenix/phoenix-pherf/4.6.0-HBase-1.0-SNAPSHOT/phoenix-pherf-4.6.0-HBase-1.0-SNAPSHOT-jar-with-dependencies.jar
[INFO] Installing <https://builds.apache.org/job/Phoenix-4.x-HBase-1.0/162/artifact/phoenix-pherf/target/phoenix-pherf-4.6.0-HBase-1.0-SNAPSHOT-minimal.jar> to /home/jenkins/.m2/repository/org/apache/phoenix/phoenix-pherf/4.6.0-HBase-1.0-SNAPSHOT/phoenix-pherf-4.6.0-HBase-1.0-SNAPSHOT-minimal.jar
[INFO] Installing <https://builds.apache.org/job/Phoenix-4.x-HBase-1.0/ws/phoenix-pherf/target/phoenix-pherf-4.6.0-HBase-1.0-SNAPSHOT-standalone.zip> to /home/jenkins/.m2/repository/org/apache/phoenix/phoenix-pherf/4.6.0-HBase-1.0-SNAPSHOT/phoenix-pherf-4.6.0-HBase-1.0-SNAPSHOT-standalone.zip
[INFO] Installing <https://builds.apache.org/job/Phoenix-4.x-HBase-1.0/ws/phoenix-pherf/target/phoenix-pherf-4.6.0-HBase-1.0-SNAPSHOT-cluster.zip> to /home/jenkins/.m2/repository/org/apache/phoenix/phoenix-pherf/4.6.0-HBase-1.0-SNAPSHOT/phoenix-pherf-4.6.0-HBase-1.0-SNAPSHOT-cluster.zip
[INFO]                                                                         
[INFO] ------------------------------------------------------------------------
[INFO] Building Phoenix - Spark 4.6.0-HBase-1.0-SNAPSHOT
[INFO] ------------------------------------------------------------------------
[INFO] 
[INFO] --- maven-clean-plugin:2.5:clean (default-clean) @ phoenix-spark ---
[INFO] Deleting <https://builds.apache.org/job/Phoenix-4.x-HBase-1.0/ws/phoenix-spark/target>
[INFO] 
[INFO] --- maven-checkstyle-plugin:2.13:check (validate) @ phoenix-spark ---
[INFO] Starting audit...
Audit done.

[INFO] 
[INFO] --- maven-remote-resources-plugin:1.5:process (default) @ phoenix-spark ---
[INFO] 
[INFO] --- maven-resources-plugin:2.6:resources (default-resources) @ phoenix-spark ---
[INFO] Using 'UTF-8' encoding to copy filtered resources.
[INFO] skip non existing resourceDirectory <https://builds.apache.org/job/Phoenix-4.x-HBase-1.0/ws/phoenix-spark/src/main/resources>
[INFO] Copying 3 resources
[INFO] 
[INFO] --- scala-maven-plugin:3.2.0:add-source (scala-compile-first) @ phoenix-spark ---
[INFO] Add Source directory: <https://builds.apache.org/job/Phoenix-4.x-HBase-1.0/ws/phoenix-spark/src/main/scala>
[INFO] 
[INFO] --- scala-maven-plugin:3.2.0:compile (scala-compile-first) @ phoenix-spark ---
[WARNING]  Expected all dependencies to require Scala version: 2.10.4
[WARNING]  org.apache.phoenix:phoenix-spark:4.6.0-HBase-1.0-SNAPSHOT requires scala version: 2.10.4
[WARNING]  com.twitter:chill_2.10:0.5.0 requires scala version: 2.10.4
[WARNING]  org.spark-project.akka:akka-remote_2.10:2.3.4-spark requires scala version: 2.10.4
[WARNING]  org.spark-project.akka:akka-actor_2.10:2.3.4-spark requires scala version: 2.10.4
[WARNING]  org.spark-project.akka:akka-slf4j_2.10:2.3.4-spark requires scala version: 2.10.4
[WARNING]  org.apache.spark:spark-core_2.10:1.4.0 requires scala version: 2.10.4
[WARNING]  org.json4s:json4s-jackson_2.10:3.2.10 requires scala version: 2.10.0
[WARNING] Multiple versions of scala libraries detected!
[INFO] <https://builds.apache.org/job/Phoenix-4.x-HBase-1.0/ws/phoenix-spark/src/main/scala>:-1: info: compiling
[INFO] Compiling 10 source files to <https://builds.apache.org/job/Phoenix-4.x-HBase-1.0/ws/phoenix-spark/target/classes> at 1441916777031
[WARNING] warning: Class org.joda.convert.FromString not found - continuing with a stub.
[WARNING] warning: Class org.joda.convert.ToString not found - continuing with a stub.
[WARNING] warning: Class org.joda.convert.ToString not found - continuing with a stub.
[WARNING] warning: Class org.joda.convert.FromString not found - continuing with a stub.
[WARNING] warning: Class org.joda.convert.ToString not found - continuing with a stub.
[WARNING] warning: Class org.joda.convert.FromString not found - continuing with a stub.
[WARNING] warning: Class org.joda.convert.FromString not found - continuing with a stub.
[WARNING] warning: there were 5 feature warning(s); re-run with -feature for details
[WARNING] 8 warnings found
[INFO] prepare-compile in 0 s
[INFO] compile in 9 s
[INFO] 
[INFO] --- maven-compiler-plugin:3.0:compile (default-compile) @ phoenix-spark ---
[INFO] Changes detected - recompiling the module!
[INFO] 
[INFO] --- maven-resources-plugin:2.6:testResources (default-testResources) @ phoenix-spark ---
[INFO] Using 'UTF-8' encoding to copy filtered resources.
[INFO] Copying 2 resources
[INFO] Copying 3 resources
[INFO] 
[INFO] --- scala-maven-plugin:3.2.0:testCompile (scala-test-compile) @ phoenix-spark ---
[WARNING]  Expected all dependencies to require Scala version: 2.10.4
[WARNING]  org.apache.phoenix:phoenix-spark:4.6.0-HBase-1.0-SNAPSHOT requires scala version: 2.10.4
[WARNING]  com.twitter:chill_2.10:0.5.0 requires scala version: 2.10.4
[WARNING]  org.spark-project.akka:akka-remote_2.10:2.3.4-spark requires scala version: 2.10.4
[WARNING]  org.spark-project.akka:akka-actor_2.10:2.3.4-spark requires scala version: 2.10.4
[WARNING]  org.spark-project.akka:akka-slf4j_2.10:2.3.4-spark requires scala version: 2.10.4
[WARNING]  org.apache.spark:spark-core_2.10:1.4.0 requires scala version: 2.10.4
[WARNING]  org.json4s:json4s-jackson_2.10:3.2.10 requires scala version: 2.10.0
[WARNING] Multiple versions of scala libraries detected!
[INFO] <https://builds.apache.org/job/Phoenix-4.x-HBase-1.0/ws/phoenix-spark/src/it/scala>:-1: info: compiling
[INFO] Compiling 1 source files to <https://builds.apache.org/job/Phoenix-4.x-HBase-1.0/ws/phoenix-spark/target/test-classes> at 1441916787181
[WARNING] warning: Class org.joda.convert.FromString not found - continuing with a stub.
[WARNING] warning: Class org.joda.convert.ToString not found - continuing with a stub.
[WARNING] warning: Class org.joda.convert.ToString not found - continuing with a stub.
[WARNING] warning: Class org.joda.convert.FromString not found - continuing with a stub.
[WARNING] warning: Class org.joda.convert.ToString not found - continuing with a stub.
[WARNING] warning: Class org.joda.convert.FromString not found - continuing with a stub.
[WARNING] warning: Class org.joda.convert.FromString not found - continuing with a stub.
[WARNING] warning: Class org.apache.hadoop.mapred.MiniMRCluster not found - continuing with a stub.
[WARNING] warning: there were 5 deprecation warning(s); re-run with -deprecation for details
[WARNING] 9 warnings found
[INFO] prepare-compile in 0 s
[INFO] compile in 9 s
[INFO] 
[INFO] --- maven-compiler-plugin:3.0:testCompile (default-testCompile) @ phoenix-spark ---
[INFO] Changes detected - recompiling the module!
[INFO] 
[INFO] --- maven-surefire-plugin:2.18:test (default-test) @ phoenix-spark ---
[INFO] 
[INFO] --- scalatest-maven-plugin:1.0:test (test) @ phoenix-spark ---
[INFO] Tests are skipped.
[INFO] 
[INFO] --- maven-source-plugin:2.2.1:jar-no-fork (attach-sources) @ phoenix-spark ---
[INFO] Building jar: <https://builds.apache.org/job/Phoenix-4.x-HBase-1.0/162/artifact/phoenix-spark/target/phoenix-spark-4.6.0-HBase-1.0-SNAPSHOT-sources.jar>
[INFO] 
[INFO] --- maven-jar-plugin:2.4:test-jar (default) @ phoenix-spark ---
[INFO] Building jar: <https://builds.apache.org/job/Phoenix-4.x-HBase-1.0/162/artifact/phoenix-spark/target/phoenix-spark-4.6.0-HBase-1.0-SNAPSHOT-tests.jar>
[INFO] 
[INFO] --- maven-jar-plugin:2.4:jar (default-jar) @ phoenix-spark ---
[INFO] Building jar: <https://builds.apache.org/job/Phoenix-4.x-HBase-1.0/162/artifact/phoenix-spark/target/phoenix-spark-4.6.0-HBase-1.0-SNAPSHOT.jar>
[INFO] 
[INFO] --- maven-site-plugin:3.2:attach-descriptor (attach-descriptor) @ phoenix-spark ---
[INFO] 
[INFO] --- scalatest-maven-plugin:1.0:test (integration-test) @ phoenix-spark ---
WARNING: -c has been deprecated and will be reused for a different (but still very cool) purpose in ScalaTest 2.0. Please change all uses of -c to -P.
Discovery starting.
Discovery completed in 299 milliseconds.
Run starting. Expected test count is: 18
PhoenixSparkIT:
Formatting using clusterid: testClusterID
#
# A fatal error has been detected by the Java Runtime Environment:
#
#  SIGSEGV (0xb) at pc=0x4cb1f52c, pid=3992, tid=1161956160
#
# JRE version: 7.0_25-b15
# Java VM: Java HotSpot(TM) Server VM (23.25-b01 mixed mode linux-x86 )
# Problematic frame:
# C  [libnet.so+0x352c]  _init+0x620
#
# Failed to write core dump. Core dumps have been disabled. To enable core dumping, try "ulimit -c unlimited" before starting Java again
#
# An error report file with more information is saved as:
# <https://builds.apache.org/job/Phoenix-4.x-HBase-1.0/ws/phoenix-spark/hs_err_pid3992.log>
java: malloc.c:2372: sysmalloc: Assertion `(old_top == (((mbinptr) (((char *) &((av)->bins[((1) - 1) * 2])) - __builtin_offsetof (struct malloc_chunk, fd)))) && old_size == 0) || ((unsigned long) (old_size) >= (unsigned long)((((__builtin_offsetof (struct malloc_chunk, fd_nextsize))+((2 *(sizeof(size_t))) - 1)) & ~((2 *(sizeof(size_t))) - 1))) && ((old_top)->size & 0x1) && ((unsigned long) old_end & pagemask) == 0)' failed.
Aborted
[INFO] ------------------------------------------------------------------------
[INFO] Reactor Summary:
[INFO] 
[INFO] Apache Phoenix .................................... SUCCESS [4.637s]
[INFO] Phoenix Core ...................................... SUCCESS [2:08.592s]
[INFO] Phoenix - Flume ................................... SUCCESS [10.027s]
[INFO] Phoenix - Pig ..................................... SUCCESS [12.057s]
[INFO] Phoenix Query Server Client ....................... SUCCESS [1.415s]
[INFO] Phoenix Query Server .............................. SUCCESS [26.968s]
[INFO] Phoenix - Pherf ................................... SUCCESS [52.593s]
[INFO] Phoenix - Spark ................................... FAILURE [30.327s]
[INFO] Phoenix Assembly .................................. SKIPPED
[INFO] Phoenix - Tracing Web Application ................. SKIPPED
[INFO] ------------------------------------------------------------------------
[INFO] BUILD FAILURE
[INFO] ------------------------------------------------------------------------
[INFO] Total time: 4:27.234s
[INFO] Finished at: Thu Sep 10 20:26:43 UTC 2015
[INFO] Final Memory: 87M/862M
[INFO] ------------------------------------------------------------------------
[ERROR] Failed to execute goal org.scalatest:scalatest-maven-plugin:1.0:test (integration-test) on project phoenix-spark: There are test failures -> [Help 1]
[ERROR] 
[ERROR] To see the full stack trace of the errors, re-run Maven with the -e switch.
[ERROR] Re-run Maven using the -X switch to enable full debug logging.
[ERROR] 
[ERROR] For more information about the errors and possible solutions, please read the following articles:
[ERROR] [Help 1] http://cwiki.apache.org/confluence/display/MAVEN/MojoFailureException
[ERROR] 
[ERROR] After correcting the problems, you can resume the build with the command
[ERROR]   mvn <goals> -rf :phoenix-spark
Build step 'Invoke top-level Maven targets' marked build as failure
Archiving artifacts
Sending artifact delta relative to Phoenix-4.x-HBase-1.0 #159
Archived 419 artifacts
Archive block size is 32768
Received 6622 blocks and 50217987 bytes
Compression is 81.2%
Took 58 sec
Recording test results

Build failed in Jenkins: Phoenix-4.x-HBase-1.0 #161

Posted by Apache Jenkins Server <je...@builds.apache.org>.
See <https://builds.apache.org/job/Phoenix-4.x-HBase-1.0/161/changes>

Changes:

[maryannxue] PHOENIX-2198 Support correlate variable

------------------------------------------
[...truncated 118901 lines...]
	at org.apache.phoenix.end2end.SortOrderIT.runQuery(SortOrderIT.java:603)
	at org.apache.phoenix.end2end.SortOrderIT.runQueryTest(SortOrderIT.java:552)
	at org.apache.phoenix.end2end.SortOrderIT.descVarLengthDescPKGT(SortOrderIT.java:383)

descVarLengthDescPKLTE(org.apache.phoenix.end2end.SortOrderIT)  Time elapsed: 0.508 sec  <<< FAILURE!
org.junit.internal.ArrayComparisonFailure: Unexpected result for query SELECT k1 FROM DescColumnSortOrderTest WHERE k2 <= 'bb': arrays first differed at element [0]; expected:<2> but was:<3>
	at org.junit.Assert.fail(Assert.java:88)
	at org.junit.Assert.failNotEquals(Assert.java:834)
	at org.junit.Assert.assertEquals(Assert.java:118)
	at org.junit.Assert.assertEquals(Assert.java:144)
	at org.junit.internal.ExactComparisonCriteria.assertElementsEqual(ExactComparisonCriteria.java:8)
	at org.junit.internal.ComparisonCriteria.arrayEquals(ComparisonCriteria.java:53)
	at org.junit.Assert.internalArrayEquals(Assert.java:532)
	at org.junit.Assert.assertArrayEquals(Assert.java:283)
	at org.apache.phoenix.end2end.SortOrderIT.runQuery(SortOrderIT.java:603)
	at org.apache.phoenix.end2end.SortOrderIT.runQueryTest(SortOrderIT.java:552)
	at org.apache.phoenix.end2end.SortOrderIT.descVarLengthDescPKLTE(SortOrderIT.java:392)

testSkipScanCompare(org.apache.phoenix.end2end.SortOrderIT)  Time elapsed: 2.31 sec  <<< FAILURE!
java.lang.AssertionError: t_null_DECIMAL_DESC
	at org.junit.Assert.fail(Assert.java:88)
	at org.junit.Assert.assertTrue(Assert.java:41)
	at org.apache.phoenix.end2end.SortOrderIT.testCompareCompositeKey(SortOrderIT.java:482)
	at org.apache.phoenix.end2end.SortOrderIT.testSkipScanCompare(SortOrderIT.java:456)

descVarLengthAscPKLTE(org.apache.phoenix.end2end.SortOrderIT)  Time elapsed: 0.515 sec  <<< FAILURE!
org.junit.internal.ArrayComparisonFailure: Unexpected result for query SELECT k1 FROM DescColumnSortOrderTest WHERE 'bb' <= k2: arrays first differed at element [0]; expected:<1> but was:<4>
	at org.junit.Assert.fail(Assert.java:88)
	at org.junit.Assert.failNotEquals(Assert.java:834)
	at org.junit.Assert.assertEquals(Assert.java:118)
	at org.junit.Assert.assertEquals(Assert.java:144)
	at org.junit.internal.ExactComparisonCriteria.assertElementsEqual(ExactComparisonCriteria.java:8)
	at org.junit.internal.ComparisonCriteria.arrayEquals(ComparisonCriteria.java:53)
	at org.junit.Assert.internalArrayEquals(Assert.java:532)
	at org.junit.Assert.assertArrayEquals(Assert.java:283)
	at org.apache.phoenix.end2end.SortOrderIT.runQuery(SortOrderIT.java:603)
	at org.apache.phoenix.end2end.SortOrderIT.runQueryTest(SortOrderIT.java:552)
	at org.apache.phoenix.end2end.SortOrderIT.descVarLengthAscPKLTE(SortOrderIT.java:401)

testNonPKCompare(org.apache.phoenix.end2end.SortOrderIT)  Time elapsed: 0.923 sec  <<< FAILURE!
java.lang.AssertionError: t_null_DECIMAL_DESC expected:<2> but was:<3>
	at org.junit.Assert.fail(Assert.java:88)
	at org.junit.Assert.failNotEquals(Assert.java:834)
	at org.junit.Assert.assertEquals(Assert.java:645)
	at org.apache.phoenix.end2end.SortOrderIT.testCompareCompositeKey(SortOrderIT.java:483)
	at org.apache.phoenix.end2end.SortOrderIT.testNonPKCompare(SortOrderIT.java:440)

Running org.apache.phoenix.end2end.LikeExpressionIT
Tests run: 1, Failures: 0, Errors: 0, Skipped: 0, Time elapsed: 8.462 sec - in org.apache.phoenix.end2end.MappingTableDataTypeIT
Running org.apache.phoenix.end2end.UpsertSelectAutoCommitIT
Tests run: 2, Failures: 0, Errors: 0, Skipped: 0, Time elapsed: 4.541 sec - in org.apache.phoenix.end2end.LikeExpressionIT
Running org.apache.phoenix.end2end.IsNullIT
Tests run: 3, Failures: 0, Errors: 0, Skipped: 0, Time elapsed: 5.646 sec - in org.apache.phoenix.end2end.IsNullIT
Running org.apache.phoenix.end2end.BinaryRowKeyIT
Tests run: 3, Failures: 0, Errors: 0, Skipped: 0, Time elapsed: 12.491 sec - in org.apache.phoenix.end2end.UpsertSelectAutoCommitIT
Running org.apache.phoenix.end2end.RegexpReplaceFunctionIT
Tests run: 3, Failures: 0, Errors: 0, Skipped: 0, Time elapsed: 3.752 sec - in org.apache.phoenix.end2end.BinaryRowKeyIT
Running org.apache.phoenix.end2end.salted.SaltedTableUpsertSelectIT
Tests run: 2, Failures: 0, Errors: 0, Skipped: 0, Time elapsed: 2.759 sec - in org.apache.phoenix.end2end.RegexpReplaceFunctionIT
Running org.apache.phoenix.end2end.salted.SaltedTableVarLengthRowKeyIT
Tests run: 1, Failures: 0, Errors: 0, Skipped: 0, Time elapsed: 2.676 sec - in org.apache.phoenix.end2end.salted.SaltedTableVarLengthRowKeyIT
Running org.apache.phoenix.end2end.HashJoinIT
Tests run: 5, Failures: 0, Errors: 0, Skipped: 0, Time elapsed: 11.269 sec - in org.apache.phoenix.end2end.salted.SaltedTableUpsertSelectIT
Running org.apache.phoenix.end2end.MD5FunctionIT
Tests run: 108, Failures: 0, Errors: 0, Skipped: 0, Time elapsed: 112.382 sec - in org.apache.phoenix.end2end.SortMergeJoinIT
Running org.apache.phoenix.end2end.DateTimeIT
Tests run: 3, Failures: 0, Errors: 0, Skipped: 0, Time elapsed: 5.615 sec - in org.apache.phoenix.end2end.MD5FunctionIT
Running org.apache.phoenix.end2end.TenantSpecificViewIndexIT
Tests run: 19, Failures: 0, Errors: 0, Skipped: 0, Time elapsed: 9.382 sec - in org.apache.phoenix.end2end.DateTimeIT
Running org.apache.phoenix.end2end.AlterSessionIT
Tests run: 2, Failures: 0, Errors: 0, Skipped: 0, Time elapsed: 2.522 sec - in org.apache.phoenix.end2end.AlterSessionIT
Running org.apache.phoenix.end2end.PhoenixRuntimeIT
Tests run: 8, Failures: 0, Errors: 0, Skipped: 0, Time elapsed: 18.488 sec - in org.apache.phoenix.end2end.TenantSpecificViewIndexIT
Running org.apache.phoenix.end2end.DecodeFunctionIT
Tests run: 2, Failures: 0, Errors: 0, Skipped: 0, Time elapsed: 12.793 sec - in org.apache.phoenix.end2end.PhoenixRuntimeIT
Running org.apache.phoenix.end2end.UpgradeIT
Tests run: 6, Failures: 0, Errors: 0, Skipped: 0, Time elapsed: 5.309 sec - in org.apache.phoenix.end2end.DecodeFunctionIT
Running org.apache.phoenix.end2end.ServerExceptionIT
Tests run: 1, Failures: 0, Errors: 0, Skipped: 0, Time elapsed: 2.204 sec - in org.apache.phoenix.end2end.ServerExceptionIT
Running org.apache.phoenix.end2end.RegexpSplitFunctionIT
Tests run: 108, Failures: 0, Errors: 0, Skipped: 0, Time elapsed: 114.264 sec - in org.apache.phoenix.end2end.SpooledSortMergeJoinIT
Running org.apache.phoenix.end2end.ExecuteStatementsIT
Tests run: 11, Failures: 0, Errors: 0, Skipped: 0, Time elapsed: 7.939 sec - in org.apache.phoenix.end2end.RegexpSplitFunctionIT
Running org.apache.phoenix.end2end.SkipScanAfterManualSplitIT
Tests run: 2, Failures: 0, Errors: 0, Skipped: 0, Time elapsed: 14.533 sec - in org.apache.phoenix.end2end.ExecuteStatementsIT
Running org.apache.phoenix.end2end.ConvertTimezoneFunctionIT
Tests run: 7, Failures: 0, Errors: 0, Skipped: 0, Time elapsed: 3.086 sec - in org.apache.phoenix.end2end.ConvertTimezoneFunctionIT
Running org.apache.phoenix.end2end.RTrimFunctionIT
Tests run: 2, Failures: 0, Errors: 0, Skipped: 0, Time elapsed: 2.048 sec - in org.apache.phoenix.end2end.RTrimFunctionIT
Running org.apache.phoenix.end2end.SignFunctionEnd2EndIT
Tests run: 6, Failures: 0, Errors: 0, Skipped: 0, Time elapsed: 36.11 sec - in org.apache.phoenix.end2end.UpgradeIT
Running org.apache.phoenix.end2end.SkipScanQueryIT
Tests run: 2, Failures: 0, Errors: 0, Skipped: 0, Time elapsed: 4.234 sec - in org.apache.phoenix.end2end.SignFunctionEnd2EndIT
Running org.apache.phoenix.end2end.ExpFunctionEnd2EndIT
Tests run: 28, Failures: 0, Errors: 0, Skipped: 0, Time elapsed: 124.974 sec - in org.apache.phoenix.end2end.InListIT
Running org.apache.phoenix.end2end.ArrayAppendFunctionIT
Tests run: 3, Failures: 0, Errors: 0, Skipped: 0, Time elapsed: 26.98 sec - in org.apache.phoenix.end2end.SkipScanAfterManualSplitIT
Running org.apache.phoenix.end2end.TenantIdTypeIT
Tests run: 3, Failures: 0, Errors: 0, Skipped: 0, Time elapsed: 6.933 sec - in org.apache.phoenix.end2end.ExpFunctionEnd2EndIT
Running org.apache.phoenix.end2end.LpadFunctionIT
Tests run: 9, Failures: 0, Errors: 0, Skipped: 0, Time elapsed: 12.979 sec - in org.apache.phoenix.end2end.SkipScanQueryIT
Tests run: 12, Failures: 0, Errors: 0, Skipped: 0, Time elapsed: 11.883 sec - in org.apache.phoenix.end2end.LpadFunctionIT
Tests run: 34, Failures: 0, Errors: 0, Skipped: 0, Time elapsed: 24.354 sec - in org.apache.phoenix.end2end.ArrayAppendFunctionIT
Tests run: 15, Failures: 0, Errors: 0, Skipped: 0, Time elapsed: 69.998 sec - in org.apache.phoenix.end2end.TenantIdTypeIT
Tests run: 108, Failures: 0, Errors: 0, Skipped: 0, Time elapsed: 295.367 sec - in org.apache.phoenix.end2end.HashJoinIT

Results :

Failed tests: 
  SortOrderIT.descVarLengthAscPKLTE:401->runQueryTest:552->runQuery:603 Unexpected result for query SELECT k1 FROM DescColumnSortOrderTest WHERE 'bb' <= k2: arrays first differed at element [0]; expected:<1> but was:<4>
  SortOrderIT.descVarLengthDescPKGT:383->runQueryTest:552->runQuery:603 Unexpected result for query SELECT k1 FROM DescColumnSortOrderTest WHERE k2 > 'b': arrays first differed at element [0]; expected:<3> but was:<5>
  SortOrderIT.descVarLengthDescPKLTE:392->runQueryTest:552->runQuery:603 Unexpected result for query SELECT k1 FROM DescColumnSortOrderTest WHERE k2 <= 'bb': arrays first differed at element [0]; expected:<2> but was:<3>
  SortOrderIT.testNonPKCompare:440->testCompareCompositeKey:483 t_null_DECIMAL_DESC expected:<2> but was:<3>
  SortOrderIT.testSkipScanCompare:456->testCompareCompositeKey:482 t_null_DECIMAL_DESC



Tests run: 1165, Failures: 5, Errors: 0, Skipped: 0

[INFO] 
[INFO] --- maven-failsafe-plugin:2.18:integration-test (NeedTheirOwnClusterTests) @ phoenix-core ---
[INFO] Failsafe report directory: <https://builds.apache.org/job/Phoenix-4.x-HBase-1.0/ws/phoenix-core/target/failsafe-reports>
[INFO] parallel='none', perCoreThreadCount=true, threadCount=0, useUnlimitedThreads=false, threadCountSuites=0, threadCountClasses=0, threadCountMethods=0, parallelOptimized=true

-------------------------------------------------------
 T E S T S
-------------------------------------------------------
Running org.apache.hadoop.hbase.regionserver.wal.WALReplayWithIndexWritesAndUncompressedWALInHBase_094_9_IT
Running org.apache.hadoop.hbase.regionserver.wal.WALReplayWithIndexWritesAndCompressedWALIT
Running org.apache.phoenix.hbase.index.balancer.IndexLoadBalancerIT
Tests run: 1, Failures: 0, Errors: 0, Skipped: 0, Time elapsed: 19.211 sec - in org.apache.hadoop.hbase.regionserver.wal.WALReplayWithIndexWritesAndUncompressedWALInHBase_094_9_IT
Running org.apache.phoenix.hbase.index.FailForUnsupportedHBaseVersionsIT
Running org.apache.phoenix.rpc.PhoenixClientRpcIT
Running org.apache.phoenix.rpc.PhoenixServerRpcIT
Tests run: 1, Failures: 0, Errors: 0, Skipped: 0, Time elapsed: 28.195 sec - in org.apache.hadoop.hbase.regionserver.wal.WALReplayWithIndexWritesAndCompressedWALIT
Tests run: 2, Failures: 0, Errors: 0, Skipped: 0, Time elapsed: 7.88 sec - in org.apache.phoenix.rpc.PhoenixClientRpcIT
Running org.apache.phoenix.hbase.index.covered.example.EndToEndCoveredIndexingIT
Running org.apache.phoenix.hbase.index.covered.EndToEndCoveredColumnsIndexBuilderIT
Tests run: 2, Failures: 0, Errors: 0, Skipped: 0, Time elapsed: 16.844 sec - in org.apache.phoenix.hbase.index.FailForUnsupportedHBaseVersionsIT
Tests run: 2, Failures: 0, Errors: 0, Skipped: 0, Time elapsed: 17.751 sec - in org.apache.phoenix.rpc.PhoenixServerRpcIT
Running org.apache.phoenix.hbase.index.covered.example.FailWithoutRetriesIT
Running org.apache.phoenix.hbase.index.covered.example.EndtoEndIndexingWithCompressionIT
Tests run: 2, Failures: 0, Errors: 0, Skipped: 0, Time elapsed: 9.935 sec - in org.apache.phoenix.hbase.index.covered.EndToEndCoveredColumnsIndexBuilderIT
Tests run: 1, Failures: 0, Errors: 0, Skipped: 0, Time elapsed: 9.213 sec - in org.apache.phoenix.hbase.index.covered.example.FailWithoutRetriesIT
Running org.apache.phoenix.monitoring.PhoenixMetricsIT
Running org.apache.phoenix.iterate.RoundRobinResultIteratorWithStatsIT
Tests run: 11, Failures: 0, Errors: 0, Skipped: 0, Time elapsed: 49.538 sec - in org.apache.phoenix.hbase.index.covered.example.EndToEndCoveredIndexingIT
Tests run: 1, Failures: 0, Errors: 0, Skipped: 0, Time elapsed: 15.876 sec - in org.apache.phoenix.iterate.RoundRobinResultIteratorWithStatsIT
Tests run: 11, Failures: 0, Errors: 0, Skipped: 0, Time elapsed: 49.908 sec - in org.apache.phoenix.hbase.index.covered.example.EndtoEndIndexingWithCompressionIT
Running org.apache.phoenix.end2end.TenantSpecificTablesDMLIT
Tests run: 9, Failures: 0, Errors: 0, Skipped: 0, Time elapsed: 92.739 sec - in org.apache.phoenix.hbase.index.balancer.IndexLoadBalancerIT
Running org.apache.phoenix.end2end.index.MutableIndexFailureIT
Tests run: 17, Failures: 0, Errors: 0, Skipped: 0, Time elapsed: 39.341 sec - in org.apache.phoenix.monitoring.PhoenixMetricsIT
Running org.apache.phoenix.end2end.ViewIT
Running org.apache.phoenix.end2end.TenantSpecificTablesDDLIT
Running org.apache.phoenix.end2end.index.MutableIndexReplicationIT
Tests run: 1, Failures: 0, Errors: 0, Skipped: 0, Time elapsed: 17.799 sec - in org.apache.phoenix.end2end.index.MutableIndexReplicationIT
Tests run: 16, Failures: 0, Errors: 0, Skipped: 0, Time elapsed: 41.327 sec - in org.apache.phoenix.end2end.TenantSpecificTablesDMLIT
Tests run: 17, Failures: 0, Errors: 0, Skipped: 0, Time elapsed: 31.091 sec - in org.apache.phoenix.end2end.TenantSpecificTablesDDLIT
Running org.apache.phoenix.end2end.UnionAllIT
Running org.apache.phoenix.end2end.index.ImmutableIndexWithStatsIT
Running org.apache.phoenix.end2end.StatsCollectorIT
Tests run: 22, Failures: 0, Errors: 0, Skipped: 0, Time elapsed: 47.854 sec - in org.apache.phoenix.end2end.ViewIT
Tests run: 1, Failures: 0, Errors: 0, Skipped: 0, Time elapsed: 11.074 sec - in org.apache.phoenix.end2end.index.ImmutableIndexWithStatsIT
Tests run: 11, Failures: 0, Errors: 0, Skipped: 0, Time elapsed: 21.908 sec - in org.apache.phoenix.end2end.UnionAllIT
Running org.apache.phoenix.end2end.KeyOnlyIT
Running org.apache.phoenix.end2end.UserDefinedFunctionsIT
Running org.apache.phoenix.end2end.ContextClassloaderIT
Tests run: 13, Failures: 0, Errors: 0, Skipped: 0, Time elapsed: 9.678 sec - in org.apache.phoenix.end2end.UserDefinedFunctionsIT
Tests run: 3, Failures: 0, Errors: 0, Skipped: 0, Time elapsed: 17.926 sec - in org.apache.phoenix.end2end.KeyOnlyIT
Tests run: 3, Failures: 0, Errors: 0, Skipped: 0, Time elapsed: 10.171 sec - in org.apache.phoenix.end2end.ContextClassloaderIT
Tests run: 4, Failures: 0, Errors: 0, Skipped: 0, Time elapsed: 51.973 sec - in org.apache.phoenix.end2end.StatsCollectorIT
Running org.apache.phoenix.end2end.MultiCfQueryExecIT
Running org.apache.phoenix.end2end.QueryWithLimitIT
Running org.apache.phoenix.end2end.QueryTimeoutIT
Running org.apache.phoenix.end2end.ParallelIteratorsIT
Tests run: 2, Failures: 0, Errors: 0, Skipped: 0, Time elapsed: 12.664 sec - in org.apache.phoenix.end2end.QueryWithLimitIT
Tests run: 7, Failures: 0, Errors: 0, Skipped: 0, Time elapsed: 20.318 sec - in org.apache.phoenix.end2end.MultiCfQueryExecIT
Tests run: 1, Failures: 0, Errors: 0, Skipped: 0, Time elapsed: 18.15 sec - in org.apache.phoenix.end2end.QueryTimeoutIT
Running org.apache.phoenix.end2end.SaltedViewIT
Tests run: 2, Failures: 0, Errors: 0, Skipped: 0, Time elapsed: 21.248 sec - in org.apache.phoenix.end2end.ParallelIteratorsIT
Running org.apache.phoenix.end2end.SpillableGroupByIT
Tests run: 2, Failures: 0, Errors: 0, Skipped: 0, Time elapsed: 12.234 sec - in org.apache.phoenix.end2end.SaltedViewIT
Running org.apache.phoenix.end2end.StatsCollectorWithSplitsAndMultiCFIT
Running org.apache.phoenix.end2end.AlterTableIT
Tests run: 1, Failures: 0, Errors: 0, Skipped: 0, Time elapsed: 9.503 sec - in org.apache.phoenix.end2end.SpillableGroupByIT
Tests run: 3, Failures: 0, Errors: 0, Skipped: 0, Time elapsed: 151.212 sec - in org.apache.phoenix.end2end.index.MutableIndexFailureIT
Running org.apache.phoenix.end2end.CountDistinctCompressionIT
Tests run: 1, Failures: 0, Errors: 0, Skipped: 0, Time elapsed: 11.412 sec - in org.apache.phoenix.end2end.CountDistinctCompressionIT
Tests run: 2, Failures: 0, Errors: 0, Skipped: 0, Time elapsed: 27.962 sec - in org.apache.phoenix.end2end.StatsCollectorWithSplitsAndMultiCFIT
Running org.apache.phoenix.mapreduce.IndexToolIT
Running org.apache.phoenix.execute.PartialCommitIT
Tests run: 6, Failures: 0, Errors: 0, Skipped: 0, Time elapsed: 5.48 sec - in org.apache.phoenix.execute.PartialCommitIT
Running org.apache.phoenix.mapreduce.CsvBulkLoadToolIT
Tests run: 51, Failures: 0, Errors: 0, Skipped: 0, Time elapsed: 313.24 sec - in org.apache.phoenix.end2end.AlterTableIT
Tests run: 6, Failures: 0, Errors: 0, Skipped: 0, Time elapsed: 293.086 sec - in org.apache.phoenix.mapreduce.CsvBulkLoadToolIT
Tests run: 9, Failures: 0, Errors: 0, Skipped: 0, Time elapsed: 336.054 sec - in org.apache.phoenix.mapreduce.IndexToolIT

Results :




Tests run: 244, Failures: 0, Errors: 0, Skipped: 0

[INFO] 
[INFO] --- maven-failsafe-plugin:2.18:verify (ClientManagedTimeTests) @ phoenix-core ---
[INFO] Failsafe report directory: <https://builds.apache.org/job/Phoenix-4.x-HBase-1.0/ws/phoenix-core/target/failsafe-reports>
[INFO] ------------------------------------------------------------------------
[INFO] Reactor Summary:
[INFO] 
[INFO] Apache Phoenix .................................... SUCCESS [3.914s]
[INFO] Phoenix Core ...................................... FAILURE [28:32.779s]
[INFO] Phoenix - Flume ................................... SKIPPED
[INFO] Phoenix - Pig ..................................... SKIPPED
[INFO] Phoenix Query Server Client ....................... SKIPPED
[INFO] Phoenix Query Server .............................. SKIPPED
[INFO] Phoenix - Pherf ................................... SKIPPED
[INFO] Phoenix - Spark ................................... SKIPPED
[INFO] Phoenix Assembly .................................. SKIPPED
[INFO] ------------------------------------------------------------------------
[INFO] BUILD FAILURE
[INFO] ------------------------------------------------------------------------
[INFO] Total time: 28:37.257s
[INFO] Finished at: Wed Sep 09 23:07:50 UTC 2015
[INFO] Final Memory: 56M/975M
[INFO] ------------------------------------------------------------------------
[ERROR] Failed to execute goal org.apache.maven.plugins:maven-failsafe-plugin:2.18:verify (ClientManagedTimeTests) on project phoenix-core: There are test failures.
[ERROR] 
[ERROR] Please refer to <https://builds.apache.org/job/Phoenix-4.x-HBase-1.0/ws/phoenix-core/target/failsafe-reports> for the individual test results.
[ERROR] -> [Help 1]
[ERROR] 
[ERROR] To see the full stack trace of the errors, re-run Maven with the -e switch.
[ERROR] Re-run Maven using the -X switch to enable full debug logging.
[ERROR] 
[ERROR] For more information about the errors and possible solutions, please read the following articles:
[ERROR] [Help 1] http://cwiki.apache.org/confluence/display/MAVEN/MojoFailureException
[ERROR] 
[ERROR] After correcting the problems, you can resume the build with the command
[ERROR]   mvn <goals> -rf :phoenix-core
Build step 'Invoke top-level Maven targets' marked build as failure
Archiving artifacts
Sending artifact delta relative to Phoenix-4.x-HBase-1.0 #159
Archived 1324 artifacts
Archive block size is 32768
Received 23270 blocks and 583366549 bytes
Compression is 56.7%
Took 3 min 10 sec
Recording test results