You are viewing a plain text version of this content. The canonical link for it is here.
Posted to notifications@zookeeper.apache.org by Apache Jenkins Server <je...@builds.apache.org> on 2020/08/18 11:48:20 UTC
ZooKeeper_branch35_jdk8 - Build # 1937 - Failure
See https://builds.apache.org/job/ZooKeeper_branch35_jdk8/1937/
###################################################################################
########################## LAST 60 LINES OF THE CONSOLE ###########################
Started by timer
Running as SYSTEM
[EnvInject] - Loading node environment variables.
Building remotely on H30 (ubuntu) in workspace /home/jenkins/jenkins-slave/workspace/ZooKeeper_branch35_jdk8
[WS-CLEANUP] Deleting project workspace...
[WS-CLEANUP] Deferred wipeout is used...
[WS-CLEANUP] Done
FATAL: java.io.IOException: Unexpected termination of the channel
java.io.EOFException
at java.io.ObjectInputStream$PeekInputStream.readFully(ObjectInputStream.java:2681)
at java.io.ObjectInputStream$BlockDataInputStream.readShort(ObjectInputStream.java:3156)
at java.io.ObjectInputStream.readStreamHeader(ObjectInputStream.java:862)
at java.io.ObjectInputStream.<init>(ObjectInputStream.java:358)
at hudson.remoting.ObjectInputStreamEx.<init>(ObjectInputStreamEx.java:49)
at hudson.remoting.Command.readFrom(Command.java:140)
at hudson.remoting.Command.readFrom(Command.java:126)
at hudson.remoting.AbstractSynchronousByteArrayCommandTransport.read(AbstractSynchronousByteArrayCommandTransport.java:36)
at hudson.remoting.SynchronousCommandTransport$ReaderThread.run(SynchronousCommandTransport.java:63)
Caused: java.io.IOException: Unexpected termination of the channel
at hudson.remoting.SynchronousCommandTransport$ReaderThread.run(SynchronousCommandTransport.java:77)
Also: hudson.remoting.Channel$CallSiteStackTrace: Remote call to H30
at hudson.remoting.Channel.attachCallSiteStackTrace(Channel.java:1743)
at hudson.remoting.Request.call(Request.java:202)
at hudson.remoting.Channel.call(Channel.java:956)
at hudson.FilePath.act(FilePath.java:1072)
at hudson.FilePath.act(FilePath.java:1061)
at org.jenkinsci.plugins.gitclient.Git.getClient(Git.java:144)
at hudson.plugins.git.GitSCM.createClient(GitSCM.java:822)
at hudson.plugins.git.GitSCM.createClient(GitSCM.java:813)
at hudson.plugins.git.GitSCM.checkout(GitSCM.java:1186)
at hudson.scm.SCM.checkout(SCM.java:504)
at hudson.model.AbstractProject.checkout(AbstractProject.java:1208)
at hudson.model.AbstractBuild$AbstractBuildExecution.defaultCheckout(AbstractBuild.java:574)
at jenkins.scm.SCMCheckoutStrategy.checkout(SCMCheckoutStrategy.java:86)
at hudson.model.AbstractBuild$AbstractBuildExecution.run(AbstractBuild.java:499)
at hudson.model.Run.execute(Run.java:1815)
at hudson.model.FreeStyleBuild.run(FreeStyleBuild.java:43)
at hudson.model.ResourceController.execute(ResourceController.java:97)
at hudson.model.Executor.run(Executor.java:429)
Caused: hudson.remoting.RequestAbortedException
at hudson.remoting.Request.abort(Request.java:340)
at hudson.remoting.Channel.terminate(Channel.java:1040)
at hudson.remoting.SynchronousCommandTransport$ReaderThread.run(SynchronousCommandTransport.java:94)
ERROR: Step ?Archive the artifacts? failed: no workspace for ZooKeeper_branch35_jdk8 #1937
ERROR: Step ?Publish JUnit test result report? failed: no workspace for ZooKeeper_branch35_jdk8 #1937
ERROR: H30 is offline; cannot locate JDK 1.8 (latest)
ERROR: H30 is offline; cannot locate JDK 1.8 (latest)
Email was triggered for: Failure - Any
Sending email for trigger: Failure - Any
ERROR: H30 is offline; cannot locate JDK 1.8 (latest)
ERROR: H30 is offline; cannot locate JDK 1.8 (latest)
ERROR: H30 is offline; cannot locate JDK 1.8 (latest)
ERROR: H30 is offline; cannot locate JDK 1.8 (latest)
###################################################################################
############################## FAILED TESTS (if any) ##############################
No tests ran.
ZooKeeper_branch35_jdk8 - Build # 1938 - Still Failing
Posted by Apache Jenkins Server <je...@builds.apache.org>.
See https://builds.apache.org/job/ZooKeeper_branch35_jdk8/1938/
###################################################################################
########################## LAST 60 LINES OF THE CONSOLE ###########################
[...truncated 33 B...]
Building remotely on H30 (ubuntu) in workspace /home/jenkins/jenkins-slave/workspace/ZooKeeper_branch35_jdk8
[WS-CLEANUP] Deleting project workspace...
[WS-CLEANUP] Deferred wipeout is used...
[WS-CLEANUP] Done
No credentials specified
Cloning the remote Git repository
Cloning repository https://gitbox.apache.org/repos/asf/zookeeper.git
> git init /home/jenkins/jenkins-slave/workspace/ZooKeeper_branch35_jdk8 # timeout=10
Fetching upstream changes from https://gitbox.apache.org/repos/asf/zookeeper.git
> git --version # timeout=10
> git fetch --tags --progress -- https://gitbox.apache.org/repos/asf/zookeeper.git +refs/heads/*:refs/remotes/origin/*
FATAL: java.io.IOException: Unexpected termination of the channel
java.io.EOFException
at java.io.ObjectInputStream$PeekInputStream.readFully(ObjectInputStream.java:2681)
at java.io.ObjectInputStream$BlockDataInputStream.readShort(ObjectInputStream.java:3156)
at java.io.ObjectInputStream.readStreamHeader(ObjectInputStream.java:862)
at java.io.ObjectInputStream.<init>(ObjectInputStream.java:358)
at hudson.remoting.ObjectInputStreamEx.<init>(ObjectInputStreamEx.java:49)
at hudson.remoting.Command.readFrom(Command.java:140)
at hudson.remoting.Command.readFrom(Command.java:126)
at hudson.remoting.AbstractSynchronousByteArrayCommandTransport.read(AbstractSynchronousByteArrayCommandTransport.java:36)
at hudson.remoting.SynchronousCommandTransport$ReaderThread.run(SynchronousCommandTransport.java:63)
Caused: java.io.IOException: Unexpected termination of the channel
at hudson.remoting.SynchronousCommandTransport$ReaderThread.run(SynchronousCommandTransport.java:77)
Also: hudson.remoting.Channel$CallSiteStackTrace: Remote call to H30
at hudson.remoting.Channel.attachCallSiteStackTrace(Channel.java:1743)
at hudson.remoting.Request.call(Request.java:202)
at hudson.remoting.Channel.call(Channel.java:956)
at org.jenkinsci.plugins.gitclient.RemoteGitImpl$CommandInvocationHandler.execute(RemoteGitImpl.java:146)
at sun.reflect.GeneratedMethodAccessor842.invoke(Unknown Source)
at sun.reflect.DelegatingMethodAccessorImpl.invoke(DelegatingMethodAccessorImpl.java:43)
at java.lang.reflect.Method.invoke(Method.java:498)
at org.jenkinsci.plugins.gitclient.RemoteGitImpl$CommandInvocationHandler.invoke(RemoteGitImpl.java:132)
at com.sun.proxy.$Proxy133.execute(Unknown Source)
at hudson.plugins.git.GitSCM.retrieveChanges(GitSCM.java:1152)
at hudson.plugins.git.GitSCM.checkout(GitSCM.java:1192)
at hudson.scm.SCM.checkout(SCM.java:504)
at hudson.model.AbstractProject.checkout(AbstractProject.java:1208)
at hudson.model.AbstractBuild$AbstractBuildExecution.defaultCheckout(AbstractBuild.java:574)
at jenkins.scm.SCMCheckoutStrategy.checkout(SCMCheckoutStrategy.java:86)
at hudson.model.AbstractBuild$AbstractBuildExecution.run(AbstractBuild.java:499)
at hudson.model.Run.execute(Run.java:1815)
at hudson.model.FreeStyleBuild.run(FreeStyleBuild.java:43)
at hudson.model.ResourceController.execute(ResourceController.java:97)
at hudson.model.Executor.run(Executor.java:429)
Caused: hudson.remoting.RequestAbortedException
at hudson.remoting.Request.abort(Request.java:340)
at hudson.remoting.Channel.terminate(Channel.java:1040)
at hudson.remoting.SynchronousCommandTransport$ReaderThread.run(SynchronousCommandTransport.java:94)
ERROR: Step ?Archive the artifacts? failed: no workspace for ZooKeeper_branch35_jdk8 #1938
ERROR: Step ?Publish JUnit test result report? failed: no workspace for ZooKeeper_branch35_jdk8 #1938
ERROR: H30 is offline; cannot locate JDK 1.8 (latest)
ERROR: H30 is offline; cannot locate JDK 1.8 (latest)
Email was triggered for: Failure - Any
Sending email for trigger: Failure - Any
ERROR: H30 is offline; cannot locate JDK 1.8 (latest)
ERROR: H30 is offline; cannot locate JDK 1.8 (latest)
ERROR: H30 is offline; cannot locate JDK 1.8 (latest)
ERROR: H30 is offline; cannot locate JDK 1.8 (latest)
###################################################################################
############################## FAILED TESTS (if any) ##############################
No tests ran.