You are viewing a plain text version of this content. The canonical link for it is here.
Posted to dev@jmeter.apache.org by Apache Jenkins Server <je...@builds.apache.org> on 2023/12/14 17:54:17 UTC

Build failed in Jenkins: JMeter » JMeter s390x #142

See <https://ci-builds.apache.org/job/JMeter/job/JMeter%20s390x/142/display/redirect?page=changes>

Changes:

[Vladimir Sitnikov] fix(deps): update dependency spotbugs to v4.8.3

[Vladimir Sitnikov] fix(deps): update dependency net.sf.saxon:saxon-he to v11.6


------------------------------------------
[...truncated 214.26 KB...]

> Task :src:protocol:http:test

Gradle Test Executor 16 STANDARD_OUT
    WARN StatusConsoleListener The use of package scanning to locate plugins is deprecated and will be removed in a future release
    WARN StatusConsoleListener The use of package scanning to locate plugins is deprecated and will be removed in a future release
    WARN StatusConsoleListener The use of package scanning to locate plugins is deprecated and will be removed in a future release
    WARN StatusConsoleListener The use of package scanning to locate plugins is deprecated and will be removed in a future release

> Task :src:functions:test
WARNING  15.3sec,  258 completed,   0 failed,   5 skipped, Gradle Test Run :src:functions:test

> Task :src:functions:check

> Task :src:dist-check:batchBatchTestLocal
WARN StatusConsoleListener The use of package scanning to locate plugins is deprecated and will be removed in a future release
WARN StatusConsoleListener The use of package scanning to locate plugins is deprecated and will be removed in a future release
WARN StatusConsoleListener The use of package scanning to locate plugins is deprecated and will be removed in a future release
WARN StatusConsoleListener The use of package scanning to locate plugins is deprecated and will be removed in a future release
Creating summariser <summary>
Created the tree successfully using <https://ci-builds.apache.org/job/JMeter/job/JMeter%20s390x/ws/bin/testfiles/BatchTestLocal.jmx>
Starting standalone test @ 2023 Dec 14 17:52:55 UTC (1702576375753)
Waiting for possible Shutdown/StopTestNow/HeapDump/ThreadDump message on port 4445

> Task :src:protocol:native:test
          2.4sec,    1 completed,   0 failed,   0 skipped, Gradle Test Run :src:protocol:native:test

> Task :src:protocol:native:check

> Task :src:components:test
          1.1sec, org.apache.jmeter.visualizers.backend.graphite.PickleGraphiteMetricsSenderSpec > writeAndSendMetrics connects and sends if there's something to send, dropping metrics on connection failure, without throwing exceptions

> Task :src:protocol:tcp:test

BinaryTCPClientImplTest > testLoopBack() STANDARD_OUT
    WARN StatusConsoleListener The use of package scanning to locate plugins is deprecated and will be removed in a future release
    WARN StatusConsoleListener The use of package scanning to locate plugins is deprecated and will be removed in a future release
    WARN StatusConsoleListener The use of package scanning to locate plugins is deprecated and will be removed in a future release
    WARN StatusConsoleListener The use of package scanning to locate plugins is deprecated and will be removed in a future release
          1.4sec, org.apache.jmeter.protocol.tcp.sampler.BinaryTCPClientImplTest > testLoopBack()
          3.6sec,    9 completed,   0 failed,   0 skipped, Gradle Test Run :src:protocol:tcp:test

> Task :src:protocol:tcp:check

> Task :src:core:test
FAILURE   0.1sec, org.apache.jmeter.util.CalculatorTest > bytesPerSecond()
    org.opentest4j.AssertionFailedError: bytesPerSecond({50bytes, 10ms..40ms}, {70bytes, 40ms..60ms}) ==> expected: <2400.0> but was: <3000.0>
        at app//org.junit.jupiter.api.AssertionFailureBuilder.build(AssertionFailureBuilder.java:151)
        at app//org.junit.jupiter.api.AssertionFailureBuilder.buildAndThrow(AssertionFailureBuilder.java:132)
        at app//org.junit.jupiter.api.AssertEquals.failNotEqual(AssertEquals.java:197)
        at app//org.junit.jupiter.api.AssertEquals.assertEquals(AssertEquals.java:86)
        at app//org.junit.jupiter.api.Assertions.assertEquals(Assertions.java:1024)
        at app//org.apache.jmeter.util.CalculatorTest.bytesPerSecond(CalculatorTest.kt:123)

FAILURE   0.0sec, org.apache.jmeter.util.CalculatorTest > sentBytesPerSecond()
    org.opentest4j.AssertionFailedError: sentBytesPerSecond({sent=50bytes, 10ms..40ms}, {sent=70bytes, 40ms..60ms}) ==> expected: <2400.0> but was: <3000.0>
        at app//org.junit.jupiter.api.AssertionFailureBuilder.build(AssertionFailureBuilder.java:151)
        at app//org.junit.jupiter.api.AssertionFailureBuilder.buildAndThrow(AssertionFailureBuilder.java:132)
        at app//org.junit.jupiter.api.AssertEquals.failNotEqual(AssertEquals.java:197)
        at app//org.junit.jupiter.api.AssertEquals.assertEquals(AssertEquals.java:86)
        at app//org.junit.jupiter.api.Assertions.assertEquals(Assertions.java:1024)
        at app//org.apache.jmeter.util.CalculatorTest.sentBytesPerSecond(CalculatorTest.kt:142)

FAILURE   0.1sec,    8 completed,   2 failed,   0 skipped, org.apache.jmeter.util.CalculatorTest

JMeterTest > testSuccessWhenJmxExists() STANDARD_OUT
    Creating summariser <summary>
    Created the tree successfully using /tmp/testPlan7256392013074430856.jmx
    Starting standalone test @ 2023 Dec 14 17:52:57 UTC (1702576377754)
    Waiting for possible Shutdown/StopTestNow/HeapDump/ThreadDump message on port 4446

JMeterTest > testFailureWithMissingPlugin() STANDARD_OUT
    Error in NonGUIDriver java.lang.IllegalArgumentException: Problem loading XML from:'/tmp/testPlan16789599098094488120.jmx'. 
    Cause:
    CannotResolveClassException: kg.apc.jmeter.samplers.DummySampler

     Detail:com.thoughtworks.xstream.converters.ConversionException: 
    ---- Debugging information ----
    cause-exception     : com.thoughtworks.xstream.converters.ConversionException
    cause-message       : 
    first-jmeter-class  : org.apache.jmeter.save.converters.HashTreeConverter.unmarshal(HashTreeConverter.java:66)
    class               : org.apache.jmeter.save.ScriptWrapper
    required-type       : org.apache.jmeter.save.ScriptWrapper
    converter-type      : org.apache.jmeter.save.ScriptWrapperConverter
    path                : /jmeterTestPlan/hashTree/hashTree/hashTree/kg.apc.jmeter.samplers.DummySampler
    line number         : 16
    version             : not available
    -------------------------------

ArgumentTest > setName(String, String) STANDARD_OUT
    summary =      0 in 00:00:00 = ******/s Avg:     0 Min: 9223372036854775807 Max: -9223372036854775808 Err:     0 (0.00%)
    Tidying up ...    @ 2023 Dec 14 17:52:57 UTC (1702576377867)
    ... end of run

LocalHostTest > testLocalHost() STANDARD_ERROR
    java.rmi.server.hostname=null
    jenkins-s390x-1/148.100.85.246
    isSiteLocalAddress:false
    isAnyLocalAddress:false
    isLinkLocalAddress:false
    isLoopbackAddress:false
    isMulticastAddress:false
    localhost/127.0.0.1
    isSiteLocalAddress:false
    isAnyLocalAddress:false
    isLinkLocalAddress:false
    isLoopbackAddress:true
    isMulticastAddress:false
    ====================
    jenkins-s390x-1/148.100.85.246
    isSiteLocalAddress:false
    isAnyLocalAddress:false
    isLinkLocalAddress:false
    isLoopbackAddress:false
    isMulticastAddress:false

LocalHostTest > testInterfaces() STANDARD_ERROR
    Interfaces: {name:veth72de8d1 (veth72de8d1) => [/fe80:0:0:0:c01f:37ff:feda:6859%veth72de8d1/64 [null]], name:docker0 (docker0) => [/fe80:0:0:0:42:8cff:fecd:6609%docker0/64 [null], /172.17.0.1/16 [/172.17.255.255]], name:enc1000 (enc1000) => [/fe80:0:0:0:c1:21ff:fea5:7cf3%enc1000/64 [null], /2620:91:0:649:c1:21ff:fea5:7cf3%enc1000/64 [null], /148.100.85.246/23 [/148.100.85.255]], name:lo (lo) => [/0:0:0:0:0:0:0:1%lo/128 [null], /127.0.0.1/8 [null]]}
    Choose 172.17.0.1 to talk to external services
    java.rmi.server.hostname=null
          4.0sec,   18 completed,   0 failed,   0 skipped, org.apache.jmeter.samplers.TestSampleResult

SecurityProviderLoaderTest > addInvalidProviderClassTest(String) > [2] java.lang.Object STANDARD_ERROR
    Security Provider 'java.lang.Object' could not be installed. - see the log for more information.

SecurityProviderLoaderTest > addInvalidProviderClassTest(String) > [3] org.apache.jmeter.util.SecurityProviderLoaderTest.UnknownProvider STANDARD_ERROR
    Security Provider 'org.apache.jmeter.util.SecurityProviderLoaderTest.UnknownProvider' could not be installed. - see the log for more information.

> Task :src:dist-check:batchBatchTestLocal
summary +     55 in 00:00:05 =   10.6/s Avg:     9 Min:     1 Max:   143 Err:     8 (14.55%) Active: 1 Started: 2 Finished: 1
WARN StatusConsoleListener The use of package scanning to locate plugins is deprecated and will be removed in a future release
WARN StatusConsoleListener The use of package scanning to locate plugins is deprecated and will be removed in a future release
WARN StatusConsoleListener The use of package scanning to locate plugins is deprecated and will be removed in a future release
WARN StatusConsoleListener The use of package scanning to locate plugins is deprecated and will be removed in a future release
summary +     77 in 00:00:00 =  201.0/s Avg:     4 Min:     0 Max:    31 Err:     8 (10.39%) Active: 0 Started: 1 Finished: 1
summary =    132 in 00:00:06 =   23.7/s Avg:     6 Min:     0 Max:   143 Err:    16 (12.12%)
Tidying up ...    @ 2023 Dec 14 17:53:02 UTC (1702576382225)
... end of run
No errors present in the logfile <https://ci-builds.apache.org/job/JMeter/job/JMeter%20s390x/ws/bin/BatchTestLocal.log> (the file is empty)

> Task :src:components:test
          2.1sec, org.apache.jmeter.threads.openmodel.OpenModelThreadGroupConfigElementJavaTest > ensure_thread_group_initializes_counter_only_once_for_each_thread()
          2.1sec,    1 completed,   0 failed,   0 skipped, org.apache.jmeter.threads.openmodel.OpenModelThreadGroupConfigElementJavaTest

> Task :src:core:test FAILED
          1.1sec, org.apache.jmeter.threads.openmodel.ThreadsInterruptAtFinishTest > openmodel interrupts sleep()
FAILURE  16.1sec,  374 completed,   2 failed,   3 skipped, Gradle Test Run :src:core:test

374 tests completed, 2 failed, 3 skipped

> Task :src:protocol:http:test
    Setting JMeterHome: <https://ci-builds.apache.org/job/JMeter/job/JMeter%20s390x/ws/src/protocol/http/../../../.>
    Initializing Properties: ../../.././bin/jmeter.properties
    JMeterVersion=5.6.3-SNAPSHOT a45bcc9
    java.version=17.0.7
    java.vm.name=OpenJDK 64-Bit Server VM
    java.vendor=Eclipse Adoptium
    java.home=/usr/local/asfpackages/java/adoptium-jdk-17.0.7+7
    file.encoding=UTF-8
    default encoding=UTF-8
    user.home=/home/jenkins
    user.dir=<https://ci-builds.apache.org/job/JMeter/job/JMeter%20s390x/ws/src/protocol/http>
    user.language=en
    user.region=null
    user.country=US
    user.variant=
    Locale=en_US
    java.class.version=61.0
    java.awt.headless=true
    os.name=Linux
    os.version=5.4.0-159-generic
    os.arch=s390x
          1.0sec, org.apache.jmeter.protocol.http.sampler.TestHTTPHC4Impl > testNotifyFirstSampleAfterLoopRestartWhenThreadIterationIsSameUser()
          1.1sec, org.apache.jmeter.protocol.http.sampler.TestHTTPHC4Impl > testNotifyFirstSampleAfterLoopRestartWhenThreadIterationIsANewUser()
          1.1sec, org.apache.jmeter.protocol.http.sampler.TestHTTPHC4Impl > testParameterWithMimeTypeWithCharset()
          1.2sec, org.apache.jmeter.protocol.http.sampler.TestHTTPHC4Impl > testParameterWithMultipartAndExplicitHeader()
          1.2sec, org.apache.jmeter.protocol.http.sampler.TestHTTPHC4Impl > testFileargWithMimeTypeWithCharset()

> Task :src:dist-check:batchBug50898
WARN StatusConsoleListener The use of package scanning to locate plugins is deprecated and will be removed in a future release
WARN StatusConsoleListener The use of package scanning to locate plugins is deprecated and will be removed in a future release
WARN StatusConsoleListener The use of package scanning to locate plugins is deprecated and will be removed in a future release
WARN StatusConsoleListener The use of package scanning to locate plugins is deprecated and will be removed in a future release
Creating summariser <summary>
Created the tree successfully using <https://ci-builds.apache.org/job/JMeter/job/JMeter%20s390x/ws/bin/testfiles/Bug50898.jmx>
Starting standalone test @ 2023 Dec 14 17:53:04 UTC (1702576384885)
Waiting for possible Shutdown/StopTestNow/HeapDump/ThreadDump message on port 4445
summary +      1 in 00:00:00 =   23.3/s Avg:     6 Min:     6 Max:     6 Err:     0 (0.00%) Active: 1 Started: 1 Finished: 0
summary +      1 in 00:00:00 =   28.6/s Avg:    22 Min:    22 Max:    22 Err:     0 (0.00%) Active: 0 Started: 1 Finished: 1
summary =      2 in 00:00:00 =   25.6/s Avg:    14 Min:     6 Max:    22 Err:     0 (0.00%)
Tidying up ...    @ 2023 Dec 14 17:53:05 UTC (1702576385007)
... end of run
No errors present in the logfile <https://ci-builds.apache.org/job/JMeter/job/JMeter%20s390x/ws/bin/Bug50898.log> (the file is empty)

> Task :src:components:test
          2.1sec, org.apache.jmeter.threads.openmodel.OpenModelThreadGroupConfigElementTest > ensure thread group initializes counter only once for each thread()
          2.1sec,    1 completed,   0 failed,   0 skipped, org.apache.jmeter.threads.openmodel.OpenModelThreadGroupConfigElementTest
WARNING  22.2sec,  550 completed,   0 failed,   5 skipped, Gradle Test Run :src:components:test

> Task :src:protocol:http:test
          6.1sec, org.apache.jmeter.protocol.http.control.DnsManagerTest > badDnsInCustomResolverShouldFailHttpSampler(String, WireMockServer)[1], [1] HttpClient4
WARNING   6.1sec,    2 completed,   0 failed,   1 skipped, org.apache.jmeter.protocol.http.control.DnsManagerTest > badDnsInCustomResolverShouldFailHttpSampler(String, WireMockServer)
WARNING   7.1sec,    2 completed,   0 failed,   1 skipped, org.apache.jmeter.protocol.http.control.DnsManagerTest
          2.7sec, org.apache.jmeter.protocol.http.control.TestCacheManagerUrlConnection > testCacheHttpClientBug51932()
          2.9sec, org.apache.jmeter.protocol.http.control.TestCacheManagerUrlConnection > testExpires()
          3.0sec, org.apache.jmeter.protocol.http.control.TestCacheManagerUrlConnection > testExpiresBug59962()
          3.0sec, org.apache.jmeter.protocol.http.control.TestCacheManagerUrlConnection > testCacheControl()
          5.0sec, org.apache.jmeter.protocol.http.control.TestCacheManagerUrlConnection > testNoCacheControlNoMaxAgeNoExpire()
          3.0sec, org.apache.jmeter.protocol.http.control.TestCacheManagerUrlConnection > testPrivateCacheExpireNoMaxAge()
          5.0sec, org.apache.jmeter.protocol.http.control.TestCacheManagerUrlConnection > testPrivateCacheNoMaxAgeNoExpire()
          3.0sec, org.apache.jmeter.protocol.http.control.TestCacheManagerUrlConnection > testPrivateCache()
         27.7sec,   25 completed,   0 failed,   0 skipped, org.apache.jmeter.protocol.http.control.TestCacheManagerUrlConnection
          3.0sec, org.apache.jmeter.protocol.http.control.TestCacheManagerHC4 > testCacheHttpClientBug51932()
          3.0sec, org.apache.jmeter.protocol.http.control.TestCacheManagerHC4 > testExpires()
          3.0sec, org.apache.jmeter.protocol.http.control.TestCacheManagerHC4 > testExpiresBug59962()
          3.0sec, org.apache.jmeter.protocol.http.control.TestCacheManagerHC4 > testCacheControl()
          4.9sec, org.apache.jmeter.protocol.http.control.TestCacheManagerHC4 > testNoCacheControlNoMaxAgeNoExpire()
          3.0sec, org.apache.jmeter.protocol.http.control.TestCacheManagerHC4 > testPrivateCacheExpireNoMaxAge()
          5.0sec, org.apache.jmeter.protocol.http.control.TestCacheManagerHC4 > testPrivateCacheNoMaxAgeNoExpire()
          3.0sec, org.apache.jmeter.protocol.http.control.TestCacheManagerHC4 > testPrivateCache()
         28.0sec,   26 completed,   0 failed,   0 skipped, org.apache.jmeter.protocol.http.control.TestCacheManagerHC4
          1.2sec, org.apache.jmeter.protocol.http.HttpRequestInterruptTest > http request interrupts(String, WireMockRuntimeInfo)[1], [1] HttpClient4
          1.1sec, org.apache.jmeter.protocol.http.HttpRequestInterruptTest > http request interrupts(String, WireMockRuntimeInfo)[2], [2] HTTPSampler
          2.3sec,    2 completed,   0 failed,   0 skipped, org.apache.jmeter.protocol.http.HttpRequestInterruptTest > http request interrupts(String, WireMockRuntimeInfo)
          2.9sec,    2 completed,   0 failed,   0 skipped, org.apache.jmeter.protocol.http.HttpRequestInterruptTest
WARNING  82.2sec,  800 completed,   0 failed,   1 skipped, Gradle Test Run :src:protocol:http:test
checksum-dependency elapsed time: 1685ms, configurations processed: 69 (add -PchecksumTimingsPrint to print detailed timings)
checksum-dependency elapsed time: 7461ms, configurations processed: 621 (add -PchecksumTimingsPrint to print detailed timings)

FAILURE: Build failed with an exception.

* What went wrong:
Execution failed for task ':src:core:test'.
> There were failing tests. See the report at: file:///home/jenkins/jenkins-home/712657a4/workspace/JMeter/JMeter%20s390x/src/core/build/reports/tests/test/index.html

Deprecated Gradle features were used in this build, making it incompatible with Gradle 9.0.

You can use '--warning-mode all' to show the individual deprecation warnings and determine if they come from your own scripts or plugins.

For more on this, please refer to https://docs.gradle.org/8.5/userguide/command_line_interface.html#sec:command_line_warnings in the Gradle documentation.

BUILD FAILED in 5m 3s
373 actionable tasks: 202 executed, 171 up-to-date

Publishing build scan...
https://ge.apache.org/s/qcqjhgz22bmsg

Build step 'Invoke Gradle script' changed build result to FAILURE
Build step 'Invoke Gradle script' marked build as failure

Jenkins build is back to normal : JMeter » JMeter s390x #143

Posted by Apache Jenkins Server <je...@builds.apache.org>.
See <https://ci-builds.apache.org/job/JMeter/job/JMeter%20s390x/143/display/redirect?page=changes>