You are viewing a plain text version of this content. The canonical link for it is here.
Posted to builds@beam.apache.org by Apache Jenkins Server <je...@builds.apache.org> on 2023/04/03 17:24:58 UTC

Build failed in Jenkins: beam_PreCommit_Python_Integration_Cron #355

See <https://ci-beam.apache.org/job/beam_PreCommit_Python_Integration_Cron/355/display/redirect?page=changes>

Changes:

[noreply] Bump github.com/aws/aws-sdk-go-v2/feature/s3/manager in /sdks (#26071)


------------------------------------------
[...truncated 112.29 KB...]
    def error_remapped_callable(*args, **kwargs):
        try:
            return callable_(*args, **kwargs)
        except grpc.RpcError as exc:
>           raise exceptions.from_grpc_error(exc) from exc
E           google.api_core.exceptions.DeadlineExceeded: 504 Deadline Exceeded

../../build/gradleenv/2050596098/lib/python3.10/site-packages/google/api_core/grpc_helpers.py:74: DeadlineExceeded
------------------------------ Captured log call -------------------------------
INFO     apache_beam.runners.portability.stager:stager.py:772 Executing command: ['<https://ci-beam.apache.org/job/beam_PreCommit_Python_Integration_Cron/ws/src/build/gradleenv/2050596098/bin/python3.10',> '-m', 'pip', 'download', '--dest', '/tmp/dataflow-requirements-cache', '-r', '/tmp/tmp1jzjrhaf/tmp_requirements.txt', '--exists-action', 'i', '--no-deps', '--implementation', 'cp', '--abi', 'cp310', '--platform', 'manylinux2014_x86_64']
INFO     apache_beam.runners.portability.stager:stager.py:330 Copying Beam SDK "<https://ci-beam.apache.org/job/beam_PreCommit_Python_Integration_Cron/ws/src/sdks/python/build/apache-beam.tar.gz"> to staging location.
INFO     apache_beam.runners.dataflow.dataflow_runner:dataflow_runner.py:443 Pipeline has additional dependencies to be installed in SDK worker container, consider using the SDK container image pre-building workflow to avoid repetitive installations. Learn more on https://cloud.google.com/dataflow/docs/guides/using-custom-containers#prebuild
INFO     root:environments.py:376 Default Python SDK image for environment is apache/beam_python3.10_sdk:2.47.0.dev
INFO     root:environments.py:295 Using provided Python SDK container image: gcr.io/cloud-dataflow/v1beta3/python310-fnapi:beam-master-20230327
INFO     root:environments.py:302 Python SDK container image set to "gcr.io/cloud-dataflow/v1beta3/python310-fnapi:beam-master-20230327" for Docker environment
INFO     apache_beam.internal.gcp.auth:auth.py:130 Setting socket default timeout to 60 seconds.
INFO     apache_beam.internal.gcp.auth:auth.py:132 socket default timeout is 60.0 seconds.
INFO     apache_beam.runners.dataflow.internal.apiclient:apiclient.py:734 Starting GCS upload to gs://temp-storage-for-end-to-end-tests/staging-it/beamapp-jenkins-0403171259-189366-4q8wt6an.1680541979.189653/requirements.txt...
INFO     apache_beam.runners.dataflow.internal.apiclient:apiclient.py:750 Completed GCS upload to gs://temp-storage-for-end-to-end-tests/staging-it/beamapp-jenkins-0403171259-189366-4q8wt6an.1680541979.189653/requirements.txt in 0 seconds.
INFO     apache_beam.runners.dataflow.internal.apiclient:apiclient.py:734 Starting GCS upload to gs://temp-storage-for-end-to-end-tests/staging-it/beamapp-jenkins-0403171259-189366-4q8wt6an.1680541979.189653/mock-2.0.0-py2.py3-none-any.whl...
INFO     apache_beam.runners.dataflow.internal.apiclient:apiclient.py:750 Completed GCS upload to gs://temp-storage-for-end-to-end-tests/staging-it/beamapp-jenkins-0403171259-189366-4q8wt6an.1680541979.189653/mock-2.0.0-py2.py3-none-any.whl in 0 seconds.
INFO     apache_beam.runners.dataflow.internal.apiclient:apiclient.py:734 Starting GCS upload to gs://temp-storage-for-end-to-end-tests/staging-it/beamapp-jenkins-0403171259-189366-4q8wt6an.1680541979.189653/seaborn-0.12.2-py3-none-any.whl...
INFO     apache_beam.runners.dataflow.internal.apiclient:apiclient.py:750 Completed GCS upload to gs://temp-storage-for-end-to-end-tests/staging-it/beamapp-jenkins-0403171259-189366-4q8wt6an.1680541979.189653/seaborn-0.12.2-py3-none-any.whl in 0 seconds.
INFO     apache_beam.runners.dataflow.internal.apiclient:apiclient.py:734 Starting GCS upload to gs://temp-storage-for-end-to-end-tests/staging-it/beamapp-jenkins-0403171259-189366-4q8wt6an.1680541979.189653/PyHamcrest-1.10.1-py3-none-any.whl...
INFO     apache_beam.runners.dataflow.internal.apiclient:apiclient.py:750 Completed GCS upload to gs://temp-storage-for-end-to-end-tests/staging-it/beamapp-jenkins-0403171259-189366-4q8wt6an.1680541979.189653/PyHamcrest-1.10.1-py3-none-any.whl in 0 seconds.
INFO     apache_beam.runners.dataflow.internal.apiclient:apiclient.py:734 Starting GCS upload to gs://temp-storage-for-end-to-end-tests/staging-it/beamapp-jenkins-0403171259-189366-4q8wt6an.1680541979.189653/inflection-0.5.1-py2.py3-none-any.whl...
INFO     apache_beam.runners.dataflow.internal.apiclient:apiclient.py:750 Completed GCS upload to gs://temp-storage-for-end-to-end-tests/staging-it/beamapp-jenkins-0403171259-189366-4q8wt6an.1680541979.189653/inflection-0.5.1-py2.py3-none-any.whl in 0 seconds.
INFO     apache_beam.runners.dataflow.internal.apiclient:apiclient.py:734 Starting GCS upload to gs://temp-storage-for-end-to-end-tests/staging-it/beamapp-jenkins-0403171259-189366-4q8wt6an.1680541979.189653/beautifulsoup4-4.11.2-py3-none-any.whl...
INFO     apache_beam.runners.dataflow.internal.apiclient:apiclient.py:750 Completed GCS upload to gs://temp-storage-for-end-to-end-tests/staging-it/beamapp-jenkins-0403171259-189366-4q8wt6an.1680541979.189653/beautifulsoup4-4.11.2-py3-none-any.whl in 0 seconds.
INFO     apache_beam.runners.dataflow.internal.apiclient:apiclient.py:734 Starting GCS upload to gs://temp-storage-for-end-to-end-tests/staging-it/beamapp-jenkins-0403171259-189366-4q8wt6an.1680541979.189653/beautifulsoup4-4.12.0-py3-none-any.whl...
INFO     apache_beam.runners.dataflow.internal.apiclient:apiclient.py:750 Completed GCS upload to gs://temp-storage-for-end-to-end-tests/staging-it/beamapp-jenkins-0403171259-189366-4q8wt6an.1680541979.189653/beautifulsoup4-4.12.0-py3-none-any.whl in 0 seconds.
INFO     apache_beam.runners.dataflow.internal.apiclient:apiclient.py:734 Starting GCS upload to gs://temp-storage-for-end-to-end-tests/staging-it/beamapp-jenkins-0403171259-189366-4q8wt6an.1680541979.189653/parameterized-0.7.5-py2.py3-none-any.whl...
INFO     apache_beam.runners.dataflow.internal.apiclient:apiclient.py:750 Completed GCS upload to gs://temp-storage-for-end-to-end-tests/staging-it/beamapp-jenkins-0403171259-189366-4q8wt6an.1680541979.189653/parameterized-0.7.5-py2.py3-none-any.whl in 0 seconds.
INFO     apache_beam.runners.dataflow.internal.apiclient:apiclient.py:734 Starting GCS upload to gs://temp-storage-for-end-to-end-tests/staging-it/beamapp-jenkins-0403171259-189366-4q8wt6an.1680541979.189653/matplotlib-3.5.3-cp37-cp37m-manylinux_2_5_x86_64.manylinux1_x86_64.whl...
INFO     apache_beam.runners.dataflow.internal.apiclient:apiclient.py:750 Completed GCS upload to gs://temp-storage-for-end-to-end-tests/staging-it/beamapp-jenkins-0403171259-189366-4q8wt6an.1680541979.189653/matplotlib-3.5.3-cp37-cp37m-manylinux_2_5_x86_64.manylinux1_x86_64.whl in 0 seconds.
INFO     apache_beam.runners.dataflow.internal.apiclient:apiclient.py:734 Starting GCS upload to gs://temp-storage-for-end-to-end-tests/staging-it/beamapp-jenkins-0403171259-189366-4q8wt6an.1680541979.189653/matplotlib-3.7.0-cp38-cp38-manylinux_2_12_x86_64.manylinux2010_x86_64.whl...
INFO     apache_beam.runners.dataflow.internal.apiclient:apiclient.py:750 Completed GCS upload to gs://temp-storage-for-end-to-end-tests/staging-it/beamapp-jenkins-0403171259-189366-4q8wt6an.1680541979.189653/matplotlib-3.7.0-cp38-cp38-manylinux_2_12_x86_64.manylinux2010_x86_64.whl in 0 seconds.
INFO     apache_beam.runners.dataflow.internal.apiclient:apiclient.py:734 Starting GCS upload to gs://temp-storage-for-end-to-end-tests/staging-it/beamapp-jenkins-0403171259-189366-4q8wt6an.1680541979.189653/matplotlib-3.7.0-cp39-cp39-manylinux_2_17_x86_64.manylinux2014_x86_64.whl...
INFO     apache_beam.runners.dataflow.internal.apiclient:apiclient.py:750 Completed GCS upload to gs://temp-storage-for-end-to-end-tests/staging-it/beamapp-jenkins-0403171259-189366-4q8wt6an.1680541979.189653/matplotlib-3.7.0-cp39-cp39-manylinux_2_17_x86_64.manylinux2014_x86_64.whl in 0 seconds.
INFO     apache_beam.runners.dataflow.internal.apiclient:apiclient.py:734 Starting GCS upload to gs://temp-storage-for-end-to-end-tests/staging-it/beamapp-jenkins-0403171259-189366-4q8wt6an.1680541979.189653/matplotlib-3.7.1-cp38-cp38-manylinux_2_12_x86_64.manylinux2010_x86_64.whl...
INFO     apache_beam.runners.dataflow.internal.apiclient:apiclient.py:750 Completed GCS upload to gs://temp-storage-for-end-to-end-tests/staging-it/beamapp-jenkins-0403171259-189366-4q8wt6an.1680541979.189653/matplotlib-3.7.1-cp38-cp38-manylinux_2_12_x86_64.manylinux2010_x86_64.whl in 0 seconds.
INFO     apache_beam.runners.dataflow.internal.apiclient:apiclient.py:734 Starting GCS upload to gs://temp-storage-for-end-to-end-tests/staging-it/beamapp-jenkins-0403171259-189366-4q8wt6an.1680541979.189653/matplotlib-3.7.1-cp311-cp311-manylinux_2_17_x86_64.manylinux2014_x86_64.whl...
INFO     apache_beam.runners.dataflow.internal.apiclient:apiclient.py:750 Completed GCS upload to gs://temp-storage-for-end-to-end-tests/staging-it/beamapp-jenkins-0403171259-189366-4q8wt6an.1680541979.189653/matplotlib-3.7.1-cp311-cp311-manylinux_2_17_x86_64.manylinux2014_x86_64.whl in 0 seconds.
INFO     apache_beam.runners.dataflow.internal.apiclient:apiclient.py:734 Starting GCS upload to gs://temp-storage-for-end-to-end-tests/staging-it/beamapp-jenkins-0403171259-189366-4q8wt6an.1680541979.189653/scikit_learn-1.0.2-cp38-cp38-manylinux_2_17_x86_64.manylinux2014_x86_64.whl...
INFO     apache_beam.runners.dataflow.internal.apiclient:apiclient.py:750 Completed GCS upload to gs://temp-storage-for-end-to-end-tests/staging-it/beamapp-jenkins-0403171259-189366-4q8wt6an.1680541979.189653/scikit_learn-1.0.2-cp38-cp38-manylinux_2_17_x86_64.manylinux2014_x86_64.whl in 1 seconds.
INFO     apache_beam.runners.dataflow.internal.apiclient:apiclient.py:734 Starting GCS upload to gs://temp-storage-for-end-to-end-tests/staging-it/beamapp-jenkins-0403171259-189366-4q8wt6an.1680541979.189653/dataflow_python_sdk.tar...
INFO     apache_beam.runners.dataflow.internal.apiclient:apiclient.py:750 Completed GCS upload to gs://temp-storage-for-end-to-end-tests/staging-it/beamapp-jenkins-0403171259-189366-4q8wt6an.1680541979.189653/dataflow_python_sdk.tar in 0 seconds.
INFO     apache_beam.runners.dataflow.internal.apiclient:apiclient.py:734 Starting GCS upload to gs://temp-storage-for-end-to-end-tests/staging-it/beamapp-jenkins-0403171259-189366-4q8wt6an.1680541979.189653/pipeline.pb...
INFO     apache_beam.runners.dataflow.internal.apiclient:apiclient.py:750 Completed GCS upload to gs://temp-storage-for-end-to-end-tests/staging-it/beamapp-jenkins-0403171259-189366-4q8wt6an.1680541979.189653/pipeline.pb in 0 seconds.
INFO     apache_beam.runners.dataflow.internal.apiclient:apiclient.py:909 Create job: <Job
 clientRequestId: '20230403171259191239-2329'
 createTime: '2023-04-03T17:13:07.769592Z'
 currentStateTime: '1970-01-01T00:00:00Z'
 id: '2023-04-03_10_13_07-17598906883863641925'
 location: 'us-central1'
 name: 'beamapp-jenkins-0403171259-189366-4q8wt6an'
 projectId: 'apache-beam-testing'
 stageStates: []
 startTime: '2023-04-03T17:13:07.769592Z'
 steps: []
 tempFiles: []
 type: TypeValueValuesEnum(JOB_TYPE_STREAMING, 2)>
INFO     apache_beam.runners.dataflow.internal.apiclient:apiclient.py:911 Created job with id: [2023-04-03_10_13_07-17598906883863641925]
INFO     apache_beam.runners.dataflow.internal.apiclient:apiclient.py:912 Submitted job: 2023-04-03_10_13_07-17598906883863641925
INFO     apache_beam.runners.dataflow.internal.apiclient:apiclient.py:913 To access the Dataflow monitoring console, please navigate to https://console.cloud.google.com/dataflow/jobs/us-central1/2023-04-03_10_13_07-17598906883863641925?project=apache-beam-testing
INFO     apache_beam.runners.dataflow.test_dataflow_runner:test_dataflow_runner.py:58 Console log: 
INFO     apache_beam.runners.dataflow.test_dataflow_runner:test_dataflow_runner.py:59 https://console.cloud.google.com/dataflow/jobs/us-central1/2023-04-03_10_13_07-17598906883863641925?project=apache-beam-testing
INFO     apache_beam.runners.dataflow.dataflow_runner:dataflow_runner.py:193 Job 2023-04-03_10_13_07-17598906883863641925 is in state JOB_STATE_RUNNING
INFO     apache_beam.runners.dataflow.dataflow_runner:dataflow_runner.py:238 2023-04-03T17:13:09.743Z: JOB_MESSAGE_WARNING: Autoscaling is enabled for Dataflow Streaming Engine. Workers will scale between 1 and 100 unless maxNumWorkers is specified.
INFO     apache_beam.runners.dataflow.dataflow_runner:dataflow_runner.py:238 2023-04-03T17:13:10.066Z: JOB_MESSAGE_DETAILED: Autoscaling is enabled for job 2023-04-03_10_13_07-17598906883863641925. The number of workers will be between 1 and 100.
INFO     apache_beam.runners.dataflow.dataflow_runner:dataflow_runner.py:238 2023-04-03T17:13:10.086Z: JOB_MESSAGE_DETAILED: Autoscaling was automatically enabled for job 2023-04-03_10_13_07-17598906883863641925.
INFO     apache_beam.runners.dataflow.dataflow_runner:dataflow_runner.py:238 2023-04-03T17:13:16.526Z: JOB_MESSAGE_BASIC: Worker configuration: e2-standard-2 in us-central1-b.
INFO     apache_beam.runners.dataflow.dataflow_runner:dataflow_runner.py:238 2023-04-03T17:13:20.252Z: JOB_MESSAGE_DETAILED: Expanding SplittableParDo operations into optimizable parts.
INFO     apache_beam.runners.dataflow.dataflow_runner:dataflow_runner.py:238 2023-04-03T17:13:20.282Z: JOB_MESSAGE_DETAILED: Expanding CollectionToSingleton operations into optimizable parts.
INFO     apache_beam.runners.dataflow.dataflow_runner:dataflow_runner.py:238 2023-04-03T17:13:20.336Z: JOB_MESSAGE_DETAILED: Expanding CoGroupByKey operations into optimizable parts.
INFO     apache_beam.runners.dataflow.dataflow_runner:dataflow_runner.py:238 2023-04-03T17:13:20.365Z: JOB_MESSAGE_DEBUG: Combiner lifting skipped for step group: GroupByKey not followed by a combiner.
INFO     apache_beam.runners.dataflow.dataflow_runner:dataflow_runner.py:238 2023-04-03T17:13:20.388Z: JOB_MESSAGE_DETAILED: Expanding SplittableProcessKeyed operations into optimizable parts.
INFO     apache_beam.runners.dataflow.dataflow_runner:dataflow_runner.py:238 2023-04-03T17:13:20.408Z: JOB_MESSAGE_DETAILED: Expanding GroupByKey operations into streaming Read/Write steps
INFO     apache_beam.runners.dataflow.dataflow_runner:dataflow_runner.py:238 2023-04-03T17:13:20.452Z: JOB_MESSAGE_DETAILED: Lifting ValueCombiningMappingFns into MergeBucketsMappingFns
INFO     apache_beam.runners.dataflow.dataflow_runner:dataflow_runner.py:238 2023-04-03T17:13:20.497Z: JOB_MESSAGE_DEBUG: Annotating graph with Autotuner information.
INFO     apache_beam.runners.dataflow.dataflow_runner:dataflow_runner.py:238 2023-04-03T17:13:20.541Z: JOB_MESSAGE_DETAILED: Fusing adjacent ParDo, Read, Write, and Flatten operations
INFO     apache_beam.runners.dataflow.dataflow_runner:dataflow_runner.py:238 2023-04-03T17:13:20.563Z: JOB_MESSAGE_DETAILED: Fusing consumer decode into ReadFromPubSub/Read
INFO     apache_beam.runners.dataflow.dataflow_runner:dataflow_runner.py:238 2023-04-03T17:13:20.587Z: JOB_MESSAGE_DETAILED: Fusing consumer split into decode
INFO     apache_beam.runners.dataflow.dataflow_runner:dataflow_runner.py:238 2023-04-03T17:13:20.618Z: JOB_MESSAGE_DETAILED: Fusing consumer pair_with_one into split
INFO     apache_beam.runners.dataflow.dataflow_runner:dataflow_runner.py:238 2023-04-03T17:13:20.648Z: JOB_MESSAGE_DETAILED: Fusing consumer WindowInto(WindowIntoFn) into pair_with_one
INFO     apache_beam.runners.dataflow.dataflow_runner:dataflow_runner.py:238 2023-04-03T17:13:20.673Z: JOB_MESSAGE_DETAILED: Fusing consumer group/WriteStream into WindowInto(WindowIntoFn)
INFO     apache_beam.runners.dataflow.dataflow_runner:dataflow_runner.py:238 2023-04-03T17:13:20.701Z: JOB_MESSAGE_DETAILED: Fusing consumer group/MergeBuckets into group/ReadStream
INFO     apache_beam.runners.dataflow.dataflow_runner:dataflow_runner.py:238 2023-04-03T17:13:20.725Z: JOB_MESSAGE_DETAILED: Fusing consumer count into group/MergeBuckets
INFO     apache_beam.runners.dataflow.dataflow_runner:dataflow_runner.py:238 2023-04-03T17:13:20.758Z: JOB_MESSAGE_DETAILED: Fusing consumer format into count
INFO     apache_beam.runners.dataflow.dataflow_runner:dataflow_runner.py:238 2023-04-03T17:13:20.776Z: JOB_MESSAGE_DETAILED: Fusing consumer encode into format
INFO     apache_beam.runners.dataflow.dataflow_runner:dataflow_runner.py:238 2023-04-03T17:13:20.795Z: JOB_MESSAGE_DETAILED: Fusing consumer WriteToPubSub/ToProtobuf into encode
INFO     apache_beam.runners.dataflow.dataflow_runner:dataflow_runner.py:238 2023-04-03T17:13:20.818Z: JOB_MESSAGE_DETAILED: Fusing consumer WriteToPubSub/Write into WriteToPubSub/ToProtobuf
INFO     apache_beam.runners.dataflow.dataflow_runner:dataflow_runner.py:238 2023-04-03T17:13:20.847Z: JOB_MESSAGE_BASIC: Running job using Streaming Engine
INFO     apache_beam.runners.dataflow.dataflow_runner:dataflow_runner.py:238 2023-04-03T17:13:20.901Z: JOB_MESSAGE_BASIC: Using cloud KMLS key to protect persistent state.
INFO     apache_beam.runners.dataflow.dataflow_runner:dataflow_runner.py:238 2023-04-03T17:13:21.008Z: JOB_MESSAGE_DEBUG: Workflow config is missing a default resource spec.
INFO     apache_beam.runners.dataflow.dataflow_runner:dataflow_runner.py:238 2023-04-03T17:13:21.044Z: JOB_MESSAGE_DEBUG: Adding StepResource setup and teardown to workflow graph.
INFO     apache_beam.runners.dataflow.dataflow_runner:dataflow_runner.py:238 2023-04-03T17:13:21.068Z: JOB_MESSAGE_DEBUG: Adding workflow start and stop steps.
INFO     apache_beam.runners.dataflow.dataflow_runner:dataflow_runner.py:238 2023-04-03T17:13:21.090Z: JOB_MESSAGE_DEBUG: Assigning stage ids.
INFO     apache_beam.runners.dataflow.dataflow_runner:dataflow_runner.py:238 2023-04-03T17:13:22.167Z: JOB_MESSAGE_DEBUG: Starting worker pool setup.
INFO     apache_beam.runners.dataflow.dataflow_runner:dataflow_runner.py:238 2023-04-03T17:13:22.212Z: JOB_MESSAGE_DEBUG: Starting worker pool setup.
INFO     apache_beam.runners.dataflow.dataflow_runner:dataflow_runner.py:238 2023-04-03T17:13:22.239Z: JOB_MESSAGE_BASIC: Starting 1 workers in us-central1-b...
INFO     apache_beam.runners.dataflow.dataflow_runner:dataflow_runner.py:238 2023-04-03T17:13:35.055Z: JOB_MESSAGE_BASIC: Your project already contains 100 Dataflow-created metric descriptors, so new user metrics of the form custom.googleapis.com/* will not be created. However, all user metrics are also available in the metric dataflow.googleapis.com/job/user_counter. If you rely on the custom metrics, you can delete old / unused metric descriptors. See https://developers.google.com/apis-explorer/#p/monitoring/v3/monitoring.projects.metricDescriptors.list and https://developers.google.com/apis-explorer/#p/monitoring/v3/monitoring.projects.metricDescriptors.delete
INFO     apache_beam.runners.dataflow.dataflow_runner:dataflow_runner.py:238 2023-04-03T17:14:08.499Z: JOB_MESSAGE_DETAILED: Autoscaling: Raised the number of workers to 1 so that the pipeline can catch up with its backlog and keep up with its input rate.
INFO     apache_beam.runners.dataflow.dataflow_runner:dataflow_runner.py:238 2023-04-03T17:14:40.207Z: JOB_MESSAGE_DETAILED: Workers have started successfully.
INFO     apache_beam.runners.dataflow.dataflow_runner:dataflow_runner.py:238 2023-04-03T17:14:50.684Z: JOB_MESSAGE_DETAILED: All workers have finished the startup processes and began to receive work requests.
WARNING  apache_beam.runners.dataflow.dataflow_runner:dataflow_runner.py:249 Timing out on waiting for job 2023-04-03_10_13_07-17598906883863641925 after 361 seconds
=============================== warnings summary ===============================
../../build/gradleenv/2050596098/lib/python3.10/site-packages/hdfs/config.py:15
../../build/gradleenv/2050596098/lib/python3.10/site-packages/hdfs/config.py:15
../../build/gradleenv/2050596098/lib/python3.10/site-packages/hdfs/config.py:15
  <https://ci-beam.apache.org/job/beam_PreCommit_Python_Integration_Cron/ws/src/build/gradleenv/2050596098/lib/python3.10/site-packages/hdfs/config.py>:15: DeprecationWarning: the imp module is deprecated in favour of importlib and slated for removal in Python 3.12; see the module's documentation for alternative uses
    from imp import load_source

../../build/gradleenv/2050596098/lib/python3.10/site-packages/pkg_resources/__init__.py:121
../../build/gradleenv/2050596098/lib/python3.10/site-packages/pkg_resources/__init__.py:121
../../build/gradleenv/2050596098/lib/python3.10/site-packages/pkg_resources/__init__.py:121
  <https://ci-beam.apache.org/job/beam_PreCommit_Python_Integration_Cron/ws/src/build/gradleenv/2050596098/lib/python3.10/site-packages/pkg_resources/__init__.py>:121: DeprecationWarning: pkg_resources is deprecated as an API
    warnings.warn("pkg_resources is deprecated as an API", DeprecationWarning)

../../build/gradleenv/2050596098/lib/python3.10/site-packages/pkg_resources/__init__.py:2870: 54 warnings
  <https://ci-beam.apache.org/job/beam_PreCommit_Python_Integration_Cron/ws/src/build/gradleenv/2050596098/lib/python3.10/site-packages/pkg_resources/__init__.py>:2870: DeprecationWarning: Deprecated call to `pkg_resources.declare_namespace('google')`.
  Implementing implicit namespace packages (as specified in PEP 420) is preferred to `pkg_resources.declare_namespace`. See https://setuptools.pypa.io/en/latest/references/keywords.html#keyword-namespace-packages
    declare_namespace(pkg)

../../build/gradleenv/2050596098/lib/python3.10/site-packages/pkg_resources/__init__.py:2870: 39 warnings
  <https://ci-beam.apache.org/job/beam_PreCommit_Python_Integration_Cron/ws/src/build/gradleenv/2050596098/lib/python3.10/site-packages/pkg_resources/__init__.py>:2870: DeprecationWarning: Deprecated call to `pkg_resources.declare_namespace('google.cloud')`.
  Implementing implicit namespace packages (as specified in PEP 420) is preferred to `pkg_resources.declare_namespace`. See https://setuptools.pypa.io/en/latest/references/keywords.html#keyword-namespace-packages
    declare_namespace(pkg)

../../build/gradleenv/2050596098/lib/python3.10/site-packages/pkg_resources/__init__.py:2349: 12 warnings
  <https://ci-beam.apache.org/job/beam_PreCommit_Python_Integration_Cron/ws/src/build/gradleenv/2050596098/lib/python3.10/site-packages/pkg_resources/__init__.py>:2349: DeprecationWarning: Deprecated call to `pkg_resources.declare_namespace('google')`.
  Implementing implicit namespace packages (as specified in PEP 420) is preferred to `pkg_resources.declare_namespace`. See https://setuptools.pypa.io/en/latest/references/keywords.html#keyword-namespace-packages
    declare_namespace(parent)

../../build/gradleenv/2050596098/lib/python3.10/site-packages/pkg_resources/__init__.py:2870
../../build/gradleenv/2050596098/lib/python3.10/site-packages/pkg_resources/__init__.py:2870
../../build/gradleenv/2050596098/lib/python3.10/site-packages/pkg_resources/__init__.py:2870
  <https://ci-beam.apache.org/job/beam_PreCommit_Python_Integration_Cron/ws/src/build/gradleenv/2050596098/lib/python3.10/site-packages/pkg_resources/__init__.py>:2870: DeprecationWarning: Deprecated call to `pkg_resources.declare_namespace('google.logging')`.
  Implementing implicit namespace packages (as specified in PEP 420) is preferred to `pkg_resources.declare_namespace`. See https://setuptools.pypa.io/en/latest/references/keywords.html#keyword-namespace-packages
    declare_namespace(pkg)

../../build/gradleenv/2050596098/lib/python3.10/site-packages/pkg_resources/__init__.py:2870
../../build/gradleenv/2050596098/lib/python3.10/site-packages/pkg_resources/__init__.py:2870
../../build/gradleenv/2050596098/lib/python3.10/site-packages/pkg_resources/__init__.py:2870
  <https://ci-beam.apache.org/job/beam_PreCommit_Python_Integration_Cron/ws/src/build/gradleenv/2050596098/lib/python3.10/site-packages/pkg_resources/__init__.py>:2870: DeprecationWarning: Deprecated call to `pkg_resources.declare_namespace('google.iam')`.
  Implementing implicit namespace packages (as specified in PEP 420) is preferred to `pkg_resources.declare_namespace`. See https://setuptools.pypa.io/en/latest/references/keywords.html#keyword-namespace-packages
    declare_namespace(pkg)

../../build/gradleenv/2050596098/lib/python3.10/site-packages/google/rpc/__init__.py:20
../../build/gradleenv/2050596098/lib/python3.10/site-packages/google/rpc/__init__.py:20
../../build/gradleenv/2050596098/lib/python3.10/site-packages/google/rpc/__init__.py:20
  <https://ci-beam.apache.org/job/beam_PreCommit_Python_Integration_Cron/ws/src/build/gradleenv/2050596098/lib/python3.10/site-packages/google/rpc/__init__.py>:20: DeprecationWarning: Deprecated call to `pkg_resources.declare_namespace('google.rpc')`.
  Implementing implicit namespace packages (as specified in PEP 420) is preferred to `pkg_resources.declare_namespace`. See https://setuptools.pypa.io/en/latest/references/keywords.html#keyword-namespace-packages
    pkg_resources.declare_namespace(__name__)

-- Docs: https://docs.pytest.org/en/stable/how-to/capture-warnings.html
- generated xml file: <https://ci-beam.apache.org/job/beam_PreCommit_Python_Integration_Cron/ws/src/sdks/python/pytest_preCommitIT-df-py310.xml> -
=========================== short test summary info ============================
FAILED apache_beam/examples/streaming_wordcount_it_test.py::StreamingWordCountIT::test_streaming_wordcount_it - google.api_core.exceptions.DeadlineExceeded: 504 Deadline Exceeded
================= 1 failed, 120 warnings in 621.87s (0:10:21) ==================

> Task :sdks:python:test-suites:dataflow:py310:preCommitIT_streaming_V2 FAILED

> Task :sdks:python:test-suites:dataflow:py37:preCommitIT_streaming_V2

[gw0] PASSED apache_beam/examples/streaming_wordcount_it_test.py::StreamingWordCountIT::test_streaming_wordcount_it 

=============================== warnings summary ===============================
../../build/gradleenv/-1734967052/lib/python3.7/site-packages/hdfs/config.py:15
../../build/gradleenv/-1734967052/lib/python3.7/site-packages/hdfs/config.py:15
../../build/gradleenv/-1734967052/lib/python3.7/site-packages/hdfs/config.py:15
  <https://ci-beam.apache.org/job/beam_PreCommit_Python_Integration_Cron/ws/src/build/gradleenv/-1734967052/lib/python3.7/site-packages/hdfs/config.py>:15: DeprecationWarning: the imp module is deprecated in favour of importlib; see the module's documentation for alternative uses
    from imp import load_source

../../build/gradleenv/-1734967052/lib/python3.7/site-packages/pkg_resources/__init__.py:121
../../build/gradleenv/-1734967052/lib/python3.7/site-packages/pkg_resources/__init__.py:121
../../build/gradleenv/-1734967052/lib/python3.7/site-packages/pkg_resources/__init__.py:121
  <https://ci-beam.apache.org/job/beam_PreCommit_Python_Integration_Cron/ws/src/build/gradleenv/-1734967052/lib/python3.7/site-packages/pkg_resources/__init__.py>:121: DeprecationWarning: pkg_resources is deprecated as an API
    warnings.warn("pkg_resources is deprecated as an API", DeprecationWarning)

../../build/gradleenv/-1734967052/lib/python3.7/site-packages/pkg_resources/__init__.py:2870: 54 warnings
  <https://ci-beam.apache.org/job/beam_PreCommit_Python_Integration_Cron/ws/src/build/gradleenv/-1734967052/lib/python3.7/site-packages/pkg_resources/__init__.py>:2870: DeprecationWarning: Deprecated call to `pkg_resources.declare_namespace('google')`.
  Implementing implicit namespace packages (as specified in PEP 420) is preferred to `pkg_resources.declare_namespace`. See https://setuptools.pypa.io/en/latest/references/keywords.html#keyword-namespace-packages
    declare_namespace(pkg)

../../build/gradleenv/-1734967052/lib/python3.7/site-packages/pkg_resources/__init__.py:2870: 39 warnings
  <https://ci-beam.apache.org/job/beam_PreCommit_Python_Integration_Cron/ws/src/build/gradleenv/-1734967052/lib/python3.7/site-packages/pkg_resources/__init__.py>:2870: DeprecationWarning: Deprecated call to `pkg_resources.declare_namespace('google.cloud')`.
  Implementing implicit namespace packages (as specified in PEP 420) is preferred to `pkg_resources.declare_namespace`. See https://setuptools.pypa.io/en/latest/references/keywords.html#keyword-namespace-packages
    declare_namespace(pkg)

../../build/gradleenv/-1734967052/lib/python3.7/site-packages/pkg_resources/__init__.py:2349: 12 warnings
  <https://ci-beam.apache.org/job/beam_PreCommit_Python_Integration_Cron/ws/src/build/gradleenv/-1734967052/lib/python3.7/site-packages/pkg_resources/__init__.py>:2349: DeprecationWarning: Deprecated call to `pkg_resources.declare_namespace('google')`.
  Implementing implicit namespace packages (as specified in PEP 420) is preferred to `pkg_resources.declare_namespace`. See https://setuptools.pypa.io/en/latest/references/keywords.html#keyword-namespace-packages
    declare_namespace(parent)

../../build/gradleenv/-1734967052/lib/python3.7/site-packages/pkg_resources/__init__.py:2870
../../build/gradleenv/-1734967052/lib/python3.7/site-packages/pkg_resources/__init__.py:2870
../../build/gradleenv/-1734967052/lib/python3.7/site-packages/pkg_resources/__init__.py:2870
  <https://ci-beam.apache.org/job/beam_PreCommit_Python_Integration_Cron/ws/src/build/gradleenv/-1734967052/lib/python3.7/site-packages/pkg_resources/__init__.py>:2870: DeprecationWarning: Deprecated call to `pkg_resources.declare_namespace('google.logging')`.
  Implementing implicit namespace packages (as specified in PEP 420) is preferred to `pkg_resources.declare_namespace`. See https://setuptools.pypa.io/en/latest/references/keywords.html#keyword-namespace-packages
    declare_namespace(pkg)

../../build/gradleenv/-1734967052/lib/python3.7/site-packages/pkg_resources/__init__.py:2870
../../build/gradleenv/-1734967052/lib/python3.7/site-packages/pkg_resources/__init__.py:2870
../../build/gradleenv/-1734967052/lib/python3.7/site-packages/pkg_resources/__init__.py:2870
  <https://ci-beam.apache.org/job/beam_PreCommit_Python_Integration_Cron/ws/src/build/gradleenv/-1734967052/lib/python3.7/site-packages/pkg_resources/__init__.py>:2870: DeprecationWarning: Deprecated call to `pkg_resources.declare_namespace('google.iam')`.
  Implementing implicit namespace packages (as specified in PEP 420) is preferred to `pkg_resources.declare_namespace`. See https://setuptools.pypa.io/en/latest/references/keywords.html#keyword-namespace-packages
    declare_namespace(pkg)

../../build/gradleenv/-1734967052/lib/python3.7/site-packages/google/rpc/__init__.py:20
../../build/gradleenv/-1734967052/lib/python3.7/site-packages/google/rpc/__init__.py:20
../../build/gradleenv/-1734967052/lib/python3.7/site-packages/google/rpc/__init__.py:20
  <https://ci-beam.apache.org/job/beam_PreCommit_Python_Integration_Cron/ws/src/build/gradleenv/-1734967052/lib/python3.7/site-packages/google/rpc/__init__.py>:20: DeprecationWarning: Deprecated call to `pkg_resources.declare_namespace('google.rpc')`.
  Implementing implicit namespace packages (as specified in PEP 420) is preferred to `pkg_resources.declare_namespace`. See https://setuptools.pypa.io/en/latest/references/keywords.html#keyword-namespace-packages
    pkg_resources.declare_namespace(__name__)

-- Docs: https://docs.pytest.org/en/stable/how-to/capture-warnings.html
- generated xml file: <https://ci-beam.apache.org/job/beam_PreCommit_Python_Integration_Cron/ws/src/sdks/python/pytest_preCommitIT-df-py37.xml> -
================= 1 passed, 120 warnings in 807.49s (0:13:27) ==================

FAILURE: Build failed with an exception.

* Where:
Script '<https://ci-beam.apache.org/job/beam_PreCommit_Python_Integration_Cron/ws/src/sdks/python/test-suites/dataflow/common.gradle'> line: 76

* What went wrong:
Execution failed for task ':sdks:python:test-suites:dataflow:py310:preCommitIT_streaming_V2'.
> Process 'command 'sh'' finished with non-zero exit value 1

* Try:
> Run with --stacktrace option to get the stack trace.
> Run with --info or --debug option to get more log output.

* Get more help at https://help.gradle.org

Deprecated Gradle features were used in this build, making it incompatible with Gradle 8.0.

You can use '--warning-mode all' to show the individual deprecation warnings and determine if they come from your own scripts or plugins.

See https://docs.gradle.org/7.5.1/userguide/command_line_interface.html#sec:command_line_warnings

BUILD FAILED in 50m 14s
24 actionable tasks: 18 executed, 4 from cache, 2 up-to-date

Publishing build scan...
https://gradle.com/s/gggzkfzrrmfqc

Build step 'Invoke Gradle script' changed build result to FAILURE
Build step 'Invoke Gradle script' marked build as failure

---------------------------------------------------------------------
To unsubscribe, e-mail: builds-unsubscribe@beam.apache.org
For additional commands, e-mail: builds-help@beam.apache.org


Jenkins build is back to normal : beam_PreCommit_Python_Integration_Cron #356

Posted by Apache Jenkins Server <je...@builds.apache.org>.
See <https://ci-beam.apache.org/job/beam_PreCommit_Python_Integration_Cron/356/display/redirect>


---------------------------------------------------------------------
To unsubscribe, e-mail: builds-unsubscribe@beam.apache.org
For additional commands, e-mail: builds-help@beam.apache.org