You are viewing a plain text version of this content. The canonical link for it is here.
Posted to dev@lucene.apache.org by Apache Jenkins Server <je...@builds.apache.org> on 2014/05/28 17:45:35 UTC
[JENKINS] Lucene-Solr-SmokeRelease-4.8 - Build # 4 - Failure
Build: https://builds.apache.org/job/Lucene-Solr-SmokeRelease-4.8/4/
No tests ran.
Build Log:
[...truncated 52992 lines...]
prepare-release-no-sign:
[mkdir] Created dir: /usr/home/hudson/hudson-slave/workspace/Lucene-Solr-SmokeRelease-4.8/lucene/build/fakeRelease
[copy] Copying 431 files to /usr/home/hudson/hudson-slave/workspace/Lucene-Solr-SmokeRelease-4.8/lucene/build/fakeRelease/lucene
[copy] Copying 239 files to /usr/home/hudson/hudson-slave/workspace/Lucene-Solr-SmokeRelease-4.8/lucene/build/fakeRelease/solr
[exec] JAVA7_HOME is /home/hudson/tools/java/latest1.7
[exec] NOTE: output encoding is US-ASCII
[exec]
[exec] Load release URL "file:/usr/home/hudson/hudson-slave/workspace/Lucene-Solr-SmokeRelease-4.8/lucene/build/fakeRelease/"...
[exec]
[exec] Test Lucene...
[exec] test basics...
[exec] get KEYS
[exec] 0.1 MB in 0.01 sec (12.4 MB/sec)
[exec] check changes HTML...
[exec] download lucene-4.8.0-src.tgz...
[exec] 27.5 MB in 0.04 sec (668.5 MB/sec)
[exec] verify md5/sha1 digests
[exec] download lucene-4.8.0.tgz...
[exec] 61.3 MB in 0.09 sec (692.9 MB/sec)
[exec] verify md5/sha1 digests
[exec] download lucene-4.8.0.zip...
[exec] 70.9 MB in 0.08 sec (934.7 MB/sec)
[exec] verify md5/sha1 digests
[exec] unpack lucene-4.8.0.tgz...
[exec] verify JAR metadata/identity/no javax.* or java.* classes...
[exec] test demo with 1.7...
[exec] got 5687 hits for query "lucene"
[exec] check Lucene's javadoc JAR
[exec] unpack lucene-4.8.0.zip...
[exec] verify JAR metadata/identity/no javax.* or java.* classes...
[exec] test demo with 1.7...
[exec] got 5687 hits for query "lucene"
[exec] check Lucene's javadoc JAR
[exec] unpack lucene-4.8.0-src.tgz...
[exec] make sure no JARs/WARs in src dist...
[exec] run "ant validate"
[exec] run tests w/ Java 7 and testArgs='-Dtests.jettyConnector=Socket -Dtests.disableHdfs=true'...
[exec] test demo with 1.7...
[exec] got 249 hits for query "lucene"
[exec] generate javadocs w/ Java 7...
[exec]
[exec] Crawl/parse...
[exec]
[exec] Verify...
[exec]
[exec] Test Solr...
[exec] test basics...
[exec] get KEYS
[exec] 0.1 MB in 0.00 sec (77.6 MB/sec)
[exec] check changes HTML...
[exec] Traceback (most recent call last):
[exec] File "/usr/home/hudson/hudson-slave/workspace/Lucene-Solr-SmokeRelease-4.8/dev-tools/script
[exec] s/smokeTestRelease.py", line 1347, in <module>
[exec] main()
[exec] File "/usr/home/hudson/hudson-slave/workspace/Lucene-Solr-SmokeRelease-4.8/dev-tools/scripts/smokeTestRelease.py", line 1291, in main
[exec] smokeTest(baseURL, svnRevision, version, tmpDir, isSigned, testArgs)
[exec] File "/usr/home/hudson/hudson-slave/workspace/Lucene-Solr-SmokeRelease-4.8/dev-tools/scripts/smokeTestRelease.py", line 1333, in smokeTest
[exec] checkSigs('solr', solrPath, version, tmpDir, isSigned)
[exec] File "/usr/home/hudson/hudson-slave/workspace/Lucene-Solr-SmokeRelease-4.8/dev-tools/scripts/smokeTestRelease.py", line 410, in checkSigs
[exec] testChanges(project, version, changesURL)
[exec] File "/usr/home/hudson/hudson-slave/workspace/Lucene-Solr-SmokeRelease-4.8/dev-tools/scripts/smokeTestRelease.py", line 458, in testChanges
[exec] checkChangesContent(s, version, changesURL, project, True)
[exec] File "/usr/home/hudson/hudson-slave/workspace/Lucene-Solr-SmokeRelease-4.8/dev-tools/scripts/smokeTestRelease.py", line 485, in checkChangesContent
[exec] raise RuntimeError('incorrect issue (_ instead of -) in %s: %s' % (name, m.group(1)))
[exec] RuntimeError: incorrect issue (_ instead of -) in file:///usr/home/hudson/hudson-slave/workspace/Lucene-Solr-SmokeRelease-4.8/lucene/build/fakeRelease/solr/changes/Changes.html: SOLR_6029
BUILD FAILED
/usr/home/hudson/hudson-slave/workspace/Lucene-Solr-SmokeRelease-4.8/build.xml:387: exec returned: 1
Total time: 53 minutes 57 seconds
Build step 'Invoke Ant' marked build as failure
Email was triggered for: Failure
Sending email for trigger: Failure
Re: [JENKINS] Lucene-Solr-SmokeRelease-4.8 - Build # 6 - Still Failing
Posted by Robert Muir <rc...@gmail.com>.
i committed a fix.
On Thu, Jun 5, 2014 at 5:17 AM, Apache Jenkins Server
<je...@builds.apache.org> wrote:
> Build: https://builds.apache.org/job/Lucene-Solr-SmokeRelease-4.8/6/
>
> No tests ran.
>
> Build Log:
> [...truncated 52791 lines...]
> prepare-release-no-sign:
> [mkdir] Created dir: /usr/home/hudson/hudson-slave/workspace/Lucene-Solr-SmokeRelease-4.8/lucene/build/fakeRelease
> [copy] Copying 431 files to /usr/home/hudson/hudson-slave/workspace/Lucene-Solr-SmokeRelease-4.8/lucene/build/fakeRelease/lucene
> [copy] Copying 239 files to /usr/home/hudson/hudson-slave/workspace/Lucene-Solr-SmokeRelease-4.8/lucene/build/fakeRelease/solr
> [exec] JAVA7_HOME is /home/hudson/tools/java/latest1.7
> [exec] NOTE: output encoding is US-ASCII
> [exec]
> [exec] Load release URL "file:/usr/home/hudson/hudson-slave/workspace/Lucene-Solr-SmokeRelease-4.8/lucene/build/fakeRelease/"...
> [exec]
> [exec] Test Lucene...
> [exec] test basics...
> [exec] get KEYS
> [exec] 0.1 MB in 0.01 sec (20.4 MB/sec)
> [exec] check changes HTML...
> [exec] download lucene-4.8.0-src.tgz...
> [exec] 27.5 MB in 0.04 sec (670.9 MB/sec)
> [exec] verify md5/sha1 digests
> [exec] download lucene-4.8.0.tgz...
> [exec] 61.3 MB in 0.09 sec (654.7 MB/sec)
> [exec] verify md5/sha1 digests
> [exec] download lucene-4.8.0.zip...
> [exec] 70.9 MB in 0.14 sec (511.3 MB/sec)
> [exec] verify md5/sha1 digests
> [exec] unpack lucene-4.8.0.tgz...
> [exec] verify JAR metadata/identity/no javax.* or java.* classes...
> [exec] test demo with 1.7...
> [exec] got 5687 hits for query "lucene"
> [exec] check Lucene's javadoc JAR
> [exec] unpack lucene-4.8.0.zip...
> [exec] verify JAR metadata/identity/no javax.* or java.* classes...
> [exec] test demo with 1.7...
> [exec] got 5687 hits for query "lucene"
> [exec] check Lucene's javadoc JAR
> [exec] unpack lucene-4.8.0-src.tgz...
> [exec] make sure no JARs/WARs in src dist...
> [exec] run "ant validate"
> [exec] run tests w/ Java 7 and testArgs='-Dtests.jettyConnector=Socket -Dtests.disableHdfs=true'...
> [exec] test demo with 1.7...
> [exec] got 249 hits for query "lucene"
> [exec] generate javadocs w/ Java 7...
> [exec]
> [exec] Crawl/parse...
> [exec]
> [exec] Verify...
> [exec]
> [exec] Test Solr...
> [exec] test basics...
> [exec] get KEYS
> [exec] 0.1 MB in 0.00 sec (101.5 MB/sec)
> [exec] check changes HTML...
> [exec] Traceback (most recent call last):
> [exec] File "/usr/home/hudson/hudson-slave/workspace/Lucene-Solr-SmokeRelease-4.8/dev-tools/scripts/smokeTestRelease.py", line 1347, in <module>
> [exec] main()
> [exec] File "/usr/home/hudson/hudson-slave/workspace/Lucene-Solr-SmokeRelease-4.8/dev-tools/scripts/smokeTestRelease.py", line 1291, in main
> [exec] smokeTest(baseURL, svnRevision, version, tmpDir, isSigned, testArgs)
> [exec] File "/usr/home/hudson/hudson-slave/workspace/Lucene-Solr-SmokeRelease-4.8/dev-tools/scripts/smokeTestRelease.py", line 1333, in smokeTest
> [exec] checkSigs('solr', solrPath, version, tmpDir, isSigned)
> [exec] File "/usr/home/hudson/hudson-slave/workspace/Lucene-Solr-SmokeRelease-4.8/dev-tools/scripts/smokeTestRelease.py", line 410, in checkSigs
> [exec] testChanges(project, version, changesURL)
> [exec] File "/usr/home/hudson/hudson-slave/workspace/Lucene-Solr-SmokeRelease-4.8/dev-tools/scripts/smokeTestRelease.py", line 458, in testChanges
> [exec] checkChangesContent(s, version, changesURL, project, True)
> [exec] File "/usr/home/hudson/hudson-slave/workspace/Lucene-Solr-SmokeRelease-4.8/dev-tools/scripts/smokeTestRelease.py", line 485, in checkChangesContent
> [exec] raise RuntimeError('incorrect issue (_ instead of -) in %s: %s' % (name, m.group(1)))
> [exec] RuntimeError: incorrect issue (_ instead of -) in file:///usr/home/hudson/hudson-slave/workspace/Lucene-Solr-SmokeRelease-4.8/lucene/build/fakeRelease/solr/changes/Changes.html: SOLR_6029
>
> BUILD FAILED
> /usr/home/hudson/hudson-slave/workspace/Lucene-Solr-SmokeRelease-4.8/build.xml:387: exec returned: 1
>
> Total time: 54 minutes 2 seconds
> Build step 'Invoke Ant' marked build as failure
> Email was triggered for: Failure
> Sending email for trigger: Failure
>
>
>
>
> ---------------------------------------------------------------------
> To unsubscribe, e-mail: dev-unsubscribe@lucene.apache.org
> For additional commands, e-mail: dev-help@lucene.apache.org
---------------------------------------------------------------------
To unsubscribe, e-mail: dev-unsubscribe@lucene.apache.org
For additional commands, e-mail: dev-help@lucene.apache.org
[JENKINS] Lucene-Solr-SmokeRelease-4.8 - Build # 6 - Still Failing
Posted by Apache Jenkins Server <je...@builds.apache.org>.
Build: https://builds.apache.org/job/Lucene-Solr-SmokeRelease-4.8/6/
No tests ran.
Build Log:
[...truncated 52791 lines...]
prepare-release-no-sign:
[mkdir] Created dir: /usr/home/hudson/hudson-slave/workspace/Lucene-Solr-SmokeRelease-4.8/lucene/build/fakeRelease
[copy] Copying 431 files to /usr/home/hudson/hudson-slave/workspace/Lucene-Solr-SmokeRelease-4.8/lucene/build/fakeRelease/lucene
[copy] Copying 239 files to /usr/home/hudson/hudson-slave/workspace/Lucene-Solr-SmokeRelease-4.8/lucene/build/fakeRelease/solr
[exec] JAVA7_HOME is /home/hudson/tools/java/latest1.7
[exec] NOTE: output encoding is US-ASCII
[exec]
[exec] Load release URL "file:/usr/home/hudson/hudson-slave/workspace/Lucene-Solr-SmokeRelease-4.8/lucene/build/fakeRelease/"...
[exec]
[exec] Test Lucene...
[exec] test basics...
[exec] get KEYS
[exec] 0.1 MB in 0.01 sec (20.4 MB/sec)
[exec] check changes HTML...
[exec] download lucene-4.8.0-src.tgz...
[exec] 27.5 MB in 0.04 sec (670.9 MB/sec)
[exec] verify md5/sha1 digests
[exec] download lucene-4.8.0.tgz...
[exec] 61.3 MB in 0.09 sec (654.7 MB/sec)
[exec] verify md5/sha1 digests
[exec] download lucene-4.8.0.zip...
[exec] 70.9 MB in 0.14 sec (511.3 MB/sec)
[exec] verify md5/sha1 digests
[exec] unpack lucene-4.8.0.tgz...
[exec] verify JAR metadata/identity/no javax.* or java.* classes...
[exec] test demo with 1.7...
[exec] got 5687 hits for query "lucene"
[exec] check Lucene's javadoc JAR
[exec] unpack lucene-4.8.0.zip...
[exec] verify JAR metadata/identity/no javax.* or java.* classes...
[exec] test demo with 1.7...
[exec] got 5687 hits for query "lucene"
[exec] check Lucene's javadoc JAR
[exec] unpack lucene-4.8.0-src.tgz...
[exec] make sure no JARs/WARs in src dist...
[exec] run "ant validate"
[exec] run tests w/ Java 7 and testArgs='-Dtests.jettyConnector=Socket -Dtests.disableHdfs=true'...
[exec] test demo with 1.7...
[exec] got 249 hits for query "lucene"
[exec] generate javadocs w/ Java 7...
[exec]
[exec] Crawl/parse...
[exec]
[exec] Verify...
[exec]
[exec] Test Solr...
[exec] test basics...
[exec] get KEYS
[exec] 0.1 MB in 0.00 sec (101.5 MB/sec)
[exec] check changes HTML...
[exec] Traceback (most recent call last):
[exec] File "/usr/home/hudson/hudson-slave/workspace/Lucene-Solr-SmokeRelease-4.8/dev-tools/scripts/smokeTestRelease.py", line 1347, in <module>
[exec] main()
[exec] File "/usr/home/hudson/hudson-slave/workspace/Lucene-Solr-SmokeRelease-4.8/dev-tools/scripts/smokeTestRelease.py", line 1291, in main
[exec] smokeTest(baseURL, svnRevision, version, tmpDir, isSigned, testArgs)
[exec] File "/usr/home/hudson/hudson-slave/workspace/Lucene-Solr-SmokeRelease-4.8/dev-tools/scripts/smokeTestRelease.py", line 1333, in smokeTest
[exec] checkSigs('solr', solrPath, version, tmpDir, isSigned)
[exec] File "/usr/home/hudson/hudson-slave/workspace/Lucene-Solr-SmokeRelease-4.8/dev-tools/scripts/smokeTestRelease.py", line 410, in checkSigs
[exec] testChanges(project, version, changesURL)
[exec] File "/usr/home/hudson/hudson-slave/workspace/Lucene-Solr-SmokeRelease-4.8/dev-tools/scripts/smokeTestRelease.py", line 458, in testChanges
[exec] checkChangesContent(s, version, changesURL, project, True)
[exec] File "/usr/home/hudson/hudson-slave/workspace/Lucene-Solr-SmokeRelease-4.8/dev-tools/scripts/smokeTestRelease.py", line 485, in checkChangesContent
[exec] raise RuntimeError('incorrect issue (_ instead of -) in %s: %s' % (name, m.group(1)))
[exec] RuntimeError: incorrect issue (_ instead of -) in file:///usr/home/hudson/hudson-slave/workspace/Lucene-Solr-SmokeRelease-4.8/lucene/build/fakeRelease/solr/changes/Changes.html: SOLR_6029
BUILD FAILED
/usr/home/hudson/hudson-slave/workspace/Lucene-Solr-SmokeRelease-4.8/build.xml:387: exec returned: 1
Total time: 54 minutes 2 seconds
Build step 'Invoke Ant' marked build as failure
Email was triggered for: Failure
Sending email for trigger: Failure
[JENKINS] Lucene-Solr-SmokeRelease-4.8 - Build # 5 - Still Failing
Posted by Apache Jenkins Server <je...@builds.apache.org>.
Build: https://builds.apache.org/job/Lucene-Solr-SmokeRelease-4.8/5/
No tests ran.
Build Log:
[...truncated 52783 lines...]
prepare-release-no-sign:
[mkdir] Created dir: /usr/home/hudson/hudson-slave/workspace/Lucene-Solr-SmokeRelease-4.8/lucene/build/fakeRelease
[copy] Copying 431 files to /usr/home/hudson/hudson-slave/workspace/Lucene-Solr-SmokeRelease-4.8/lucene/build/fakeRelease/lucene
[copy] Copying 239 files to /usr/home/hudson/hudson-slave/workspace/Lucene-Solr-SmokeRelease-4.8/lucene/build/fakeRelease/solr
[exec] JAVA7_HOME is /home/hudson/tools/java/latest1.7
[exec] NOTE: output encoding is US-ASCII
[exec]
[exec] Load release URL "file:/usr/home/hudson/hudson-slave/workspace/Lucene-Solr-SmokeRelease-4.8/lucene/build/fakeRelease/"...
[exec]
[exec] Test Lucene...
[exec] test basics...
[exec] get KEYS
[exec] 0.1 MB in 0.01 sec (6.8 MB/sec)
[exec] check changes HTML...
[exec] download lucene-4.8.0-src.tgz...
[exec] 27.5 MB in 0.04 sec (672.4 MB/sec)
[exec] verify md5/sha1 digests
[exec] download lucene-4.8.0.tgz...
[exec] 61.3 MB in 0.16 sec (389.1 MB/sec)
[exec] verify md5/sha1 digests
[exec] download lucene-4.8.0.zip...
[exec] 70.9 MB in 0.08 sec (844.0 MB/sec)
[exec] verify md5/sha1 digests
[exec] unpack lucene-4.8.0.tgz...
[exec] verify JAR metadata/identity/no javax.* or java.* classes...
[exec] test demo with 1.7...
[exec] got 5687 hits for query "lucene"
[exec] check Lucene's javadoc JAR
[exec] unpack lucene-4.8.0.zip...
[exec] verify JAR metadata/identity/no javax.* or java.* classes...
[exec] test demo with 1.7...
[exec] got 5687 hits for query "lucene"
[exec] check Lucene's javadoc JAR
[exec] unpack lucene-4.8.0-src.tgz...
[exec] make sure no JARs/WARs in src dist...
[exec] run "ant validate"
[exec] run tests w/ Java 7 and testArgs='-Dtests.jettyConnector=Socket -Dtests.disableHdfs=true'...
[exec] test demo with 1.7...
[exec] got 249 hits for query "lucene"
[exec] generate javadocs w/ Java 7...
[exec]
[exec] Crawl/parse...
[exec]
[exec] Verify...
[exec]
[exec] Test Solr...
[exec] test basics...
[exec] get KEYS
[exec] 0.1 MB in 0.00 sec (54.3 MB/sec)
[exec] check changes HTML...
[exec] Traceback (most recent call last):
[exec] File "/usr/home/hudson/hudson-slave/workspace/Lucene-Solr-SmokeRelease-4.8/dev-tools/scripts/smokeTestRelease.py", line 1347, in <module>
[exec] main()
[exec] File "/usr/home/hudson/hudson-slave/workspace/Lucene-Solr-SmokeRelease-4.8/dev-tools/scripts/smokeTestRelease.py", line 1291, in main
[exec] smokeTest(baseURL, svnRevision, version, tmpDir, isSigned, testArgs)
[exec] File "/usr/home/hudson/hudson-slave/workspace/Lucene-Solr-SmokeRelease-4.8/dev-tools/scripts/smokeTestRelease.py", line 1333, in smokeTest
[exec] checkSigs('solr', solrPath, version, tmpDir, isSigned)
[exec] File "/usr/home/hudson/hudson-slave/workspace/Lucene-Solr-SmokeRelease-4.8/dev-tools/scripts/smokeTestRelease.py", line 410, in checkSigs
[exec] testChanges(project, version, changesURL)
[exec] File "/usr/home/hudson/hudson-slave/workspace/Lucene-Solr-SmokeRelease-4.8/dev-tools/scripts/smokeTestRelease.py", line 458, in testChanges
[exec] checkChangesContent(s, version, changesURL, project, True)
[exec] File "/usr/home/hudson/hudson-slave/workspace/Lucene-Solr-SmokeRelease-4.8/dev-tools/scripts/smokeTestRelease.py", line 485, in checkChangesContent
[exec] raise RuntimeError('incorrect issue (_ instead of -) in %s: %s' % (name, m.group(1)))
[exec] RuntimeError: incorrect issue (_ instead of -) in file:///usr/home/hudson/hudson-slave/workspace/Lucene-Solr-SmokeRelease-4.8/lucene/build/fakeRelease/solr/changes/Changes.html: SOLR_6029
BUILD FAILED
/usr/home/hudson/hudson-slave/workspace/Lucene-Solr-SmokeRelease-4.8/build.xml:387: exec returned: 1
Total time: 53 minutes 57 seconds
Build step 'Invoke Ant' marked build as failure
Email was triggered for: Failure
Sending email for trigger: Failure