You are viewing a plain text version of this content. The canonical link for it is here.
Posted to yarn-dev@hadoop.apache.org by Apache Jenkins Server <je...@builds.apache.org> on 2014/11/03 07:56:06 UTC
Failed: YARN-2505 PreCommit Build #5697
Jira: https://issues.apache.org/jira/browse/YARN-2505
Build: https://builds.apache.org/job/PreCommit-YARN-Build/5697/
###################################################################################
########################## LAST 60 LINES OF THE CONSOLE ###########################
[...truncated 3307 lines...]
{color:green}+1 overall{color}. Here are the results of testing the latest attachment
http://issues.apache.org/jira/secure/attachment/12678885/YARN-2505.11.patch
against trunk revision 27715ec.
{color:green}+1 @author{color}. The patch does not contain any @author tags.
{color:green}+1 tests included{color}. The patch appears to include 1 new or modified test files.
{color:green}+1 javac{color}. The applied patch does not increase the total number of javac compiler warnings.
{color:green}+1 javadoc{color}. There were no new javadoc warning messages.
{color:green}+1 eclipse:eclipse{color}. The patch built with eclipse:eclipse.
{color:green}+1 findbugs{color}. The patch does not introduce any new Findbugs (version 2.0.3) warnings.
{color:green}+1 release audit{color}. The applied patch does not increase the total number of release audit warnings.
{color:green}+1 core tests{color}. The patch passed unit tests in hadoop-yarn-project/hadoop-yarn/hadoop-yarn-server/hadoop-yarn-server-resourcemanager.
{color:green}+1 contrib tests{color}. The patch passed contrib unit tests.
Test results: https://builds.apache.org/job/PreCommit-YARN-Build/5697//testReport/
Console output: https://builds.apache.org/job/PreCommit-YARN-Build/5697//console
This message is automatically generated.
======================================================================
======================================================================
Adding comment to Jira.
======================================================================
======================================================================
Comment added.
88b68e79cf1142eb359db24082cbe0158b705acf logged out
======================================================================
======================================================================
Finished build.
======================================================================
======================================================================
Archiving artifacts
Sending artifact delta relative to PreCommit-YARN-Build #4749
Archived 15 artifacts
Archive block size is 32768
Received 0 blocks and 9041855 bytes
Compression is 0.0%
Took 4.8 sec
Description set: YARN-2505
Recording test results
No test report files were found. Configuration error?
Build step 'Publish JUnit test result report' changed build result to FAILURE
Email was triggered for: Failure
Sending email for trigger: Failure
###################################################################################
############################## FAILED TESTS (if any) ##############################
No tests ran.
Failed: YARN-2802 PreCommit Build #5705
Posted by Apache Jenkins Server <je...@builds.apache.org>.
Jira: https://issues.apache.org/jira/browse/YARN-2802
Build: https://builds.apache.org/job/PreCommit-YARN-Build/5705/
###################################################################################
########################## LAST 60 LINES OF THE CONSOLE ###########################
[...truncated 3382 lines...]
against trunk revision 734eeb4.
{color:green}+1 @author{color}. The patch does not contain any @author tags.
{color:green}+1 tests included{color}. The patch appears to include 5 new or modified test files.
{color:green}+1 javac{color}. The applied patch does not increase the total number of javac compiler warnings.
{color:green}+1 javadoc{color}. There were no new javadoc warning messages.
{color:green}+1 eclipse:eclipse{color}. The patch built with eclipse:eclipse.
{color:red}-1 findbugs{color}. The patch appears to introduce 1 new Findbugs (version 2.0.3) warnings.
{color:green}+1 release audit{color}. The applied patch does not increase the total number of release audit warnings.
{color:red}-1 core tests{color}. The following test timeouts occurred in hadoop-yarn-project/hadoop-yarn/hadoop-yarn-api hadoop-yarn-project/hadoop-yarn/hadoop-yarn-server/hadoop-yarn-server-resourcemanager:
org.apache.hadoop.yarn.server.resourcemanager.TestRMProxyUsersConf
{color:green}+1 contrib tests{color}. The patch passed contrib unit tests.
Test results: https://builds.apache.org/job/PreCommit-YARN-Build/5705//testReport/
Findbugs warnings: https://builds.apache.org/job/PreCommit-YARN-Build/5705//artifact/patchprocess/newPatchFindbugsWarningshadoop-yarn-server-resourcemanager.html
Console output: https://builds.apache.org/job/PreCommit-YARN-Build/5705//console
This message is automatically generated.
======================================================================
======================================================================
Adding comment to Jira.
======================================================================
======================================================================
Comment added.
368d85803072d9f103663de7afd133c94ca676d1 logged out
======================================================================
======================================================================
Finished build.
======================================================================
======================================================================
Build step 'Execute shell' marked build as failure
Archiving artifacts
Sending artifact delta relative to PreCommit-YARN-Build #4749
Archived 20 artifacts
Archive block size is 32768
Received 0 blocks and 9457253 bytes
Compression is 0.0%
Took 2.9 sec
[description-setter] Could not determine description.
Recording test results
Email was triggered for: Failure
Sending email for trigger: Failure
###################################################################################
############################## FAILED TESTS (if any) ##############################
No tests ran.
Failed: YARN-2505 PreCommit Build #5704
Posted by Apache Jenkins Server <je...@builds.apache.org>.
Jira: https://issues.apache.org/jira/browse/YARN-2505
Build: https://builds.apache.org/job/PreCommit-YARN-Build/5704/
###################################################################################
########################## LAST 60 LINES OF THE CONSOLE ###########################
[...truncated 3310 lines...]
{color:green}+1 overall{color}. Here are the results of testing the latest attachment
http://issues.apache.org/jira/secure/attachment/12679036/YARN-2505.14.patch
against trunk revision 237890f.
{color:green}+1 @author{color}. The patch does not contain any @author tags.
{color:green}+1 tests included{color}. The patch appears to include 1 new or modified test files.
{color:green}+1 javac{color}. The applied patch does not increase the total number of javac compiler warnings.
{color:green}+1 javadoc{color}. There were no new javadoc warning messages.
{color:green}+1 eclipse:eclipse{color}. The patch built with eclipse:eclipse.
{color:green}+1 findbugs{color}. The patch does not introduce any new Findbugs (version 2.0.3) warnings.
{color:green}+1 release audit{color}. The applied patch does not increase the total number of release audit warnings.
{color:green}+1 core tests{color}. The patch passed unit tests in hadoop-yarn-project/hadoop-yarn/hadoop-yarn-server/hadoop-yarn-server-resourcemanager.
{color:green}+1 contrib tests{color}. The patch passed contrib unit tests.
Test results: https://builds.apache.org/job/PreCommit-YARN-Build/5704//testReport/
Console output: https://builds.apache.org/job/PreCommit-YARN-Build/5704//console
This message is automatically generated.
======================================================================
======================================================================
Adding comment to Jira.
======================================================================
======================================================================
Comment added.
71153326b0f16a8d7ee38fb776fac8ad88c726bb logged out
======================================================================
======================================================================
Finished build.
======================================================================
======================================================================
Archiving artifacts
Sending artifact delta relative to PreCommit-YARN-Build #4749
Archived 15 artifacts
Archive block size is 32768
Received 0 blocks and 9041852 bytes
Compression is 0.0%
Took 3 sec
Description set: YARN-2505
Recording test results
No test report files were found. Configuration error?
Build step 'Publish JUnit test result report' changed build result to FAILURE
Email was triggered for: Failure
Sending email for trigger: Failure
###################################################################################
############################## FAILED TESTS (if any) ##############################
No tests ran.
Failed: YARN-2505 PreCommit Build #5703
Posted by Apache Jenkins Server <je...@builds.apache.org>.
Jira: https://issues.apache.org/jira/browse/YARN-2505
Build: https://builds.apache.org/job/PreCommit-YARN-Build/5703/
###################################################################################
########################## LAST 60 LINES OF THE CONSOLE ###########################
[...truncated 3318 lines...]
http://issues.apache.org/jira/secure/attachment/12679010/YARN-2505.13.patch
against trunk revision 67f13b5.
{color:green}+1 @author{color}. The patch does not contain any @author tags.
{color:green}+1 tests included{color}. The patch appears to include 1 new or modified test files.
{color:green}+1 javac{color}. The applied patch does not increase the total number of javac compiler warnings.
{color:green}+1 javadoc{color}. There were no new javadoc warning messages.
{color:green}+1 eclipse:eclipse{color}. The patch built with eclipse:eclipse.
{color:green}+1 findbugs{color}. The patch does not introduce any new Findbugs (version 2.0.3) warnings.
{color:green}+1 release audit{color}. The applied patch does not increase the total number of release audit warnings.
{color:red}-1 core tests{color}. The patch failed these unit tests in hadoop-yarn-project/hadoop-yarn/hadoop-yarn-server/hadoop-yarn-server-resourcemanager:
org.apache.hadoop.yarn.server.resourcemanager.scheduler.fair.TestFairScheduler
{color:green}+1 contrib tests{color}. The patch passed contrib unit tests.
Test results: https://builds.apache.org/job/PreCommit-YARN-Build/5703//testReport/
Console output: https://builds.apache.org/job/PreCommit-YARN-Build/5703//console
This message is automatically generated.
======================================================================
======================================================================
Adding comment to Jira.
======================================================================
======================================================================
Comment added.
bb3939084353f8c6067b2434cefc04ae5637c4eb logged out
======================================================================
======================================================================
Finished build.
======================================================================
======================================================================
Build step 'Execute shell' marked build as failure
Archiving artifacts
Sending artifact delta relative to PreCommit-YARN-Build #4749
Archived 15 artifacts
Archive block size is 32768
Received 0 blocks and 9041580 bytes
Compression is 0.0%
Took 2.6 sec
[description-setter] Could not determine description.
Recording test results
Email was triggered for: Failure
Sending email for trigger: Failure
###################################################################################
############################## FAILED TESTS (if any) ##############################
No tests ran.
Failed: YARN-2690 PreCommit Build #5702
Posted by Apache Jenkins Server <je...@builds.apache.org>.
Jira: https://issues.apache.org/jira/browse/YARN-2690
Build: https://builds.apache.org/job/PreCommit-YARN-Build/5702/
###################################################################################
########################## LAST 60 LINES OF THE CONSOLE ###########################
[...truncated 3315 lines...]
{color:red}-1 overall{color}. Here are the results of testing the latest attachment
http://issues.apache.org/jira/secure/attachment/12679005/YARN-2690.004.patch
against trunk revision 67f13b5.
{color:green}+1 @author{color}. The patch does not contain any @author tags.
{color:green}+1 tests included{color}. The patch appears to include 6 new or modified test files.
{color:red}-1 javac{color}. The applied patch generated 1267 javac compiler warnings (more than the trunk's current 1266 warnings).
{color:green}+1 javadoc{color}. There were no new javadoc warning messages.
{color:green}+1 eclipse:eclipse{color}. The patch built with eclipse:eclipse.
{color:green}+1 findbugs{color}. The patch does not introduce any new Findbugs (version 2.0.3) warnings.
{color:green}+1 release audit{color}. The applied patch does not increase the total number of release audit warnings.
{color:green}+1 core tests{color}. The patch passed unit tests in hadoop-yarn-project/hadoop-yarn/hadoop-yarn-server/hadoop-yarn-server-resourcemanager.
{color:green}+1 contrib tests{color}. The patch passed contrib unit tests.
Test results: https://builds.apache.org/job/PreCommit-YARN-Build/5702//testReport/
Javac warnings: https://builds.apache.org/job/PreCommit-YARN-Build/5702//artifact/patchprocess/diffJavacWarnings.txt
Console output: https://builds.apache.org/job/PreCommit-YARN-Build/5702//console
This message is automatically generated.
======================================================================
======================================================================
Adding comment to Jira.
======================================================================
======================================================================
Comment added.
617a5bfb18e2bafb8358ac60118e44b2edf017b6 logged out
======================================================================
======================================================================
Finished build.
======================================================================
======================================================================
Build step 'Execute shell' marked build as failure
Archiving artifacts
Sending artifact delta relative to PreCommit-YARN-Build #4749
Archived 16 artifacts
Archive block size is 32768
Received 0 blocks and 9041394 bytes
Compression is 0.0%
Took 2.8 sec
[description-setter] Could not determine description.
Recording test results
Email was triggered for: Failure
Sending email for trigger: Failure
###################################################################################
############################## FAILED TESTS (if any) ##############################
No tests ran.
Failed: YARN-2505 PreCommit Build #5701
Posted by Apache Jenkins Server <je...@builds.apache.org>.
Jira: https://issues.apache.org/jira/browse/YARN-2505
Build: https://builds.apache.org/job/PreCommit-YARN-Build/5701/
###################################################################################
########################## LAST 60 LINES OF THE CONSOLE ###########################
[...truncated 3310 lines...]
{color:green}+1 overall{color}. Here are the results of testing the latest attachment
http://issues.apache.org/jira/secure/attachment/12678993/YARN-2505.12.patch
against trunk revision 67f13b5.
{color:green}+1 @author{color}. The patch does not contain any @author tags.
{color:green}+1 tests included{color}. The patch appears to include 1 new or modified test files.
{color:green}+1 javac{color}. The applied patch does not increase the total number of javac compiler warnings.
{color:green}+1 javadoc{color}. There were no new javadoc warning messages.
{color:green}+1 eclipse:eclipse{color}. The patch built with eclipse:eclipse.
{color:green}+1 findbugs{color}. The patch does not introduce any new Findbugs (version 2.0.3) warnings.
{color:green}+1 release audit{color}. The applied patch does not increase the total number of release audit warnings.
{color:green}+1 core tests{color}. The patch passed unit tests in hadoop-yarn-project/hadoop-yarn/hadoop-yarn-server/hadoop-yarn-server-resourcemanager.
{color:green}+1 contrib tests{color}. The patch passed contrib unit tests.
Test results: https://builds.apache.org/job/PreCommit-YARN-Build/5701//testReport/
Console output: https://builds.apache.org/job/PreCommit-YARN-Build/5701//console
This message is automatically generated.
======================================================================
======================================================================
Adding comment to Jira.
======================================================================
======================================================================
Comment added.
d7a21c7b06ae5968bfc3adb2d561ded5359f0b6d logged out
======================================================================
======================================================================
Finished build.
======================================================================
======================================================================
Archiving artifacts
Sending artifact delta relative to PreCommit-YARN-Build #4749
Archived 15 artifacts
Archive block size is 32768
Received 0 blocks and 9042082 bytes
Compression is 0.0%
Took 4.7 sec
Description set: YARN-2505
Recording test results
No test report files were found. Configuration error?
Build step 'Publish JUnit test result report' changed build result to FAILURE
Email was triggered for: Failure
Sending email for trigger: Failure
###################################################################################
############################## FAILED TESTS (if any) ##############################
No tests ran.
Failed: YARN-1922 PreCommit Build #5700
Posted by Apache Jenkins Server <je...@builds.apache.org>.
Jira: https://issues.apache.org/jira/browse/YARN-1922
Build: https://builds.apache.org/job/PreCommit-YARN-Build/5700/
###################################################################################
########################## LAST 60 LINES OF THE CONSOLE ###########################
[...truncated 3326 lines...]
{color:green}+1 overall{color}. Here are the results of testing the latest attachment
http://issues.apache.org/jira/secure/attachment/12678987/YARN-1922.6.patch
against trunk revision 67f13b5.
{color:green}+1 @author{color}. The patch does not contain any @author tags.
{color:green}+1 tests included{color}. The patch appears to include 1 new or modified test files.
{color:green}+1 javac{color}. The applied patch does not increase the total number of javac compiler warnings.
{color:green}+1 javadoc{color}. There were no new javadoc warning messages.
{color:green}+1 eclipse:eclipse{color}. The patch built with eclipse:eclipse.
{color:green}+1 findbugs{color}. The patch does not introduce any new Findbugs (version 2.0.3) warnings.
{color:green}+1 release audit{color}. The applied patch does not increase the total number of release audit warnings.
{color:green}+1 core tests{color}. The patch passed unit tests in hadoop-yarn-project/hadoop-yarn/hadoop-yarn-server/hadoop-yarn-server-nodemanager.
{color:green}+1 contrib tests{color}. The patch passed contrib unit tests.
Test results: https://builds.apache.org/job/PreCommit-YARN-Build/5700//testReport/
Console output: https://builds.apache.org/job/PreCommit-YARN-Build/5700//console
This message is automatically generated.
======================================================================
======================================================================
Adding comment to Jira.
======================================================================
======================================================================
Comment added.
9cc1174bfa8d36e3d3505e5528b77b4e52116e73 logged out
======================================================================
======================================================================
Finished build.
======================================================================
======================================================================
Archiving artifacts
Sending artifact delta relative to PreCommit-YARN-Build #4749
Archived 15 artifacts
Archive block size is 32768
Received 0 blocks and 8967219 bytes
Compression is 0.0%
Took 2.9 sec
Description set: YARN-1922
Recording test results
No test report files were found. Configuration error?
Build step 'Publish JUnit test result report' changed build result to FAILURE
Email was triggered for: Failure
Sending email for trigger: Failure
###################################################################################
############################## FAILED TESTS (if any) ##############################
No tests ran.
Failed: YARN-2730 PreCommit Build #5699
Posted by Apache Jenkins Server <je...@builds.apache.org>.
Jira: https://issues.apache.org/jira/browse/YARN-2730
Build: https://builds.apache.org/job/PreCommit-YARN-Build/5699/
###################################################################################
########################## LAST 60 LINES OF THE CONSOLE ###########################
[...truncated 3323 lines...]
http://issues.apache.org/jira/secure/attachment/12678985/YARN-2730.v3.patch
against trunk revision 67f13b5.
{color:green}+1 @author{color}. The patch does not contain any @author tags.
{color:red}-1 tests included{color}. The patch doesn't appear to include any new or modified tests.
Please justify why no new tests are needed for this patch.
Also please list what manual steps were performed to verify this patch.
{color:green}+1 javac{color}. The applied patch does not increase the total number of javac compiler warnings.
{color:green}+1 javadoc{color}. There were no new javadoc warning messages.
{color:green}+1 eclipse:eclipse{color}. The patch built with eclipse:eclipse.
{color:green}+1 findbugs{color}. The patch does not introduce any new Findbugs (version 2.0.3) warnings.
{color:green}+1 release audit{color}. The applied patch does not increase the total number of release audit warnings.
{color:green}+1 core tests{color}. The patch passed unit tests in hadoop-yarn-project/hadoop-yarn/hadoop-yarn-server/hadoop-yarn-server-nodemanager.
{color:green}+1 contrib tests{color}. The patch passed contrib unit tests.
Test results: https://builds.apache.org/job/PreCommit-YARN-Build/5699//testReport/
Console output: https://builds.apache.org/job/PreCommit-YARN-Build/5699//console
This message is automatically generated.
======================================================================
======================================================================
Adding comment to Jira.
======================================================================
======================================================================
Comment added.
999c49174875c5eadb1f9f4e25125eab79d5dbc2 logged out
======================================================================
======================================================================
Finished build.
======================================================================
======================================================================
Build step 'Execute shell' marked build as failure
Archiving artifacts
Sending artifact delta relative to PreCommit-YARN-Build #4749
Archived 15 artifacts
Archive block size is 32768
Received 0 blocks and 8967208 bytes
Compression is 0.0%
Took 2.3 sec
[description-setter] Could not determine description.
Recording test results
Email was triggered for: Failure
Sending email for trigger: Failure
###################################################################################
############################## FAILED TESTS (if any) ##############################
No tests ran.
Failed: YARN-2571 PreCommit Build #5698
Posted by Apache Jenkins Server <je...@builds.apache.org>.
Jira: https://issues.apache.org/jira/browse/YARN-2571
Build: https://builds.apache.org/job/PreCommit-YARN-Build/5698/
###################################################################################
########################## LAST 60 LINES OF THE CONSOLE ###########################
[...truncated 3522 lines...]
{color:green}+1 overall{color}. Here are the results of testing the latest attachment
http://issues.apache.org/jira/secure/attachment/12678960/YARN-2571-008.patch
against trunk revision 67f13b5.
{color:green}+1 @author{color}. The patch does not contain any @author tags.
{color:green}+1 tests included{color}. The patch appears to include 16 new or modified test files.
{color:green}+1 javac{color}. The applied patch does not increase the total number of javac compiler warnings.
{color:green}+1 javadoc{color}. There were no new javadoc warning messages.
{color:green}+1 eclipse:eclipse{color}. The patch built with eclipse:eclipse.
{color:green}+1 findbugs{color}. The patch does not introduce any new Findbugs (version 2.0.3) warnings.
{color:green}+1 release audit{color}. The applied patch does not increase the total number of release audit warnings.
{color:green}+1 core tests{color}. The patch passed unit tests in hadoop-yarn-project/hadoop-yarn/hadoop-yarn-registry hadoop-yarn-project/hadoop-yarn/hadoop-yarn-server/hadoop-yarn-server-common hadoop-yarn-project/hadoop-yarn/hadoop-yarn-server/hadoop-yarn-server-resourcemanager.
{color:green}+1 contrib tests{color}. The patch passed contrib unit tests.
Test results: https://builds.apache.org/job/PreCommit-YARN-Build/5698//testReport/
Console output: https://builds.apache.org/job/PreCommit-YARN-Build/5698//console
This message is automatically generated.
======================================================================
======================================================================
Adding comment to Jira.
======================================================================
======================================================================
Comment added.
6d7357a0af5c9980ba7ffa9674eff1548bea2bc7 logged out
======================================================================
======================================================================
Finished build.
======================================================================
======================================================================
Archiving artifacts
Sending artifact delta relative to PreCommit-YARN-Build #4749
Archived 25 artifacts
Archive block size is 32768
Received 0 blocks and 9240257 bytes
Compression is 0.0%
Took 2.1 sec
Description set: YARN-2571
Recording test results
No test report files were found. Configuration error?
Build step 'Publish JUnit test result report' changed build result to FAILURE
Email was triggered for: Failure
Sending email for trigger: Failure
###################################################################################
############################## FAILED TESTS (if any) ##############################
No tests ran.