You are viewing a plain text version of this content. The canonical link for it is here.
Posted to builds@lucene.apache.org by Policeman Jenkins Server <je...@thetaphi.de> on 2025/07/04 08:53:46 UTC

[JENKINS] Lucene-nightly-main-Linux (64bit/hotspot/jdk-24) - Build # 341 - Unstable!

Build: https://jenkins.thetaphi.de/job/Lucene-nightly-main-Linux/341/
Java: 64bit/hotspot/jdk-24 -XX:-UseCompressedOops -XX:+UseParallelGC

2 tests failed.
FAILED:  org.apache.lucene.search.TestSearcherManager.classMethod

Error Message:
java.lang.AssertionError: The test or suite printed 15409 bytes to stdout and stderr, even though the limit was set to 8192 bytes. Increase the limit with @Limit, ignore it completely with @SuppressSysoutChecks or run with -Dtests.verbose=true

Stack Trace:
java.lang.AssertionError: The test or suite printed 15409 bytes to stdout and stderr, even though the limit was set to 8192 bytes. Increase the limit with @Limit, ignore it completely with @SuppressSysoutChecks or run with -Dtests.verbose=true
	at __randomizedtesting.SeedInfo.seed([2428CD383257AA0A]:0)
	at org.apache.lucene.tests.util.TestRuleLimitSysouts.afterIfSuccessful(TestRuleLimitSysouts.java:283)
	at com.carrotsearch.randomizedtesting.rules.TestRuleAdapter$1.afterIfSuccessful(TestRuleAdapter.java:36)
	at com.carrotsearch.randomizedtesting.rules.StatementAdapter.evaluate(StatementAdapter.java:37)
	at org.apache.lucene.tests.util.TestRuleAssertionsRequired$1.evaluate(TestRuleAssertionsRequired.java:53)
	at org.apache.lucene.tests.util.AbstractBeforeAfterRule$1.evaluate(AbstractBeforeAfterRule.java:43)
	at org.apache.lucene.tests.util.TestRuleMarkFailure$1.evaluate(TestRuleMarkFailure.java:44)
	at org.apache.lucene.tests.util.TestRuleIgnoreAfterMaxFailures$1.evaluate(TestRuleIgnoreAfterMaxFailures.java:60)
	at org.apache.lucene.tests.util.TestRuleIgnoreTestSuites$1.evaluate(TestRuleIgnoreTestSuites.java:47)
	at org.junit.rules.RunRules.evaluate(RunRules.java:20)
	at com.carrotsearch.randomizedtesting.rules.StatementAdapter.evaluate(StatementAdapter.java:36)
	at com.carrotsearch.randomizedtesting.ThreadLeakControl$StatementRunner.run(ThreadLeakControl.java:390)
	at com.carrotsearch.randomizedtesting.ThreadLeakControl.lambda$forkTimeoutingTask$0(ThreadLeakControl.java:850)
	at java.base/java.lang.Thread.run(Thread.java:1447)


FAILED:  org.apache.lucene.search.TestSearcherManager.testConcurrentIndexCloseSearchAndRefresh

Error Message:
com.carrotsearch.randomizedtesting.UncaughtExceptionError: Captured an uncaught exception in thread: Thread[id=15156, name=Lucene Merge Thread #8, state=RUNNABLE, group=TGRP-TestSearcherManager]

Stack Trace:
com.carrotsearch.randomizedtesting.UncaughtExceptionError: Captured an uncaught exception in thread: Thread[id=15156, name=Lucene Merge Thread #8, state=RUNNABLE, group=TGRP-TestSearcherManager]
Caused by: org.apache.lucene.index.MergePolicy$MergeException: java.lang.IllegalStateException: this writer hit an unrecoverable error; cannot merge
	at __randomizedtesting.SeedInfo.seed([2428CD383257AA0A]:0)
	at app//org.apache.lucene.index.ConcurrentMergeScheduler.handleMergeException(ConcurrentMergeScheduler.java:764)
	at app//org.apache.lucene.index.ConcurrentMergeScheduler$MergeThread.run(ConcurrentMergeScheduler.java:756)
Caused by: java.lang.IllegalStateException: this writer hit an unrecoverable error; cannot merge
	at org.apache.lucene.index.IndexWriter.hasPendingMerges(IndexWriter.java:2430)
	at org.apache.lucene.index.IndexWriter$IndexWriterMergeSource.hasPendingMerges(IndexWriter.java:6518)
	at org.apache.lucene.index.ConcurrentMergeScheduler.maybeStall(ConcurrentMergeScheduler.java:618)
	at org.apache.lucene.index.ConcurrentMergeScheduler.merge(ConcurrentMergeScheduler.java:569)
	at org.apache.lucene.index.ConcurrentMergeScheduler.runOnMergeFinished(ConcurrentMergeScheduler.java:687)
	at org.apache.lucene.index.ConcurrentMergeScheduler$MergeThread.run(ConcurrentMergeScheduler.java:745)
Caused by: java.nio.file.FileSystemException: /home/jenkins/workspace/Lucene-nightly-main-Linux/lucene/core/build/tests-tmp/lucene.search.TestSearcherManager_2428CD383257AA0A-001/tempDir-001/_si_Lucene90FieldsIndex-doc_ids_3ay.tmp: Too many open files
	at org.apache.lucene.tests.mockfile.HandleLimitFS.onOpen(HandleLimitFS.java:67)
	at org.apache.lucene.tests.mockfile.HandleTrackingFS.callOpenHook(HandleTrackingFS.java:82)
	at org.apache.lucene.tests.mockfile.HandleTrackingFS.newOutputStream(HandleTrackingFS.java:163)
	at org.apache.lucene.tests.mockfile.FilterFileSystemProvider.newOutputStream(FilterFileSystemProvider.java:200)
	at java.base/java.nio.file.Files.newOutputStream(Files.java:215)
	at org.apache.lucene.store.FSDirectory$FSIndexOutput.<init>(FSDirectory.java:389)
	at org.apache.lucene.store.FSDirectory.createTempOutput(FSDirectory.java:229)
	at org.apache.lucene.tests.store.MockDirectoryWrapper.createTempOutput(MockDirectoryWrapper.java:753)
	at org.apache.lucene.store.FilterDirectory.createTempOutput(FilterDirectory.java:81)
	at org.apache.lucene.store.TrackingDirectoryWrapper.createTempOutput(TrackingDirectoryWrapper.java:49)
	at org.apache.lucene.codecs.lucene90.compressing.FieldsIndexWriter.<init>(FieldsIndexWriter.java:83)
	at org.apache.lucene.codecs.lucene90.compressing.Lucene90CompressingStoredFieldsWriter.<init>(Lucene90CompressingStoredFieldsWriter.java:151)
	at org.apache.lucene.codecs.lucene90.compressing.Lucene90CompressingStoredFieldsFormat.fieldsWriter(Lucene90CompressingStoredFieldsFormat.java:140)
	at org.apache.lucene.codecs.lucene90.Lucene90StoredFieldsFormat.fieldsWriter(Lucene90StoredFieldsFormat.java:154)
	at org.apache.lucene.tests.codecs.asserting.AssertingStoredFieldsFormat.fieldsWriter(AssertingStoredFieldsFormat.java:49)
	at org.apache.lucene.index.StoredFieldsConsumer.initStoredFieldsWriter(StoredFieldsConsumer.java:50)
	at org.apache.lucene.index.StoredFieldsConsumer.startDocument(StoredFieldsConsumer.java:57)
	at org.apache.lucene.index.IndexingChain.startStoredFields(IndexingChain.java:544)
	at org.apache.lucene.index.IndexingChain.processDocument(IndexingChain.java:575)
	at org.apache.lucene.index.DocumentsWriterPerThread.updateDocuments(DocumentsWriterPerThread.java:274)
	at org.apache.lucene.index.DocumentsWriter.updateDocuments(DocumentsWriter.java:425)
	at org.apache.lucene.index.IndexWriter.updateDocuments(IndexWriter.java:1557)
	at org.apache.lucene.index.IndexWriter.updateDocument(IndexWriter.java:1839)
	at org.apache.lucene.index.IndexWriter.addDocument(IndexWriter.java:1483)
	at org.apache.lucene.search.TestSearcherManager$8.run(TestSearcherManager.java:621)